libvirt List Archives
Sign In Sign Up
Manage this list Sign In Sign Up

Keyboard Shortcuts

Thread View

  • j: Next unread message
  • k: Previous unread message
  • j a: Jump to all threads
  • j l: Jump to MailingList overview

CI

Thread Start a new thread
Download
Threads by month
  • ----- 2025 -----
  • August
  • July
  • June
  • May
  • April
  • March
  • February
  • January
  • ----- 2024 -----
  • December
  • November
  • October
  • September
  • August
  • July
  • June
  • May
  • April
  • March
  • February
  • January
  • ----- 2023 -----
  • December
  • November
  • October
  • September
  • August
  • July
  • June
  • May
  • April
  • March
  • February
  • January
  • ----- 2022 -----
  • December
  • November
  • October
  • September
  • August
  • July
  • June
  • May
  • April
  • March
  • February
  • January
  • ----- 2021 -----
  • December
  • November
  • October
  • September
  • August
  • July
  • June
  • May
  • April
  • March
  • February
  • January
  • ----- 2020 -----
  • December
  • November
  • October
  • September
  • August
  • July
  • June
  • May
  • April
  • March
  • February
  • January
  • ----- 2019 -----
  • December
  • November
  • October
  • September
  • August
  • July
  • June
  • May
  • April
  • March
  • February
  • January
  • ----- 2018 -----
  • December
  • November
  • October
  • September
  • August
  • July
  • June
  • May
  • April
  • March
  • February
  • January
  • ----- 2017 -----
  • December
  • November
  • October
  • September
  • August
  • July
  • June
  • May
  • April
  • March
  • February
  • January
  • ----- 2016 -----
  • December
  • November
  • October
  • September
  • August
  • July
ci@lists.libvirt.org

June 2020

  • 3 participants
  • 74 discussions
libvirt | Pipeline #152492144 has failed for master | ec07aad8
by GitLab 03 Jun '20

03 Jun '20
Your pipeline has failed. Project: libvirt ( https://gitlab.com/libvirt/libvirt ) Branch: master ( https://gitlab.com/libvirt/libvirt/-/commits/master ) Commit: ec07aad8 ( https://gitlab.com/libvirt/libvirt/-/commit/ec07aad8f8a6ead8e9363c8deec4845… ) Commit Message: libxl: Normalize MAC address in device conf whe... Commit Author: Jim Fehlig ( https://gitlab.com/jfehlig ) Pipeline #152492144 ( https://gitlab.com/libvirt/libvirt/-/pipelines/152492144 ) triggered by Jim Fehlig ( https://gitlab.com/jfehlig ) had 5 failed builds. Job #579515450 ( https://gitlab.com/libvirt/libvirt/-/jobs/579515450/raw ) Stage: cross_build Name: mips-debian-9 Trace: ../../src/conf/domain_event.c:1785:34: error: cast increases required alignment of target type [-Werror=cast-align] balloonChangeEvent = (virDomainEventBalloonChangePtr)event; ^ ../../src/conf/domain_event.c:1896:35: error: cast increases required alignment of target type [-Werror=cast-align] blockThresholdEvent = (virDomainEventBlockThresholdPtr)event; ^ ../../src/conf/domain_event.c: In function 'virDomainQemuMonitorEventDispatchFunc': ../../src/conf/domain_event.c:1974:24: error: cast increases required alignment of target type [-Werror=cast-align] qemuMonitorEvent = (virDomainQemuMonitorEventPtr)event; ^ ../../src/conf/domain_event.c: In function 'virDomainQemuMonitorEventFilter': ../../src/conf/domain_event.c:2179:20: error: cast increases required alignment of target type [-Werror=cast-align] monitorEvent = (virDomainQemuMonitorEventPtr) event; ^ cc1: all warnings being treated as errors Makefile:8525: recipe for target 'conf/libvirt_conf_la-domain_event.lo' failed make[3]: *** [conf/libvirt_conf_la-domain_event.lo] Error 1 make[3]: Leaving directory '/builds/libvirt/libvirt/build/src' Makefile:5995: recipe for target 'all' failed make[2]: *** [all] Error 2 make[2]: Leaving directory '/builds/libvirt/libvirt/build/src' Makefile:777: recipe for target 'all-recursive' failed make[1]: *** [all-recursive] Error 1 make[1]: Leaving directory '/builds/libvirt/libvirt/build' Makefile:670: recipe for target 'all' failed make: *** [all] Error 2 section_end:1591198547:build_script section_start:1591198547:after_script Running after_script section_end:1591198548:after_script section_start:1591198548:upload_artifacts_on_failure Uploading artifacts for failed job section_end:1591198550:upload_artifacts_on_failure ERROR: Job failed: exit code 1  Job #579515457 ( https://gitlab.com/libvirt/libvirt/-/jobs/579515457/raw ) Stage: cross_build Name: mingw32-fedora-rawhide Trace: ../../src/conf/domain_event.c: In function 'virDomainEventDispatchDefaultFunc': ../../src/conf/domain_event.c:1656:30: error: cast increases required alignment of target type [-Werror=cast-align] 1656 | rtcChangeEvent = (virDomainEventRTCChangePtr)event; | ^ ../../src/conf/domain_event.c:1785:34: error: cast increases required alignment of target type [-Werror=cast-align] 1785 | balloonChangeEvent = (virDomainEventBalloonChangePtr)event; | ^ ../../src/conf/domain_event.c:1896:35: error: cast increases required alignment of target type [-Werror=cast-align] 1896 | blockThresholdEvent = (virDomainEventBlockThresholdPtr)event; | ^ ../../src/conf/domain_event.c: In function 'virDomainQemuMonitorEventDispatchFunc': ../../src/conf/domain_event.c:1974:24: error: cast increases required alignment of target type [-Werror=cast-align] 1974 | qemuMonitorEvent = (virDomainQemuMonitorEventPtr)event; | ^ ../../src/conf/domain_event.c: In function 'virDomainQemuMonitorEventFilter': ../../src/conf/domain_event.c:2179:20: error: cast increases required alignment of target type [-Werror=cast-align] 2179 | monitorEvent = (virDomainQemuMonitorEventPtr) event; | ^ cc1: all warnings being treated as errors make[3]: *** [Makefile:8979: conf/libvirt_conf_la-domain_event.lo] Error 1 make[3]: Leaving directory '/builds/libvirt/libvirt/build/src' make[2]: *** [Makefile:6443: all] Error 2 make[2]: Leaving directory '/builds/libvirt/libvirt/build/src' make[1]: *** [Makefile:777: all-recursive] Error 1 make[1]: Leaving directory '/builds/libvirt/libvirt/build' make: *** [Makefile:670: all] Error 2 section_end:1591198533:build_script section_start:1591198533:after_script Running after_script section_end:1591198534:after_script section_start:1591198534:upload_artifacts_on_failure Uploading artifacts for failed job section_end:1591198536:upload_artifacts_on_failure ERROR: Job failed: exit code 1  Job #579515448 ( https://gitlab.com/libvirt/libvirt/-/jobs/579515448/raw ) Stage: cross_build Name: armv6l-debian-9 Trace: ../../src/conf/domain_event.c:1785:34: error: cast increases required alignment of target type [-Werror=cast-align] balloonChangeEvent = (virDomainEventBalloonChangePtr)event; ^ ../../src/conf/domain_event.c:1896:35: error: cast increases required alignment of target type [-Werror=cast-align] blockThresholdEvent = (virDomainEventBlockThresholdPtr)event; ^ ../../src/conf/domain_event.c: In function 'virDomainQemuMonitorEventDispatchFunc': ../../src/conf/domain_event.c:1974:24: error: cast increases required alignment of target type [-Werror=cast-align] qemuMonitorEvent = (virDomainQemuMonitorEventPtr)event; ^ ../../src/conf/domain_event.c: In function 'virDomainQemuMonitorEventFilter': ../../src/conf/domain_event.c:2179:20: error: cast increases required alignment of target type [-Werror=cast-align] monitorEvent = (virDomainQemuMonitorEventPtr) event; ^ cc1: all warnings being treated as errors Makefile:8525: recipe for target 'conf/libvirt_conf_la-domain_event.lo' failed make[3]: *** [conf/libvirt_conf_la-domain_event.lo] Error 1 make[3]: Leaving directory '/builds/libvirt/libvirt/build/src' Makefile:5995: recipe for target 'all' failed make[2]: *** [all] Error 2 make[2]: Leaving directory '/builds/libvirt/libvirt/build/src' Makefile:777: recipe for target 'all-recursive' failed make[1]: *** [all-recursive] Error 1 make[1]: Leaving directory '/builds/libvirt/libvirt/build' Makefile:670: recipe for target 'all' failed make: *** [all] Error 2 section_end:1591198529:build_script section_start:1591198529:after_script Running after_script section_end:1591198531:after_script section_start:1591198531:upload_artifacts_on_failure Uploading artifacts for failed job section_end:1591198532:upload_artifacts_on_failure ERROR: Job failed: exit code 1  Job #579515456 ( https://gitlab.com/libvirt/libvirt/-/jobs/579515456/raw ) Stage: cross_build Name: mipsel-debian-sid Trace: ../../src/conf/domain_event.c: In function 'virDomainEventDispatchDefaultFunc': ../../src/conf/domain_event.c:1656:30: error: cast increases required alignment of target type [-Werror=cast-align] 1656 | rtcChangeEvent = (virDomainEventRTCChangePtr)event; | ^ ../../src/conf/domain_event.c:1785:34: error: cast increases required alignment of target type [-Werror=cast-align] 1785 | balloonChangeEvent = (virDomainEventBalloonChangePtr)event; | ^ ../../src/conf/domain_event.c:1896:35: error: cast increases required alignment of target type [-Werror=cast-align] 1896 | blockThresholdEvent = (virDomainEventBlockThresholdPtr)event; | ^ ../../src/conf/domain_event.c: In function 'virDomainQemuMonitorEventDispatchFunc': ../../src/conf/domain_event.c:1974:24: error: cast increases required alignment of target type [-Werror=cast-align] 1974 | qemuMonitorEvent = (virDomainQemuMonitorEventPtr)event; | ^ ../../src/conf/domain_event.c: In function 'virDomainQemuMonitorEventFilter': ../../src/conf/domain_event.c:2179:20: error: cast increases required alignment of target type [-Werror=cast-align] 2179 | monitorEvent = (virDomainQemuMonitorEventPtr) event; | ^ cc1: all warnings being treated as errors make[3]: *** [Makefile:8979: conf/libvirt_conf_la-domain_event.lo] Error 1 make[3]: Leaving directory '/builds/libvirt/libvirt/build/src' make[2]: *** [Makefile:6443: all] Error 2 make[2]: Leaving directory '/builds/libvirt/libvirt/build/src' make[1]: *** [Makefile:777: all-recursive] Error 1 make[1]: Leaving directory '/builds/libvirt/libvirt/build' make: *** [Makefile:670: all] Error 2 section_end:1591198510:build_script section_start:1591198510:after_script Running after_script section_end:1591198511:after_script section_start:1591198511:upload_artifacts_on_failure Uploading artifacts for failed job section_end:1591198513:upload_artifacts_on_failure ERROR: Job failed: exit code 1  Job #579515454 ( https://gitlab.com/libvirt/libvirt/-/jobs/579515454/raw ) Stage: cross_build Name: armv7l-debian-sid Trace: ../../src/conf/domain_event.c: In function 'virDomainEventDispatchDefaultFunc': ../../src/conf/domain_event.c:1656:30: error: cast increases required alignment of target type [-Werror=cast-align] 1656 | rtcChangeEvent = (virDomainEventRTCChangePtr)event; | ^ ../../src/conf/domain_event.c:1785:34: error: cast increases required alignment of target type [-Werror=cast-align] 1785 | balloonChangeEvent = (virDomainEventBalloonChangePtr)event; | ^ ../../src/conf/domain_event.c:1896:35: error: cast increases required alignment of target type [-Werror=cast-align] 1896 | blockThresholdEvent = (virDomainEventBlockThresholdPtr)event; | ^ ../../src/conf/domain_event.c: In function 'virDomainQemuMonitorEventDispatchFunc': ../../src/conf/domain_event.c:1974:24: error: cast increases required alignment of target type [-Werror=cast-align] 1974 | qemuMonitorEvent = (virDomainQemuMonitorEventPtr)event; | ^ ../../src/conf/domain_event.c: In function 'virDomainQemuMonitorEventFilter': ../../src/conf/domain_event.c:2179:20: error: cast increases required alignment of target type [-Werror=cast-align] 2179 | monitorEvent = (virDomainQemuMonitorEventPtr) event; | ^ cc1: all warnings being treated as errors make[3]: *** [Makefile:8979: conf/libvirt_conf_la-domain_event.lo] Error 1 make[3]: Leaving directory '/builds/libvirt/libvirt/build/src' make[2]: *** [Makefile:6443: all] Error 2 make[2]: Leaving directory '/builds/libvirt/libvirt/build/src' make[1]: *** [Makefile:777: all-recursive] Error 1 make[1]: Leaving directory '/builds/libvirt/libvirt/build' make: *** [Makefile:670: all] Error 2 section_end:1591198496:build_script section_start:1591198496:after_script Running after_script section_end:1591198497:after_script section_start:1591198497:upload_artifacts_on_failure Uploading artifacts for failed job section_end:1591198499:upload_artifacts_on_failure ERROR: Job failed: exit code 1  -- You're receiving this email because of your account on gitlab.com.
1 0
0 0
libvirt | Pipeline #152469038 has failed for master | 8915c9cb
by GitLab 03 Jun '20

03 Jun '20
Your pipeline has failed. Project: libvirt ( https://gitlab.com/libvirt/libvirt ) Branch: master ( https://gitlab.com/libvirt/libvirt/-/commits/master ) Commit: 8915c9cb ( https://gitlab.com/libvirt/libvirt/-/commit/8915c9cb1fee0089ae98ebecd8673e0… ) Commit Message: autogen.sh: Restore --no-git (avoid git submodu... Commit Author: Ian Jackson Committed by: Pavel Hrdina ( https://gitlab.com/phrdina ) Pipeline #152469038 ( https://gitlab.com/libvirt/libvirt/-/pipelines/152469038 ) triggered by Pavel Hrdina ( https://gitlab.com/phrdina ) had 5 failed builds. Job #579408663 ( https://gitlab.com/libvirt/libvirt/-/jobs/579408663/raw ) Stage: cross_build Name: mingw32-fedora-rawhide Trace: ../../src/conf/domain_event.c: In function 'virDomainEventDispatchDefaultFunc': ../../src/conf/domain_event.c:1656:30: error: cast increases required alignment of target type [-Werror=cast-align] 1656 | rtcChangeEvent = (virDomainEventRTCChangePtr)event; | ^ ../../src/conf/domain_event.c:1785:34: error: cast increases required alignment of target type [-Werror=cast-align] 1785 | balloonChangeEvent = (virDomainEventBalloonChangePtr)event; | ^ ../../src/conf/domain_event.c:1896:35: error: cast increases required alignment of target type [-Werror=cast-align] 1896 | blockThresholdEvent = (virDomainEventBlockThresholdPtr)event; | ^ ../../src/conf/domain_event.c: In function 'virDomainQemuMonitorEventDispatchFunc': ../../src/conf/domain_event.c:1974:24: error: cast increases required alignment of target type [-Werror=cast-align] 1974 | qemuMonitorEvent = (virDomainQemuMonitorEventPtr)event; | ^ ../../src/conf/domain_event.c: In function 'virDomainQemuMonitorEventFilter': ../../src/conf/domain_event.c:2179:20: error: cast increases required alignment of target type [-Werror=cast-align] 2179 | monitorEvent = (virDomainQemuMonitorEventPtr) event; | ^ cc1: all warnings being treated as errors make[3]: *** [Makefile:8979: conf/libvirt_conf_la-domain_event.lo] Error 1 make[3]: Leaving directory '/builds/libvirt/libvirt/build/src' make[2]: *** [Makefile:6443: all] Error 2 make[2]: Leaving directory '/builds/libvirt/libvirt/build/src' make[1]: *** [Makefile:777: all-recursive] Error 1 make[1]: Leaving directory '/builds/libvirt/libvirt/build' make: *** [Makefile:670: all] Error 2 section_end:1591195541:build_script section_start:1591195541:after_script Running after_script section_end:1591195542:after_script section_start:1591195542:upload_artifacts_on_failure Uploading artifacts for failed job section_end:1591195544:upload_artifacts_on_failure ERROR: Job failed: exit code 1  Job #579408656 ( https://gitlab.com/libvirt/libvirt/-/jobs/579408656/raw ) Stage: cross_build Name: mips-debian-9 Trace: ../../src/conf/domain_event.c:1785:34: error: cast increases required alignment of target type [-Werror=cast-align] balloonChangeEvent = (virDomainEventBalloonChangePtr)event; ^ ../../src/conf/domain_event.c:1896:35: error: cast increases required alignment of target type [-Werror=cast-align] blockThresholdEvent = (virDomainEventBlockThresholdPtr)event; ^ ../../src/conf/domain_event.c: In function 'virDomainQemuMonitorEventDispatchFunc': ../../src/conf/domain_event.c:1974:24: error: cast increases required alignment of target type [-Werror=cast-align] qemuMonitorEvent = (virDomainQemuMonitorEventPtr)event; ^ ../../src/conf/domain_event.c: In function 'virDomainQemuMonitorEventFilter': ../../src/conf/domain_event.c:2179:20: error: cast increases required alignment of target type [-Werror=cast-align] monitorEvent = (virDomainQemuMonitorEventPtr) event; ^ cc1: all warnings being treated as errors Makefile:8525: recipe for target 'conf/libvirt_conf_la-domain_event.lo' failed make[3]: *** [conf/libvirt_conf_la-domain_event.lo] Error 1 make[3]: Leaving directory '/builds/libvirt/libvirt/build/src' Makefile:5995: recipe for target 'all' failed make[2]: *** [all] Error 2 make[2]: Leaving directory '/builds/libvirt/libvirt/build/src' Makefile:777: recipe for target 'all-recursive' failed make[1]: *** [all-recursive] Error 1 make[1]: Leaving directory '/builds/libvirt/libvirt/build' Makefile:670: recipe for target 'all' failed make: *** [all] Error 2 section_end:1591195539:build_script section_start:1591195539:after_script Running after_script section_end:1591195540:after_script section_start:1591195540:upload_artifacts_on_failure Uploading artifacts for failed job section_end:1591195542:upload_artifacts_on_failure ERROR: Job failed: exit code 1  Job #579408652 ( https://gitlab.com/libvirt/libvirt/-/jobs/579408652/raw ) Stage: cross_build Name: armv6l-debian-9 Trace: ../../src/conf/domain_event.c:1785:34: error: cast increases required alignment of target type [-Werror=cast-align] balloonChangeEvent = (virDomainEventBalloonChangePtr)event; ^ ../../src/conf/domain_event.c:1896:35: error: cast increases required alignment of target type [-Werror=cast-align] blockThresholdEvent = (virDomainEventBlockThresholdPtr)event; ^ ../../src/conf/domain_event.c: In function 'virDomainQemuMonitorEventDispatchFunc': ../../src/conf/domain_event.c:1974:24: error: cast increases required alignment of target type [-Werror=cast-align] qemuMonitorEvent = (virDomainQemuMonitorEventPtr)event; ^ ../../src/conf/domain_event.c: In function 'virDomainQemuMonitorEventFilter': ../../src/conf/domain_event.c:2179:20: error: cast increases required alignment of target type [-Werror=cast-align] monitorEvent = (virDomainQemuMonitorEventPtr) event; ^ cc1: all warnings being treated as errors Makefile:8525: recipe for target 'conf/libvirt_conf_la-domain_event.lo' failed make[3]: *** [conf/libvirt_conf_la-domain_event.lo] Error 1 make[3]: Leaving directory '/builds/libvirt/libvirt/build/src' Makefile:5995: recipe for target 'all' failed make[2]: *** [all] Error 2 make[2]: Leaving directory '/builds/libvirt/libvirt/build/src' Makefile:777: recipe for target 'all-recursive' failed make[1]: *** [all-recursive] Error 1 make[1]: Leaving directory '/builds/libvirt/libvirt/build' Makefile:670: recipe for target 'all' failed make: *** [all] Error 2 section_end:1591195523:build_script section_start:1591195523:after_script Running after_script section_end:1591195525:after_script section_start:1591195525:upload_artifacts_on_failure Uploading artifacts for failed job section_end:1591195526:upload_artifacts_on_failure ERROR: Job failed: exit code 1  Job #579408662 ( https://gitlab.com/libvirt/libvirt/-/jobs/579408662/raw ) Stage: cross_build Name: mipsel-debian-sid Trace: ../../src/conf/domain_event.c: In function 'virDomainEventDispatchDefaultFunc': ../../src/conf/domain_event.c:1656:30: error: cast increases required alignment of target type [-Werror=cast-align] 1656 | rtcChangeEvent = (virDomainEventRTCChangePtr)event; | ^ ../../src/conf/domain_event.c:1785:34: error: cast increases required alignment of target type [-Werror=cast-align] 1785 | balloonChangeEvent = (virDomainEventBalloonChangePtr)event; | ^ ../../src/conf/domain_event.c:1896:35: error: cast increases required alignment of target type [-Werror=cast-align] 1896 | blockThresholdEvent = (virDomainEventBlockThresholdPtr)event; | ^ ../../src/conf/domain_event.c: In function 'virDomainQemuMonitorEventDispatchFunc': ../../src/conf/domain_event.c:1974:24: error: cast increases required alignment of target type [-Werror=cast-align] 1974 | qemuMonitorEvent = (virDomainQemuMonitorEventPtr)event; | ^ ../../src/conf/domain_event.c: In function 'virDomainQemuMonitorEventFilter': ../../src/conf/domain_event.c:2179:20: error: cast increases required alignment of target type [-Werror=cast-align] 2179 | monitorEvent = (virDomainQemuMonitorEventPtr) event; | ^ cc1: all warnings being treated as errors make[3]: *** [Makefile:8979: conf/libvirt_conf_la-domain_event.lo] Error 1 make[3]: Leaving directory '/builds/libvirt/libvirt/build/src' make[2]: *** [Makefile:6443: all] Error 2 make[2]: Leaving directory '/builds/libvirt/libvirt/build/src' make[1]: *** [Makefile:777: all-recursive] Error 1 make[1]: Leaving directory '/builds/libvirt/libvirt/build' make: *** [Makefile:670: all] Error 2 section_end:1591195516:build_script section_start:1591195516:after_script Running after_script section_end:1591195517:after_script section_start:1591195517:upload_artifacts_on_failure Uploading artifacts for failed job section_end:1591195519:upload_artifacts_on_failure ERROR: Job failed: exit code 1  Job #579408660 ( https://gitlab.com/libvirt/libvirt/-/jobs/579408660/raw ) Stage: cross_build Name: armv7l-debian-sid Trace: ../../src/conf/domain_event.c: In function 'virDomainEventDispatchDefaultFunc': ../../src/conf/domain_event.c:1656:30: error: cast increases required alignment of target type [-Werror=cast-align] 1656 | rtcChangeEvent = (virDomainEventRTCChangePtr)event; | ^ ../../src/conf/domain_event.c:1785:34: error: cast increases required alignment of target type [-Werror=cast-align] 1785 | balloonChangeEvent = (virDomainEventBalloonChangePtr)event; | ^ ../../src/conf/domain_event.c:1896:35: error: cast increases required alignment of target type [-Werror=cast-align] 1896 | blockThresholdEvent = (virDomainEventBlockThresholdPtr)event; | ^ ../../src/conf/domain_event.c: In function 'virDomainQemuMonitorEventDispatchFunc': ../../src/conf/domain_event.c:1974:24: error: cast increases required alignment of target type [-Werror=cast-align] 1974 | qemuMonitorEvent = (virDomainQemuMonitorEventPtr)event; | ^ ../../src/conf/domain_event.c: In function 'virDomainQemuMonitorEventFilter': ../../src/conf/domain_event.c:2179:20: error: cast increases required alignment of target type [-Werror=cast-align] 2179 | monitorEvent = (virDomainQemuMonitorEventPtr) event; | ^ cc1: all warnings being treated as errors make[3]: *** [Makefile:8979: conf/libvirt_conf_la-domain_event.lo] Error 1 make[3]: Leaving directory '/builds/libvirt/libvirt/build/src' make[2]: *** [Makefile:6443: all] Error 2 make[2]: Leaving directory '/builds/libvirt/libvirt/build/src' make[1]: *** [Makefile:777: all-recursive] Error 1 make[1]: Leaving directory '/builds/libvirt/libvirt/build' make: *** [Makefile:670: all] Error 2 section_end:1591195498:build_script section_start:1591195498:after_script Running after_script section_end:1591195499:after_script section_start:1591195499:upload_artifacts_on_failure Uploading artifacts for failed job section_end:1591195501:upload_artifacts_on_failure ERROR: Job failed: exit code 1  -- You're receiving this email because of your account on gitlab.com.
1 0
0 0
Build failed in Jenkins: libvirt-check » libvirt-debian-10 #1196
by ci@centos.org 03 Jun '20

03 Jun '20
See <https://ci.centos.org/job/libvirt-check/systems=libvirt-debian-10/1196/disp…> ------------------------------------------ [...truncated 5.71 KB...] GEN ../../src/lxc_monitor_protocol-struct WARNING: exit code -11, pdwtags appears broken: WARNING: WARNING: skipping the remote protocol test GEN ../../src/lock_protocol-struct WARNING: exit code -11, pdwtags appears broken: WARNING: WARNING: skipping the remote protocol test WARNING: exit code -11, pdwtags appears broken: WARNING: WARNING: skipping the remote protocol test GEN ../../src/admin_protocol-struct WARNING: exit code -11, pdwtags appears broken: WARNING: WARNING: skipping the remote protocol test GEN check-symfile GEN check-symsorting WARNING: exit code -11, pdwtags appears broken: WARNING: WARNING: skipping the remote protocol test GEN check-drivername GEN check-driverimpls GEN check-aclrules GEN check-aclperms GEN check-admin-symfile GEN check-admin-symsorting GEN check-admin-drivername GEN check-augeas make[4]: Leaving directory '<https://ci.centos.org/job/libvirt-check/systems=libvirt-debian-10/ws/build/…'> make[3]: Leaving directory '<https://ci.centos.org/job/libvirt-check/systems=libvirt-debian-10/ws/build/…'> make[2]: Leaving directory '<https://ci.centos.org/job/libvirt-check/systems=libvirt-debian-10/ws/build/…'> Making check in tools make[2]: Entering directory '<https://ci.centos.org/job/libvirt-check/systems=libvirt-debian-10/ws/build/…'> /usr/bin/make check-am make[3]: Entering directory '<https://ci.centos.org/job/libvirt-check/systems=libvirt-debian-10/ws/build/…'> make[3]: Nothing to be done for 'check-am'. make[3]: Leaving directory '<https://ci.centos.org/job/libvirt-check/systems=libvirt-debian-10/ws/build/…'> make[2]: Leaving directory '<https://ci.centos.org/job/libvirt-check/systems=libvirt-debian-10/ws/build/…'> Making check in docs make[2]: Entering directory '<https://ci.centos.org/job/libvirt-check/systems=libvirt-debian-10/ws/build/…'> /usr/bin/make check-local make[3]: Entering directory '<https://ci.centos.org/job/libvirt-check/systems=libvirt-debian-10/ws/build/…'> /usr/bin/xmllint --nonet --noout html/*.html make[3]: Leaving directory '<https://ci.centos.org/job/libvirt-check/systems=libvirt-debian-10/ws/build/…'> make[2]: Leaving directory '<https://ci.centos.org/job/libvirt-check/systems=libvirt-debian-10/ws/build/…'> Making check in tests make[2]: Entering directory '<https://ci.centos.org/job/libvirt-check/systems=libvirt-debian-10/ws/build/…'> /usr/bin/make make[3]: Entering directory '<https://ci.centos.org/job/libvirt-check/systems=libvirt-debian-10/ws/build/…'> make[3]: Nothing to be done for 'all'. make[3]: Leaving directory '<https://ci.centos.org/job/libvirt-check/systems=libvirt-debian-10/ws/build/…'> /usr/bin/make check-TESTS make[3]: Entering directory '<https://ci.centos.org/job/libvirt-check/systems=libvirt-debian-10/ws/build/…'> make[4]: Entering directory '<https://ci.centos.org/job/libvirt-check/systems=libvirt-debian-10/ws/build/…'> PASS: sockettest PASS: virhostcputest PASS: virbuftest PASS: seclabeltest PASS: virhashtest PASS: virconftest PASS: utiltest PASS: shunloadtest PASS: virtimetest PASS: viruritest PASS: viralloctest PASS: virauthconfigtest PASS: virbitmaptest PASS: vircgrouptest PASS: vircryptotest PASS: virpcitest PASS: virendiantest PASS: virfiletest PASS: virfilecachetest PASS: virfirewalltest PASS: viriscsitest PASS: virkeycodetest PASS: virlockspacetest PASS: virlogtest PASS: virrotatingfiletest PASS: commandtest PASS: virstringtest PASS: virportallocatortest PASS: sysinfotest PASS: virkmodtest PASS: vircapstest PASS: domaincapstest PASS: domainconftest PASS: virschematest PASS: virhostdevtest PASS: virnetdevtest PASS: virtypedparamtest PASS: vshtabletest PASS: virerrortest PASS: virnetmessagetest PASS: virnetsockettest PASS: virnetdaemontest PASS: virnetserverclienttest PASS: virshtest PASS: fchosttest PASS: scsihosttest PASS: vircaps2xmltest PASS: virresctrltest PASS: fdstreamtest PASS: virnettlscontexttest PASS: virdbustest PASS: virsystemdtest PASS: virnettlssessiontest PASS: virpolkittest PASS: securityselinuxtest PASS: viridentitytest PASS: securityselinuxlabeltest PASS: xmconfigtest PASS: xlconfigtest PASS: libxlxml2domconfigtest PASS: qemudomaincheckpointxml2xmltest PASS: qemudomainsnapshotxml2xmltest PASS: qemumonitorjsontest PASS: qemuxml2xmltest PASS: qemuhotplugtest PASS: qemuagenttest PASS: qemucaps2xmltest PASS: qemumemlocktest PASS: qemucommandutiltest PASS: qemublocktest PASS: qemucapabilitiestest PASS: qemumigparamstest PASS: qemufirmwaretest PASS: qemuvhostusertest PASS: lxcxml2xmltest PASS: lxcconf2xmltest PASS: openvzutilstest PASS: esxutilstest PASS: vboxsnapshotxmltest PASS: vmx2xmltest PASS: xml2vmxtest PASS: vmwarevertest PASS: virjsontest PASS: qemusecuritytest PASS: networkxml2xmlupdatetest PASS: virnetworkportxml2xmltest PASS: networkxml2xmltest PASS: networkxml2conftest PASS: networkxml2firewalltest PASS: nwfilterxml2xmltest PASS: virnwfilterbindingxml2xmltest PASS: nwfilterebiptablestest PASS: nwfilterxml2firewalltest PASS: storagevolxml2argvtest PASS: virstorageutiltest PASS: storagepoolxml2argvtest PASS: storagepoolxml2xmltest PASS: storagepoolcapstest PASS: virscsitest PASS: nsstest PASS: nssguesttest PASS: storagevolxml2xmltest PASS: nodedevxml2xmltest PASS: interfacexml2xmltest PASS: virstoragetest PASS: metadatatest PASS: secretxml2xmltest PASS: genericxml2xmltest PASS: virusbtest PASS: virnetdevbandwidthtest ../../build-aux/test-driver: line 107: 29080 Segmentation fault "$@" > $log_file 2>&1 FAIL: eventtest PASS: virdrivermoduletest PASS: virdriverconnvalidatetest PASS: objecteventtest PASS: virmacmaptest PASS: qemuxml2argvtest PASS: virnetdevopenvswitchtest PASS: libvirtd-fail PASS: libvirtd-pool PASS: virsh-auth PASS: cputest PASS: virsh-define-dev-segfault PASS: virsh-cpuset PASS: virsh-int-overflow PASS: virsh-read-non-seekable PASS: virsh-read-bufsiz PASS: virsh-schedinfo PASS: virsh-self-test PASS: virt-admin-self-test PASS: virsh-checkpoint PASS: virsh-start PASS: virsh-snapshot PASS: virsh-undefine PASS: virsh-uriprecedence PASS: virsh-vcpupin PASS: virsh-optparse PASS: virt-aa-helper-test ============================================================================ Testsuite summary for libvirt 6.5.0 ============================================================================ # TOTAL: 137 # PASS: 136 # SKIP: 0 # XFAIL: 0 # FAIL: 1 # XPASS: 0 # ERROR: 0 ============================================================================ See tests/test-suite.log Please report to libvir-list(a)redhat.com ============================================================================ make[4]: *** [Makefile:4840: test-suite.log] Error 1 make[4]: Leaving directory '<https://ci.centos.org/job/libvirt-check/systems=libvirt-debian-10/ws/build/…'> make[3]: *** [Makefile:4948: check-TESTS] Error 2 make[3]: Leaving directory '<https://ci.centos.org/job/libvirt-check/systems=libvirt-debian-10/ws/build/…'> make[2]: *** [Makefile:6002: check-am] Error 2 make[2]: Leaving directory '<https://ci.centos.org/job/libvirt-check/systems=libvirt-debian-10/ws/build/…'> make[1]: *** [Makefile:777: check-recursive] Error 1 make[1]: Leaving directory '<https://ci.centos.org/job/libvirt-check/systems=libvirt-debian-10/ws/build'> make: *** [Makefile:1072: check] Error 2 + xargs cat + find -name test-suite.log ========================================= libvirt 6.5.0: tests/test-suite.log ========================================= # TOTAL: 137 # PASS: 136 # SKIP: 0 # XFAIL: 0 # FAIL: 1 # XPASS: 0 # ERROR: 0 .. contents:: :depth: 2 FAIL: eventtest =============== TEST: eventtest 1) Simple write ... OK 2) Deleted before poll ... OK 3) Interrupted during poll ... OK 4) Deleted during dispatch ... OK 5) Deleted during dispatch ... OK 6) Firing a timer ... OK 7) Deleted before poll ... OK 8) Interrupted during poll ... OK 9) Deleted during dispatch ... OK 10) Deleted during dispatch ... OK FAIL eventtest (exit status: 139) + exit 1 Build step 'Execute shell' marked build as failure
1 1
0 0
libvirt | Pipeline #152432368 has failed for master | e9546579
by GitLab 03 Jun '20

03 Jun '20
Your pipeline has failed. Project: libvirt ( https://gitlab.com/libvirt/libvirt ) Branch: master ( https://gitlab.com/libvirt/libvirt/-/commits/master ) Commit: e9546579 ( https://gitlab.com/libvirt/libvirt/-/commit/e954657959ee66204773430fa71686a… ) Commit Message: news: Point to GitLab for full git log The pri... Commit Author: Andrea Bolognani ( https://gitlab.com/abologna ) Pipeline #152432368 ( https://gitlab.com/libvirt/libvirt/-/pipelines/152432368 ) triggered by Andrea Bolognani ( https://gitlab.com/abologna ) had 5 failed builds. Job #579244290 ( https://gitlab.com/libvirt/libvirt/-/jobs/579244290/raw ) Stage: cross_build Name: mingw32-fedora-rawhide Trace: ../../src/conf/domain_event.c: In function 'virDomainEventDispatchDefaultFunc': ../../src/conf/domain_event.c:1656:30: error: cast increases required alignment of target type [-Werror=cast-align] 1656 | rtcChangeEvent = (virDomainEventRTCChangePtr)event; | ^ ../../src/conf/domain_event.c:1785:34: error: cast increases required alignment of target type [-Werror=cast-align] 1785 | balloonChangeEvent = (virDomainEventBalloonChangePtr)event; | ^ ../../src/conf/domain_event.c:1896:35: error: cast increases required alignment of target type [-Werror=cast-align] 1896 | blockThresholdEvent = (virDomainEventBlockThresholdPtr)event; | ^ ../../src/conf/domain_event.c: In function 'virDomainQemuMonitorEventDispatchFunc': ../../src/conf/domain_event.c:1974:24: error: cast increases required alignment of target type [-Werror=cast-align] 1974 | qemuMonitorEvent = (virDomainQemuMonitorEventPtr)event; | ^ ../../src/conf/domain_event.c: In function 'virDomainQemuMonitorEventFilter': ../../src/conf/domain_event.c:2179:20: error: cast increases required alignment of target type [-Werror=cast-align] 2179 | monitorEvent = (virDomainQemuMonitorEventPtr) event; | ^ cc1: all warnings being treated as errors make[3]: *** [Makefile:8979: conf/libvirt_conf_la-domain_event.lo] Error 1 make[3]: Leaving directory '/builds/libvirt/libvirt/build/src' make[2]: *** [Makefile:6443: all] Error 2 make[2]: Leaving directory '/builds/libvirt/libvirt/build/src' make[1]: *** [Makefile:777: all-recursive] Error 1 make[1]: Leaving directory '/builds/libvirt/libvirt/build' make: *** [Makefile:670: all] Error 2 section_end:1591190820:build_script section_start:1591190820:after_script Running after_script section_end:1591190822:after_script section_start:1591190822:upload_artifacts_on_failure Uploading artifacts for failed job section_end:1591190823:upload_artifacts_on_failure ERROR: Job failed: exit code 1  Job #579244279 ( https://gitlab.com/libvirt/libvirt/-/jobs/579244279/raw ) Stage: cross_build Name: mips-debian-9 Trace: ../../src/conf/domain_event.c:1785:34: error: cast increases required alignment of target type [-Werror=cast-align] balloonChangeEvent = (virDomainEventBalloonChangePtr)event; ^ ../../src/conf/domain_event.c:1896:35: error: cast increases required alignment of target type [-Werror=cast-align] blockThresholdEvent = (virDomainEventBlockThresholdPtr)event; ^ ../../src/conf/domain_event.c: In function 'virDomainQemuMonitorEventDispatchFunc': ../../src/conf/domain_event.c:1974:24: error: cast increases required alignment of target type [-Werror=cast-align] qemuMonitorEvent = (virDomainQemuMonitorEventPtr)event; ^ ../../src/conf/domain_event.c: In function 'virDomainQemuMonitorEventFilter': ../../src/conf/domain_event.c:2179:20: error: cast increases required alignment of target type [-Werror=cast-align] monitorEvent = (virDomainQemuMonitorEventPtr) event; ^ cc1: all warnings being treated as errors Makefile:8525: recipe for target 'conf/libvirt_conf_la-domain_event.lo' failed make[3]: *** [conf/libvirt_conf_la-domain_event.lo] Error 1 make[3]: Leaving directory '/builds/libvirt/libvirt/build/src' Makefile:5995: recipe for target 'all' failed make[2]: *** [all] Error 2 make[2]: Leaving directory '/builds/libvirt/libvirt/build/src' Makefile:777: recipe for target 'all-recursive' failed make[1]: *** [all-recursive] Error 1 make[1]: Leaving directory '/builds/libvirt/libvirt/build' Makefile:670: recipe for target 'all' failed make: *** [all] Error 2 section_end:1591190803:build_script section_start:1591190803:after_script Running after_script section_end:1591190805:after_script section_start:1591190805:upload_artifacts_on_failure Uploading artifacts for failed job section_end:1591190807:upload_artifacts_on_failure ERROR: Job failed: exit code 1  Job #579244276 ( https://gitlab.com/libvirt/libvirt/-/jobs/579244276/raw ) Stage: cross_build Name: armv6l-debian-9 Trace: ../../src/conf/domain_event.c:1785:34: error: cast increases required alignment of target type [-Werror=cast-align] balloonChangeEvent = (virDomainEventBalloonChangePtr)event; ^ ../../src/conf/domain_event.c:1896:35: error: cast increases required alignment of target type [-Werror=cast-align] blockThresholdEvent = (virDomainEventBlockThresholdPtr)event; ^ ../../src/conf/domain_event.c: In function 'virDomainQemuMonitorEventDispatchFunc': ../../src/conf/domain_event.c:1974:24: error: cast increases required alignment of target type [-Werror=cast-align] qemuMonitorEvent = (virDomainQemuMonitorEventPtr)event; ^ ../../src/conf/domain_event.c: In function 'virDomainQemuMonitorEventFilter': ../../src/conf/domain_event.c:2179:20: error: cast increases required alignment of target type [-Werror=cast-align] monitorEvent = (virDomainQemuMonitorEventPtr) event; ^ cc1: all warnings being treated as errors Makefile:8525: recipe for target 'conf/libvirt_conf_la-domain_event.lo' failed make[3]: *** [conf/libvirt_conf_la-domain_event.lo] Error 1 make[3]: Leaving directory '/builds/libvirt/libvirt/build/src' section_end:1591190791:build_script Makefile:5995: recipe for target 'all' failed section_start:1591190791:after_script make[2]: *** [all] Error 2 Running after_script make[2]: Leaving directory '/builds/libvirt/libvirt/build/src' Makefile:777: recipe for target 'all-recursive' failed make[1]: *** [all-recursive] Error 1 make[1]: Leaving directory '/builds/libvirt/libvirt/build' Makefile:670: recipe for target 'all' failed make: *** [all] Error 2 section_end:1591190793:after_script section_start:1591190794:upload_artifacts_on_failure Uploading artifacts for failed job section_end:1591190796:upload_artifacts_on_failure ERROR: Job failed: exit code 1  Job #579244289 ( https://gitlab.com/libvirt/libvirt/-/jobs/579244289/raw ) Stage: cross_build Name: mipsel-debian-sid Trace: ../../src/conf/domain_event.c: In function 'virDomainEventDispatchDefaultFunc': ../../src/conf/domain_event.c:1656:30: error: cast increases required alignment of target type [-Werror=cast-align] 1656 | rtcChangeEvent = (virDomainEventRTCChangePtr)event; | ^ ../../src/conf/domain_event.c:1785:34: error: cast increases required alignment of target type [-Werror=cast-align] 1785 | balloonChangeEvent = (virDomainEventBalloonChangePtr)event; | ^ ../../src/conf/domain_event.c:1896:35: error: cast increases required alignment of target type [-Werror=cast-align] 1896 | blockThresholdEvent = (virDomainEventBlockThresholdPtr)event; | ^ ../../src/conf/domain_event.c: In function 'virDomainQemuMonitorEventDispatchFunc': ../../src/conf/domain_event.c:1974:24: error: cast increases required alignment of target type [-Werror=cast-align] 1974 | qemuMonitorEvent = (virDomainQemuMonitorEventPtr)event; | ^ ../../src/conf/domain_event.c: In function 'virDomainQemuMonitorEventFilter': ../../src/conf/domain_event.c:2179:20: error: cast increases required alignment of target type [-Werror=cast-align] 2179 | monitorEvent = (virDomainQemuMonitorEventPtr) event; | ^ cc1: all warnings being treated as errors make[3]: *** [Makefile:8979: conf/libvirt_conf_la-domain_event.lo] Error 1 make[3]: Leaving directory '/builds/libvirt/libvirt/build/src' section_end:1591190786:build_script make[2]: *** [Makefile:6443: all] Error 2 section_start:1591190787:after_script make[2]: Leaving directory '/builds/libvirt/libvirt/build/src' Running after_script make[1]: *** [Makefile:777: all-recursive] Error 1 make[1]: Leaving directory '/builds/libvirt/libvirt/build' make: *** [Makefile:670: all] Error 2 section_end:1591190788:after_script section_start:1591190789:upload_artifacts_on_failure Uploading artifacts for failed job section_end:1591190791:upload_artifacts_on_failure ERROR: Job failed: exit code 1  Job #579244286 ( https://gitlab.com/libvirt/libvirt/-/jobs/579244286/raw ) Stage: cross_build Name: armv7l-debian-sid Trace: ../../src/conf/domain_event.c: In function 'virDomainEventDispatchDefaultFunc': ../../src/conf/domain_event.c:1656:30: error: cast increases required alignment of target type [-Werror=cast-align] 1656 | rtcChangeEvent = (virDomainEventRTCChangePtr)event; | ^ ../../src/conf/domain_event.c:1785:34: error: cast increases required alignment of target type [-Werror=cast-align] 1785 | balloonChangeEvent = (virDomainEventBalloonChangePtr)event; | ^ ../../src/conf/domain_event.c:1896:35: error: cast increases required alignment of target type [-Werror=cast-align] 1896 | blockThresholdEvent = (virDomainEventBlockThresholdPtr)event; | ^ ../../src/conf/domain_event.c: In function 'virDomainQemuMonitorEventDispatchFunc': ../../src/conf/domain_event.c:1974:24: error: cast increases required alignment of target type [-Werror=cast-align] 1974 | qemuMonitorEvent = (virDomainQemuMonitorEventPtr)event; | ^ ../../src/conf/domain_event.c: In function 'virDomainQemuMonitorEventFilter': ../../src/conf/domain_event.c:2179:20: error: cast increases required alignment of target type [-Werror=cast-align] 2179 | monitorEvent = (virDomainQemuMonitorEventPtr) event; | ^ cc1: all warnings being treated as errors make[3]: *** [Makefile:8979: conf/libvirt_conf_la-domain_event.lo] Error 1 make[3]: Leaving directory '/builds/libvirt/libvirt/build/src' make[2]: *** [Makefile:6443: all] Error 2 make[2]: Leaving directory '/builds/libvirt/libvirt/build/src' make[1]: *** [Makefile:777: all-recursive] Error 1 make[1]: Leaving directory '/builds/libvirt/libvirt/build' make: *** [Makefile:670: all] Error 2 section_end:1591190779:build_script section_start:1591190779:after_script Running after_script section_end:1591190781:after_script section_start:1591190781:upload_artifacts_on_failure Uploading artifacts for failed job section_end:1591190783:upload_artifacts_on_failure ERROR: Job failed: exit code 1  -- You're receiving this email because of your account on gitlab.com.
1 0
0 0
libvirt | Pipeline #152405168 has failed for master | cc48360f
by GitLab 03 Jun '20

03 Jun '20
Your pipeline has failed. Project: libvirt ( https://gitlab.com/libvirt/libvirt ) Branch: master ( https://gitlab.com/libvirt/libvirt/-/commits/master ) Commit: cc48360f ( https://gitlab.com/libvirt/libvirt/-/commit/cc48360fc9bcc2e5dac6c506de9be4a… ) Commit Message: tools: libvirt-guests: correctly check shutdown... Commit Author: Jano Tomko ( https://gitlab.com/jano.tomko ) Pipeline #152405168 ( https://gitlab.com/libvirt/libvirt/pipelines/152405168 ) triggered by Jano Tomko ( https://gitlab.com/jano.tomko ) had 5 failed builds. Job #579116436 ( https://gitlab.com/libvirt/libvirt/-/jobs/579116436/raw ) Stage: cross_build Name: armv6l-debian-9 Trace: ../../src/conf/domain_event.c:1785:34: error: cast increases required alignment of target type [-Werror=cast-align] balloonChangeEvent = (virDomainEventBalloonChangePtr)event; ^ ../../src/conf/domain_event.c:1896:35: error: cast increases required alignment of target type [-Werror=cast-align] blockThresholdEvent = (virDomainEventBlockThresholdPtr)event; ^ ../../src/conf/domain_event.c: In function 'virDomainQemuMonitorEventDispatchFunc': ../../src/conf/domain_event.c:1974:24: error: cast increases required alignment of target type [-Werror=cast-align] qemuMonitorEvent = (virDomainQemuMonitorEventPtr)event; ^ ../../src/conf/domain_event.c: In function 'virDomainQemuMonitorEventFilter': ../../src/conf/domain_event.c:2179:20: error: cast increases required alignment of target type [-Werror=cast-align] monitorEvent = (virDomainQemuMonitorEventPtr) event; ^ cc1: all warnings being treated as errors Makefile:8525: recipe for target 'conf/libvirt_conf_la-domain_event.lo' failed make[3]: *** [conf/libvirt_conf_la-domain_event.lo] Error 1 make[3]: Leaving directory '/builds/libvirt/libvirt/build/src' Makefile:5995: recipe for target 'all' failed make[2]: *** [all] Error 2 make[2]: Leaving directory '/builds/libvirt/libvirt/build/src' Makefile:777: recipe for target 'all-recursive' failed make[1]: *** [all-recursive] Error 1 make[1]: Leaving directory '/builds/libvirt/libvirt/build' Makefile:670: recipe for target 'all' failed make: *** [all] Error 2 section_end:1591186833:build_script section_start:1591186833:after_script Running after_script section_end:1591186835:after_script section_start:1591186835:upload_artifacts_on_failure Uploading artifacts for failed job section_end:1591186836:upload_artifacts_on_failure ERROR: Job failed: exit code 1  Job #579116440 ( https://gitlab.com/libvirt/libvirt/-/jobs/579116440/raw ) Stage: cross_build Name: mips-debian-9 Trace: ../../src/conf/domain_event.c:1785:34: error: cast increases required alignment of target type [-Werror=cast-align] balloonChangeEvent = (virDomainEventBalloonChangePtr)event; ^ ../../src/conf/domain_event.c:1896:35: error: cast increases required alignment of target type [-Werror=cast-align] blockThresholdEvent = (virDomainEventBlockThresholdPtr)event; ^ ../../src/conf/domain_event.c: In function 'virDomainQemuMonitorEventDispatchFunc': ../../src/conf/domain_event.c:1974:24: error: cast increases required alignment of target type [-Werror=cast-align] qemuMonitorEvent = (virDomainQemuMonitorEventPtr)event; ^ ../../src/conf/domain_event.c: In function 'virDomainQemuMonitorEventFilter': ../../src/conf/domain_event.c:2179:20: error: cast increases required alignment of target type [-Werror=cast-align] monitorEvent = (virDomainQemuMonitorEventPtr) event; ^ cc1: all warnings being treated as errors Makefile:8525: recipe for target 'conf/libvirt_conf_la-domain_event.lo' failed make[3]: *** [conf/libvirt_conf_la-domain_event.lo] Error 1 make[3]: Leaving directory '/builds/libvirt/libvirt/build/src' Makefile:5995: recipe for target 'all' failed make[2]: *** [all] Error 2 make[2]: Leaving directory '/builds/libvirt/libvirt/build/src' Makefile:777: recipe for target 'all-recursive' failed make[1]: *** [all-recursive] Error 1 make[1]: Leaving directory '/builds/libvirt/libvirt/build' Makefile:670: recipe for target 'all' failed make: *** [all] Error 2 section_end:1591186829:build_script section_start:1591186829:after_script Running after_script section_end:1591186831:after_script section_start:1591186831:upload_artifacts_on_failure Uploading artifacts for failed job section_end:1591186832:upload_artifacts_on_failure ERROR: Job failed: exit code 1  Job #579116457 ( https://gitlab.com/libvirt/libvirt/-/jobs/579116457/raw ) Stage: cross_build Name: mingw32-fedora-rawhide Trace: ../../src/conf/domain_event.c: In function 'virDomainEventDispatchDefaultFunc': ../../src/conf/domain_event.c:1656:30: error: cast increases required alignment of target type [-Werror=cast-align] 1656 | rtcChangeEvent = (virDomainEventRTCChangePtr)event; | ^ ../../src/conf/domain_event.c:1785:34: error: cast increases required alignment of target type [-Werror=cast-align] 1785 | balloonChangeEvent = (virDomainEventBalloonChangePtr)event; | ^ ../../src/conf/domain_event.c:1896:35: error: cast increases required alignment of target type [-Werror=cast-align] 1896 | blockThresholdEvent = (virDomainEventBlockThresholdPtr)event; | ^ ../../src/conf/domain_event.c: In function 'virDomainQemuMonitorEventDispatchFunc': ../../src/conf/domain_event.c:1974:24: error: cast increases required alignment of target type [-Werror=cast-align] 1974 | qemuMonitorEvent = (virDomainQemuMonitorEventPtr)event; | ^ ../../src/conf/domain_event.c: In function 'virDomainQemuMonitorEventFilter': ../../src/conf/domain_event.c:2179:20: error: cast increases required alignment of target type [-Werror=cast-align] 2179 | monitorEvent = (virDomainQemuMonitorEventPtr) event; | ^ cc1: all warnings being treated as errors make[3]: *** [Makefile:8979: conf/libvirt_conf_la-domain_event.lo] Error 1 make[3]: Leaving directory '/builds/libvirt/libvirt/build/src' make[2]: *** [Makefile:6443: all] Error 2 make[2]: Leaving directory '/builds/libvirt/libvirt/build/src' make[1]: *** [Makefile:777: all-recursive] Error 1 make[1]: Leaving directory '/builds/libvirt/libvirt/build' make: *** [Makefile:670: all] Error 2 section_end:1591186822:build_script section_start:1591186822:after_script Running after_script section_end:1591186823:after_script section_start:1591186823:upload_artifacts_on_failure Uploading artifacts for failed job section_end:1591186825:upload_artifacts_on_failure ERROR: Job failed: exit code 1  Job #579116456 ( https://gitlab.com/libvirt/libvirt/-/jobs/579116456/raw ) Stage: cross_build Name: mipsel-debian-sid Trace: ../../src/conf/domain_event.c: In function 'virDomainEventDispatchDefaultFunc': ../../src/conf/domain_event.c:1656:30: error: cast increases required alignment of target type [-Werror=cast-align] 1656 | rtcChangeEvent = (virDomainEventRTCChangePtr)event; | ^ ../../src/conf/domain_event.c:1785:34: error: cast increases required alignment of target type [-Werror=cast-align] 1785 | balloonChangeEvent = (virDomainEventBalloonChangePtr)event; | ^ ../../src/conf/domain_event.c:1896:35: error: cast increases required alignment of target type [-Werror=cast-align] 1896 | blockThresholdEvent = (virDomainEventBlockThresholdPtr)event; | ^ ../../src/conf/domain_event.c: In function 'virDomainQemuMonitorEventDispatchFunc': ../../src/conf/domain_event.c:1974:24: error: cast increases required alignment of target type [-Werror=cast-align] 1974 | qemuMonitorEvent = (virDomainQemuMonitorEventPtr)event; | ^ ../../src/conf/domain_event.c: In function 'virDomainQemuMonitorEventFilter': ../../src/conf/domain_event.c:2179:20: error: cast increases required alignment of target type [-Werror=cast-align] 2179 | monitorEvent = (virDomainQemuMonitorEventPtr) event; | ^ cc1: all warnings being treated as errors make[3]: *** [Makefile:8979: conf/libvirt_conf_la-domain_event.lo] Error 1 make[3]: Leaving directory '/builds/libvirt/libvirt/build/src' make[2]: *** [Makefile:6443: all] Error 2 make[2]: Leaving directory '/builds/libvirt/libvirt/build/src' make[1]: *** [Makefile:777: all-recursive] Error 1 make[1]: Leaving directory '/builds/libvirt/libvirt/build' make: *** [Makefile:670: all] Error 2 section_end:1591186817:build_script section_start:1591186817:after_script Running after_script section_end:1591186818:after_script section_start:1591186818:upload_artifacts_on_failure Uploading artifacts for failed job section_end:1591186820:upload_artifacts_on_failure ERROR: Job failed: exit code 1  Job #579116451 ( https://gitlab.com/libvirt/libvirt/-/jobs/579116451/raw ) Stage: cross_build Name: armv7l-debian-sid Trace: ../../src/conf/domain_event.c: In function 'virDomainEventDispatchDefaultFunc': ../../src/conf/domain_event.c:1656:30: error: cast increases required alignment of target type [-Werror=cast-align] 1656 | rtcChangeEvent = (virDomainEventRTCChangePtr)event; | ^ ../../src/conf/domain_event.c:1785:34: error: cast increases required alignment of target type [-Werror=cast-align] 1785 | balloonChangeEvent = (virDomainEventBalloonChangePtr)event; | ^ ../../src/conf/domain_event.c:1896:35: error: cast increases required alignment of target type [-Werror=cast-align] 1896 | blockThresholdEvent = (virDomainEventBlockThresholdPtr)event; | ^ ../../src/conf/domain_event.c: In function 'virDomainQemuMonitorEventDispatchFunc': ../../src/conf/domain_event.c:1974:24: error: cast increases required alignment of target type [-Werror=cast-align] 1974 | qemuMonitorEvent = (virDomainQemuMonitorEventPtr)event; | ^ ../../src/conf/domain_event.c: In function 'virDomainQemuMonitorEventFilter': ../../src/conf/domain_event.c:2179:20: error: cast increases required alignment of target type [-Werror=cast-align] 2179 | monitorEvent = (virDomainQemuMonitorEventPtr) event; | ^ cc1: all warnings being treated as errors make[3]: *** [Makefile:8979: conf/libvirt_conf_la-domain_event.lo] Error 1 make[3]: Leaving directory '/builds/libvirt/libvirt/build/src' make[2]: *** [Makefile:6443: all] Error 2 make[2]: Leaving directory '/builds/libvirt/libvirt/build/src' make[1]: *** [Makefile:777: all-recursive] Error 1 make[1]: Leaving directory '/builds/libvirt/libvirt/build' make: *** [Makefile:670: all] Error 2 section_end:1591186788:build_script section_start:1591186788:after_script Running after_script section_end:1591186789:after_script section_start:1591186789:upload_artifacts_on_failure Uploading artifacts for failed job section_end:1591186790:upload_artifacts_on_failure ERROR: Job failed: exit code 1  -- You're receiving this email because of your account on gitlab.com.
1 0
0 0
libvirt | Pipeline #152398677 has failed for master | 871f231e
by GitLab 03 Jun '20

03 Jun '20
Your pipeline has failed. Project: libvirt ( https://gitlab.com/libvirt/libvirt ) Branch: master ( https://gitlab.com/libvirt/libvirt/-/commits/master ) Commit: 871f231e ( https://gitlab.com/libvirt/libvirt/-/commit/871f231ea03a2e16f0350ca9b641416… ) Commit Message: docs: point to GitLab as the primary git hostin... Commit Author: Jano Tomko ( https://gitlab.com/jano.tomko ) Pipeline #152398677 ( https://gitlab.com/libvirt/libvirt/pipelines/152398677 ) triggered by Jano Tomko ( https://gitlab.com/jano.tomko ) had 5 failed builds. Job #579084819 ( https://gitlab.com/libvirt/libvirt/-/jobs/579084819/raw ) Stage: cross_build Name: mingw32-fedora-rawhide Trace: ../../src/conf/domain_event.c: In function 'virDomainEventDispatchDefaultFunc': ../../src/conf/domain_event.c:1656:30: error: cast increases required alignment of target type [-Werror=cast-align] 1656 | rtcChangeEvent = (virDomainEventRTCChangePtr)event; | ^ ../../src/conf/domain_event.c:1785:34: error: cast increases required alignment of target type [-Werror=cast-align] 1785 | balloonChangeEvent = (virDomainEventBalloonChangePtr)event; | ^ ../../src/conf/domain_event.c:1896:35: error: cast increases required alignment of target type [-Werror=cast-align] 1896 | blockThresholdEvent = (virDomainEventBlockThresholdPtr)event; | ^ ../../src/conf/domain_event.c: In function 'virDomainQemuMonitorEventDispatchFunc': ../../src/conf/domain_event.c:1974:24: error: cast increases required alignment of target type [-Werror=cast-align] 1974 | qemuMonitorEvent = (virDomainQemuMonitorEventPtr)event; | ^ ../../src/conf/domain_event.c: In function 'virDomainQemuMonitorEventFilter': ../../src/conf/domain_event.c:2179:20: error: cast increases required alignment of target type [-Werror=cast-align] 2179 | monitorEvent = (virDomainQemuMonitorEventPtr) event; | ^ cc1: all warnings being treated as errors make[3]: *** [Makefile:8979: conf/libvirt_conf_la-domain_event.lo] Error 1 make[3]: Leaving directory '/builds/libvirt/libvirt/build/src' make[2]: *** [Makefile:6443: all] Error 2 make[2]: Leaving directory '/builds/libvirt/libvirt/build/src' make[1]: *** [Makefile:777: all-recursive] Error 1 make[1]: Leaving directory '/builds/libvirt/libvirt/build' make: *** [Makefile:670: all] Error 2 section_end:1591185829:build_script section_start:1591185829:after_script Running after_script section_end:1591185830:after_script section_start:1591185830:upload_artifacts_on_failure Uploading artifacts for failed job section_end:1591185832:upload_artifacts_on_failure ERROR: Job failed: exit code 1  Job #579084810 ( https://gitlab.com/libvirt/libvirt/-/jobs/579084810/raw ) Stage: cross_build Name: mips-debian-9 Trace: ../../src/conf/domain_event.c:1785:34: error: cast increases required alignment of target type [-Werror=cast-align] balloonChangeEvent = (virDomainEventBalloonChangePtr)event; ^ ../../src/conf/domain_event.c:1896:35: error: cast increases required alignment of target type [-Werror=cast-align] blockThresholdEvent = (virDomainEventBlockThresholdPtr)event; ^ ../../src/conf/domain_event.c: In function 'virDomainQemuMonitorEventDispatchFunc': ../../src/conf/domain_event.c:1974:24: error: cast increases required alignment of target type [-Werror=cast-align] qemuMonitorEvent = (virDomainQemuMonitorEventPtr)event; ^ ../../src/conf/domain_event.c: In function 'virDomainQemuMonitorEventFilter': ../../src/conf/domain_event.c:2179:20: error: cast increases required alignment of target type [-Werror=cast-align] monitorEvent = (virDomainQemuMonitorEventPtr) event; ^ cc1: all warnings being treated as errors Makefile:8525: recipe for target 'conf/libvirt_conf_la-domain_event.lo' failed make[3]: *** [conf/libvirt_conf_la-domain_event.lo] Error 1 make[3]: Leaving directory '/builds/libvirt/libvirt/build/src' Makefile:5995: recipe for target 'all' failed make[2]: *** [all] Error 2 make[2]: Leaving directory '/builds/libvirt/libvirt/build/src' Makefile:777: recipe for target 'all-recursive' failed make[1]: *** [all-recursive] Error 1 make[1]: Leaving directory '/builds/libvirt/libvirt/build' Makefile:670: recipe for target 'all' failed make: *** [all] Error 2 section_end:1591185817:build_script section_start:1591185817:after_script Running after_script section_end:1591185818:after_script section_start:1591185818:upload_artifacts_on_failure Uploading artifacts for failed job section_end:1591185820:upload_artifacts_on_failure ERROR: Job failed: exit code 1  Job #579084807 ( https://gitlab.com/libvirt/libvirt/-/jobs/579084807/raw ) Stage: cross_build Name: armv6l-debian-9 Trace: ../../src/conf/domain_event.c:1785:34: error: cast increases required alignment of target type [-Werror=cast-align] balloonChangeEvent = (virDomainEventBalloonChangePtr)event; ^ ../../src/conf/domain_event.c:1896:35: error: cast increases required alignment of target type [-Werror=cast-align] blockThresholdEvent = (virDomainEventBlockThresholdPtr)event; ^ ../../src/conf/domain_event.c: In function 'virDomainQemuMonitorEventDispatchFunc': ../../src/conf/domain_event.c:1974:24: error: cast increases required alignment of target type [-Werror=cast-align] qemuMonitorEvent = (virDomainQemuMonitorEventPtr)event; ^ ../../src/conf/domain_event.c: In function 'virDomainQemuMonitorEventFilter': ../../src/conf/domain_event.c:2179:20: error: cast increases required alignment of target type [-Werror=cast-align] monitorEvent = (virDomainQemuMonitorEventPtr) event; ^ cc1: all warnings being treated as errors Makefile:8525: recipe for target 'conf/libvirt_conf_la-domain_event.lo' failed make[3]: *** [conf/libvirt_conf_la-domain_event.lo] Error 1 make[3]: Leaving directory '/builds/libvirt/libvirt/build/src' Makefile:5995: recipe for target 'all' failed make[2]: *** [all] Error 2 make[2]: Leaving directory '/builds/libvirt/libvirt/build/src' Makefile:777: recipe for target 'all-recursive' failed make[1]: *** [all-recursive] Error 1 make[1]: Leaving directory '/builds/libvirt/libvirt/build' Makefile:670: recipe for target 'all' failed make: *** [all] Error 2 section_end:1591185813:build_script section_start:1591185813:after_script Running after_script section_end:1591185815:after_script section_start:1591185815:upload_artifacts_on_failure Uploading artifacts for failed job section_end:1591185816:upload_artifacts_on_failure ERROR: Job failed: exit code 1  Job #579084818 ( https://gitlab.com/libvirt/libvirt/-/jobs/579084818/raw ) Stage: cross_build Name: mipsel-debian-sid Trace: ../../src/conf/domain_event.c: In function 'virDomainEventDispatchDefaultFunc': ../../src/conf/domain_event.c:1656:30: error: cast increases required alignment of target type [-Werror=cast-align] 1656 | rtcChangeEvent = (virDomainEventRTCChangePtr)event; | ^ ../../src/conf/domain_event.c:1785:34: error: cast increases required alignment of target type [-Werror=cast-align] 1785 | balloonChangeEvent = (virDomainEventBalloonChangePtr)event; | ^ ../../src/conf/domain_event.c:1896:35: error: cast increases required alignment of target type [-Werror=cast-align] 1896 | blockThresholdEvent = (virDomainEventBlockThresholdPtr)event; | ^ ../../src/conf/domain_event.c: In function 'virDomainQemuMonitorEventDispatchFunc': ../../src/conf/domain_event.c:1974:24: error: cast increases required alignment of target type [-Werror=cast-align] 1974 | qemuMonitorEvent = (virDomainQemuMonitorEventPtr)event; | ^ ../../src/conf/domain_event.c: In function 'virDomainQemuMonitorEventFilter': ../../src/conf/domain_event.c:2179:20: error: cast increases required alignment of target type [-Werror=cast-align] 2179 | monitorEvent = (virDomainQemuMonitorEventPtr) event; | ^ cc1: all warnings being treated as errors make[3]: *** [Makefile:8979: conf/libvirt_conf_la-domain_event.lo] Error 1 make[3]: Leaving directory '/builds/libvirt/libvirt/build/src' make[2]: *** [Makefile:6443: all] Error 2 make[2]: Leaving directory '/builds/libvirt/libvirt/build/src' make[1]: *** [Makefile:777: all-recursive] Error 1 make[1]: Leaving directory '/builds/libvirt/libvirt/build' make: *** [Makefile:670: all] Error 2 section_end:1591185811:build_script section_start:1591185811:after_script Running after_script section_end:1591185813:after_script section_start:1591185813:upload_artifacts_on_failure Uploading artifacts for failed job section_end:1591185814:upload_artifacts_on_failure ERROR: Job failed: exit code 1  Job #579084816 ( https://gitlab.com/libvirt/libvirt/-/jobs/579084816/raw ) Stage: cross_build Name: armv7l-debian-sid Trace: ../../src/conf/domain_event.c: In function 'virDomainEventDispatchDefaultFunc': ../../src/conf/domain_event.c:1656:30: error: cast increases required alignment of target type [-Werror=cast-align] 1656 | rtcChangeEvent = (virDomainEventRTCChangePtr)event; | ^ ../../src/conf/domain_event.c:1785:34: error: cast increases required alignment of target type [-Werror=cast-align] 1785 | balloonChangeEvent = (virDomainEventBalloonChangePtr)event; | ^ ../../src/conf/domain_event.c:1896:35: error: cast increases required alignment of target type [-Werror=cast-align] 1896 | blockThresholdEvent = (virDomainEventBlockThresholdPtr)event; | ^ ../../src/conf/domain_event.c: In function 'virDomainQemuMonitorEventDispatchFunc': ../../src/conf/domain_event.c:1974:24: error: cast increases required alignment of target type [-Werror=cast-align] 1974 | qemuMonitorEvent = (virDomainQemuMonitorEventPtr)event; | ^ ../../src/conf/domain_event.c: In function 'virDomainQemuMonitorEventFilter': ../../src/conf/domain_event.c:2179:20: error: cast increases required alignment of target type [-Werror=cast-align] 2179 | monitorEvent = (virDomainQemuMonitorEventPtr) event; | ^ cc1: all warnings being treated as errors make[3]: *** [Makefile:8979: conf/libvirt_conf_la-domain_event.lo] Error 1 make[3]: Leaving directory '/builds/libvirt/libvirt/build/src' make[2]: *** [Makefile:6443: all] Error 2 make[2]: Leaving directory '/builds/libvirt/libvirt/build/src' make[1]: *** [Makefile:777: all-recursive] Error 1 make[1]: Leaving directory '/builds/libvirt/libvirt/build' make: *** [Makefile:670: all] Error 2 section_end:1591185788:build_script section_start:1591185788:after_script Running after_script section_end:1591185789:after_script section_start:1591185789:upload_artifacts_on_failure Uploading artifacts for failed job section_end:1591185791:upload_artifacts_on_failure ERROR: Job failed: exit code 1  -- You're receiving this email because of your account on gitlab.com.
1 0
0 0
libvirt | Pipeline #152344927 has failed for master | d4c71c67
by GitLab 03 Jun '20

03 Jun '20
Your pipeline has failed. Project: libvirt ( https://gitlab.com/libvirt/libvirt ) Branch: master ( https://gitlab.com/libvirt/libvirt/-/commits/master ) Commit: d4c71c67 ( https://gitlab.com/libvirt/libvirt/-/commit/d4c71c6725a6f0cb51135c53cc6f620… ) Commit Message: src: make virObject inherit from GObject To av... Commit Author: Daniel Berrange ( https://gitlab.com/berrange ) Pipeline #152344927 ( https://gitlab.com/libvirt/libvirt/pipelines/152344927 ) triggered by Daniel Berrange ( https://gitlab.com/berrange ) had 5 failed builds. Job #578841040 ( https://gitlab.com/libvirt/libvirt/-/jobs/578841040/raw ) Stage: cross_build Name: mingw32-fedora-rawhide Trace: ../../src/conf/domain_event.c: In function 'virDomainEventDispatchDefaultFunc': ../../src/conf/domain_event.c:1656:30: error: cast increases required alignment of target type [-Werror=cast-align] 1656 | rtcChangeEvent = (virDomainEventRTCChangePtr)event; | ^ ../../src/conf/domain_event.c:1785:34: error: cast increases required alignment of target type [-Werror=cast-align] 1785 | balloonChangeEvent = (virDomainEventBalloonChangePtr)event; | ^ ../../src/conf/domain_event.c:1896:35: error: cast increases required alignment of target type [-Werror=cast-align] 1896 | blockThresholdEvent = (virDomainEventBlockThresholdPtr)event; | ^ ../../src/conf/domain_event.c: In function 'virDomainQemuMonitorEventDispatchFunc': ../../src/conf/domain_event.c:1974:24: error: cast increases required alignment of target type [-Werror=cast-align] 1974 | qemuMonitorEvent = (virDomainQemuMonitorEventPtr)event; | ^ ../../src/conf/domain_event.c: In function 'virDomainQemuMonitorEventFilter': ../../src/conf/domain_event.c:2179:20: error: cast increases required alignment of target type [-Werror=cast-align] 2179 | monitorEvent = (virDomainQemuMonitorEventPtr) event; | ^ cc1: all warnings being treated as errors make[3]: *** [Makefile:8979: conf/libvirt_conf_la-domain_event.lo] Error 1 make[3]: Leaving directory '/builds/libvirt/libvirt/build/src' make[2]: *** [Makefile:6443: all] Error 2 make[2]: Leaving directory '/builds/libvirt/libvirt/build/src' make[1]: *** [Makefile:777: all-recursive] Error 1 make[1]: Leaving directory '/builds/libvirt/libvirt/build' make: *** [Makefile:670: all] Error 2 section_end:1591178215:build_script section_start:1591178215:after_script Running after_script section_end:1591178216:after_script section_start:1591178216:upload_artifacts_on_failure Uploading artifacts for failed job section_end:1591178218:upload_artifacts_on_failure ERROR: Job failed: exit code 1  Job #578841031 ( https://gitlab.com/libvirt/libvirt/-/jobs/578841031/raw ) Stage: cross_build Name: mips-debian-9 Trace: ../../src/conf/domain_event.c:1785:34: error: cast increases required alignment of target type [-Werror=cast-align] balloonChangeEvent = (virDomainEventBalloonChangePtr)event; ^ ../../src/conf/domain_event.c:1896:35: error: cast increases required alignment of target type [-Werror=cast-align] blockThresholdEvent = (virDomainEventBlockThresholdPtr)event; ^ ../../src/conf/domain_event.c: In function 'virDomainQemuMonitorEventDispatchFunc': ../../src/conf/domain_event.c:1974:24: error: cast increases required alignment of target type [-Werror=cast-align] qemuMonitorEvent = (virDomainQemuMonitorEventPtr)event; ^ ../../src/conf/domain_event.c: In function 'virDomainQemuMonitorEventFilter': ../../src/conf/domain_event.c:2179:20: error: cast increases required alignment of target type [-Werror=cast-align] monitorEvent = (virDomainQemuMonitorEventPtr) event; ^ cc1: all warnings being treated as errors Makefile:8525: recipe for target 'conf/libvirt_conf_la-domain_event.lo' failed make[3]: *** [conf/libvirt_conf_la-domain_event.lo] Error 1 make[3]: Leaving directory '/builds/libvirt/libvirt/build/src' Makefile:5995: recipe for target 'all' failed make[2]: *** [all] Error 2 make[2]: Leaving directory '/builds/libvirt/libvirt/build/src' Makefile:777: recipe for target 'all-recursive' failed make[1]: *** [all-recursive] Error 1 make[1]: Leaving directory '/builds/libvirt/libvirt/build' Makefile:670: recipe for target 'all' failed make: *** [all] Error 2 section_end:1591178207:build_script section_start:1591178207:after_script Running after_script section_end:1591178209:after_script section_start:1591178209:upload_artifacts_on_failure Uploading artifacts for failed job section_end:1591178210:upload_artifacts_on_failure ERROR: Job failed: exit code 1  Job #578841029 ( https://gitlab.com/libvirt/libvirt/-/jobs/578841029/raw ) Stage: cross_build Name: armv6l-debian-9 Trace: ../../src/conf/domain_event.c:1785:34: error: cast increases required alignment of target type [-Werror=cast-align] balloonChangeEvent = (virDomainEventBalloonChangePtr)event; ^ ../../src/conf/domain_event.c:1896:35: error: cast increases required alignment of target type [-Werror=cast-align] blockThresholdEvent = (virDomainEventBlockThresholdPtr)event; ^ ../../src/conf/domain_event.c: In function 'virDomainQemuMonitorEventDispatchFunc': ../../src/conf/domain_event.c:1974:24: error: cast increases required alignment of target type [-Werror=cast-align] qemuMonitorEvent = (virDomainQemuMonitorEventPtr)event; ^ ../../src/conf/domain_event.c: In function 'virDomainQemuMonitorEventFilter': ../../src/conf/domain_event.c:2179:20: error: cast increases required alignment of target type [-Werror=cast-align] monitorEvent = (virDomainQemuMonitorEventPtr) event; ^ cc1: all warnings being treated as errors Makefile:8525: recipe for target 'conf/libvirt_conf_la-domain_event.lo' failed make[3]: *** [conf/libvirt_conf_la-domain_event.lo] Error 1 make[3]: Leaving directory '/builds/libvirt/libvirt/build/src' Makefile:5995: recipe for target 'all' failed make[2]: *** [all] Error 2 make[2]: Leaving directory '/builds/libvirt/libvirt/build/src' Makefile:777: recipe for target 'all-recursive' failed make[1]: *** [all-recursive] Error 1 make[1]: Leaving directory '/builds/libvirt/libvirt/build' Makefile:670: recipe for target 'all' failed make: *** [all] Error 2 section_end:1591178191:build_script section_start:1591178191:after_script Running after_script section_end:1591178193:after_script section_start:1591178193:upload_artifacts_on_failure Uploading artifacts for failed job section_end:1591178194:upload_artifacts_on_failure ERROR: Job failed: exit code 1  Job #578841038 ( https://gitlab.com/libvirt/libvirt/-/jobs/578841038/raw ) Stage: cross_build Name: mipsel-debian-sid Trace: ../../src/conf/domain_event.c: In function 'virDomainEventDispatchDefaultFunc': ../../src/conf/domain_event.c:1656:30: error: cast increases required alignment of target type [-Werror=cast-align] 1656 | rtcChangeEvent = (virDomainEventRTCChangePtr)event; | ^ ../../src/conf/domain_event.c:1785:34: error: cast increases required alignment of target type [-Werror=cast-align] 1785 | balloonChangeEvent = (virDomainEventBalloonChangePtr)event; | ^ ../../src/conf/domain_event.c:1896:35: error: cast increases required alignment of target type [-Werror=cast-align] 1896 | blockThresholdEvent = (virDomainEventBlockThresholdPtr)event; | ^ ../../src/conf/domain_event.c: In function 'virDomainQemuMonitorEventDispatchFunc': ../../src/conf/domain_event.c:1974:24: error: cast increases required alignment of target type [-Werror=cast-align] 1974 | qemuMonitorEvent = (virDomainQemuMonitorEventPtr)event; | ^ ../../src/conf/domain_event.c: In function 'virDomainQemuMonitorEventFilter': ../../src/conf/domain_event.c:2179:20: error: cast increases required alignment of target type [-Werror=cast-align] 2179 | monitorEvent = (virDomainQemuMonitorEventPtr) event; | ^ cc1: all warnings being treated as errors make[3]: *** [Makefile:8979: conf/libvirt_conf_la-domain_event.lo] Error 1 make[3]: Leaving directory '/builds/libvirt/libvirt/build/src' make[2]: *** [Makefile:6443: all] Error 2 make[2]: Leaving directory '/builds/libvirt/libvirt/build/src' make[1]: *** [Makefile:777: all-recursive] Error 1 make[1]: Leaving directory '/builds/libvirt/libvirt/build' make: *** [Makefile:670: all] Error 2 section_end:1591178188:build_script section_start:1591178188:after_script Running after_script section_end:1591178190:after_script section_start:1591178190:upload_artifacts_on_failure Uploading artifacts for failed job section_end:1591178191:upload_artifacts_on_failure ERROR: Job failed: exit code 1  Job #578841035 ( https://gitlab.com/libvirt/libvirt/-/jobs/578841035/raw ) Stage: cross_build Name: armv7l-debian-sid Trace: ../../src/conf/domain_event.c: In function 'virDomainEventDispatchDefaultFunc': ../../src/conf/domain_event.c:1656:30: error: cast increases required alignment of target type [-Werror=cast-align] 1656 | rtcChangeEvent = (virDomainEventRTCChangePtr)event; | ^ ../../src/conf/domain_event.c:1785:34: error: cast increases required alignment of target type [-Werror=cast-align] 1785 | balloonChangeEvent = (virDomainEventBalloonChangePtr)event; | ^ ../../src/conf/domain_event.c:1896:35: error: cast increases required alignment of target type [-Werror=cast-align] 1896 | blockThresholdEvent = (virDomainEventBlockThresholdPtr)event; | ^ ../../src/conf/domain_event.c: In function 'virDomainQemuMonitorEventDispatchFunc': ../../src/conf/domain_event.c:1974:24: error: cast increases required alignment of target type [-Werror=cast-align] 1974 | qemuMonitorEvent = (virDomainQemuMonitorEventPtr)event; | ^ ../../src/conf/domain_event.c: In function 'virDomainQemuMonitorEventFilter': ../../src/conf/domain_event.c:2179:20: error: cast increases required alignment of target type [-Werror=cast-align] 2179 | monitorEvent = (virDomainQemuMonitorEventPtr) event; | ^ cc1: all warnings being treated as errors make[3]: *** [Makefile:8979: conf/libvirt_conf_la-domain_event.lo] Error 1 make[3]: Leaving directory '/builds/libvirt/libvirt/build/src' make[2]: *** [Makefile:6443: all] Error 2 make[2]: Leaving directory '/builds/libvirt/libvirt/build/src' make[1]: *** [Makefile:777: all-recursive] Error 1 make[1]: Leaving directory '/builds/libvirt/libvirt/build' make: *** [Makefile:670: all] Error 2 section_end:1591178173:build_script section_start:1591178173:after_script Running after_script section_end:1591178174:after_script section_start:1591178174:upload_artifacts_on_failure Uploading artifacts for failed job section_end:1591178176:upload_artifacts_on_failure ERROR: Job failed: exit code 1  -- You're receiving this email because of your account on gitlab.com.
1 0
0 0
Build failed in Jenkins: libvirt-check » libvirt-debian-9 #1192
by ci@centos.org 03 Jun '20

03 Jun '20
See <https://ci.centos.org/job/libvirt-check/systems=libvirt-debian-9/1192/displ…> ------------------------------------------ [...truncated 6.16 KB...] WARNING: die__process_unit: DW_TAG_restrict_type (0x37) @ <0x19e> not handled! WARNING: skipping the remote protocol test WARNING: no output, pdwtags appears broken: WARNING: die__process_unit: DW_TAG_restrict_type (0x37) @ <0x193> not handled! WARNING: skipping the remote protocol test GEN ../../src/admin_protocol-struct WARNING: no output, pdwtags appears broken: WARNING: die__process_unit: DW_TAG_restrict_type (0x37) @ <0x193> not handled! WARNING: skipping the remote protocol test WARNING: no output, pdwtags appears broken: WARNING: die__process_unit: DW_TAG_restrict_type (0x37) @ <0x19e> not handled! WARNING: skipping the remote protocol test GEN check-symsorting GEN check-symfile GEN check-drivername GEN check-driverimpls GEN check-aclrules GEN check-aclperms GEN check-admin-symfile GEN check-admin-symsorting GEN check-admin-drivername GEN check-augeas make[4]: Leaving directory '<https://ci.centos.org/job/libvirt-check/systems=libvirt-debian-9/ws/build/s…'> make[3]: Leaving directory '<https://ci.centos.org/job/libvirt-check/systems=libvirt-debian-9/ws/build/s…'> make[2]: Leaving directory '<https://ci.centos.org/job/libvirt-check/systems=libvirt-debian-9/ws/build/s…'> Making check in tools make[2]: Entering directory '<https://ci.centos.org/job/libvirt-check/systems=libvirt-debian-9/ws/build/t…'> /usr/bin/make check-am make[3]: Entering directory '<https://ci.centos.org/job/libvirt-check/systems=libvirt-debian-9/ws/build/t…'> make[3]: Nothing to be done for 'check-am'. make[3]: Leaving directory '<https://ci.centos.org/job/libvirt-check/systems=libvirt-debian-9/ws/build/t…'> make[2]: Leaving directory '<https://ci.centos.org/job/libvirt-check/systems=libvirt-debian-9/ws/build/t…'> Making check in docs make[2]: Entering directory '<https://ci.centos.org/job/libvirt-check/systems=libvirt-debian-9/ws/build/d…'> /usr/bin/make check-local make[3]: Entering directory '<https://ci.centos.org/job/libvirt-check/systems=libvirt-debian-9/ws/build/d…'> /usr/bin/xmllint --nonet --noout html/*.html make[3]: Leaving directory '<https://ci.centos.org/job/libvirt-check/systems=libvirt-debian-9/ws/build/d…'> make[2]: Leaving directory '<https://ci.centos.org/job/libvirt-check/systems=libvirt-debian-9/ws/build/d…'> Making check in tests make[2]: Entering directory '<https://ci.centos.org/job/libvirt-check/systems=libvirt-debian-9/ws/build/t…'> /usr/bin/make make[3]: Entering directory '<https://ci.centos.org/job/libvirt-check/systems=libvirt-debian-9/ws/build/t…'> make[3]: Nothing to be done for 'all'. make[3]: Leaving directory '<https://ci.centos.org/job/libvirt-check/systems=libvirt-debian-9/ws/build/t…'> /usr/bin/make check-TESTS make[3]: Entering directory '<https://ci.centos.org/job/libvirt-check/systems=libvirt-debian-9/ws/build/t…'> make[4]: Entering directory '<https://ci.centos.org/job/libvirt-check/systems=libvirt-debian-9/ws/build/t…'> PASS: sockettest PASS: virhostcputest PASS: virbuftest PASS: seclabeltest PASS: virhashtest PASS: commandtest PASS: virconftest PASS: shunloadtest PASS: utiltest PASS: virtimetest PASS: viruritest PASS: virauthconfigtest PASS: viralloctest PASS: virbitmaptest PASS: vircgrouptest PASS: vircryptotest PASS: virpcitest PASS: virendiantest PASS: virfilecachetest PASS: virfirewalltest PASS: virfiletest PASS: viriscsitest PASS: virkeycodetest PASS: virlockspacetest PASS: virlogtest PASS: virrotatingfiletest PASS: virstringtest PASS: virportallocatortest PASS: sysinfotest PASS: virkmodtest PASS: vircapstest PASS: domaincapstest PASS: domainconftest PASS: virhostdevtest PASS: virnetdevtest PASS: virtypedparamtest PASS: vshtabletest PASS: virerrortest PASS: virnetmessagetest PASS: virnetsockettest PASS: virnetdaemontest PASS: virnetserverclienttest PASS: virschematest PASS: virshtest PASS: virnettlssessiontest PASS: fchosttest PASS: scsihosttest PASS: vircaps2xmltest PASS: virresctrltest PASS: fdstreamtest PASS: virdbustest PASS: virsystemdtest PASS: virpolkittest PASS: securityselinuxtest PASS: viridentitytest PASS: securityselinuxlabeltest PASS: xlconfigtest PASS: xmconfigtest PASS: libxlxml2domconfigtest PASS: virnettlscontexttest PASS: qemudomaincheckpointxml2xmltest PASS: qemudomainsnapshotxml2xmltest PASS: qemumonitorjsontest PASS: qemuhotplugtest PASS: qemuagenttest PASS: qemuxml2xmltest PASS: qemucaps2xmltest PASS: qemumemlocktest PASS: qemucommandutiltest PASS: qemublocktest PASS: qemumigparamstest PASS: qemucapabilitiestest PASS: qemufirmwaretest PASS: qemuvhostusertest PASS: lxcxml2xmltest PASS: lxcconf2xmltest PASS: openvzutilstest PASS: esxutilstest PASS: vboxsnapshotxmltest PASS: vmx2xmltest PASS: xml2vmxtest PASS: vmwarevertest PASS: virjsontest PASS: networkxml2xmlupdatetest PASS: virnetworkportxml2xmltest PASS: qemusecuritytest PASS: networkxml2xmltest PASS: networkxml2conftest PASS: networkxml2firewalltest PASS: storagebackendsheepdogtest PASS: nwfilterxml2xmltest PASS: virnwfilterbindingxml2xmltest PASS: nwfilterebiptablestest PASS: nwfilterxml2firewalltest PASS: storagevolxml2argvtest PASS: storagepoolxml2argvtest PASS: virstorageutiltest PASS: storagepoolcapstest PASS: storagepoolxml2xmltest PASS: virscsitest PASS: nsstest PASS: nssguesttest PASS: storagevolxml2xmltest PASS: nodedevxml2xmltest PASS: virstoragetest PASS: interfacexml2xmltest PASS: metadatatest PASS: secretxml2xmltest PASS: genericxml2xmltest PASS: virusbtest PASS: virnetdevbandwidthtest ../../build-aux/test-driver: line 107: 12982 Segmentation fault "$@" > $log_file 2>&1 FAIL: eventtest PASS: virdrivermoduletest PASS: virdriverconnvalidatetest PASS: objecteventtest PASS: virmacmaptest PASS: virnetdevopenvswitchtest PASS: libvirtd-fail PASS: cputest PASS: libvirtd-pool PASS: virsh-auth PASS: virsh-define-dev-segfault PASS: virsh-cpuset PASS: virsh-int-overflow PASS: virsh-read-bufsiz PASS: virsh-read-non-seekable PASS: virsh-schedinfo PASS: virsh-self-test PASS: virt-admin-self-test PASS: virsh-checkpoint PASS: qemuxml2argvtest PASS: virsh-snapshot PASS: virsh-start PASS: virsh-undefine PASS: virsh-uriprecedence PASS: virsh-optparse PASS: virsh-vcpupin PASS: virt-aa-helper-test ============================================================================ Testsuite summary for libvirt 6.5.0 ============================================================================ # TOTAL: 138 # PASS: 137 # SKIP: 0 # XFAIL: 0 # FAIL: 1 # XPASS: 0 # ERROR: 0 ============================================================================ See tests/test-suite.log Please report to libvir-list(a)redhat.com ============================================================================ Makefile:4704: recipe for target 'test-suite.log' failed make[4]: *** [test-suite.log] Error 1 make[4]: Leaving directory '<https://ci.centos.org/job/libvirt-check/systems=libvirt-debian-9/ws/build/t…'> Makefile:4810: recipe for target 'check-TESTS' failed make[3]: *** [check-TESTS] Error 2 make[3]: Leaving directory '<https://ci.centos.org/job/libvirt-check/systems=libvirt-debian-9/ws/build/t…'> Makefile:5863: recipe for target 'check-am' failed make[2]: *** [check-am] Error 2 make[2]: Leaving directory '<https://ci.centos.org/job/libvirt-check/systems=libvirt-debian-9/ws/build/t…'> Makefile:777: recipe for target 'check-recursive' failed make[1]: *** [check-recursive] Error 1 make[1]: Leaving directory '<https://ci.centos.org/job/libvirt-check/systems=libvirt-debian-9/ws/build'> Makefile:1069: recipe for target 'check' failed make: *** [check] Error 2 + xargs cat + find -name test-suite.log ========================================= libvirt 6.5.0: tests/test-suite.log ========================================= # TOTAL: 138 # PASS: 137 # SKIP: 0 # XFAIL: 0 # FAIL: 1 # XPASS: 0 # ERROR: 0 .. contents:: :depth: 2 FAIL: eventtest =============== TEST: eventtest 1) Simple write ... OK 2) Deleted before poll ... OK 3) Interrupted during poll ... OK 4) Deleted during dispatch ... OK 5) Deleted during dispatch ... OK 6) Firing a timer ... OK 7) Deleted before poll ... OK 8) Interrupted during poll ... OK 9) Deleted during dispatch ... OK 10) Deleted during dispatch ... OK FAIL eventtest (exit status: 139) + exit 1 Build step 'Execute shell' marked build as failure
1 1
0 0
Build failed in Jenkins: libvirt-go-xml-check » libvirt-fedora-32 #1258
by ci@centos.org 02 Jun '20

02 Jun '20
See <https://ci.centos.org/job/libvirt-go-xml-check/systems=libvirt-fedora-32/12…> ------------------------------------------ Started by upstream project "libvirt-go-xml-check" build number 1258 originally caused by: Started by upstream project "libvirt-go-xml-build" build number 1262 originally caused by: Started by upstream project "libvirt-build" build number 1451 originally caused by: Started by an SCM change Running as SYSTEM [EnvInject] - Loading node environment variables. Building remotely on libvirt-fedora-32 (libvirt) in workspace <https://ci.centos.org/job/libvirt-go-xml-check/systems=libvirt-fedora-32/ws/> [libvirt-go-xml] $ /bin/sh -xe /tmp/jenkins8669560868351682495.sh + export 'TEST_ARGS=-tags xmlroundtrip' + TEST_ARGS='-tags xmlroundtrip' + go test -tags xmlroundtrip --- FAIL: TestRoundTrip (22.02s) xml_test.go:374: testdata/libvirt/tests/qemuxml2argvdata/downscript.xml: /domain[0]/devices[0]/interface[0]/downscript[0]: element in expected XML missing in actual XML FAIL exit status 1 FAIL _<https://ci.centos.org/job/libvirt-go-xml-check/systems=libvirt-fedora-32/ws/> 22.195s Build step 'Execute shell' marked build as failure
1 7
0 0
Build failed in Jenkins: libvirt-go-xml-check » libvirt-fedora-31 #1258
by ci@centos.org 02 Jun '20

02 Jun '20
See <https://ci.centos.org/job/libvirt-go-xml-check/systems=libvirt-fedora-31/12…> ------------------------------------------ Started by upstream project "libvirt-go-xml-check" build number 1258 originally caused by: Started by upstream project "libvirt-go-xml-build" build number 1262 originally caused by: Started by upstream project "libvirt-build" build number 1451 originally caused by: Started by an SCM change Running as SYSTEM [EnvInject] - Loading node environment variables. Building remotely on libvirt-fedora-31 (libvirt) in workspace <https://ci.centos.org/job/libvirt-go-xml-check/systems=libvirt-fedora-31/ws/> [libvirt-go-xml] $ /bin/sh -xe /tmp/jenkins3298424323766526200.sh + export 'TEST_ARGS=-tags xmlroundtrip' + TEST_ARGS='-tags xmlroundtrip' + go test -tags xmlroundtrip --- FAIL: TestRoundTrip (22.67s) xml_test.go:374: testdata/libvirt/tests/qemuxml2argvdata/downscript.xml: /domain[0]/devices[0]/interface[0]/downscript[0]: element in expected XML missing in actual XML FAIL exit status 1 FAIL _<https://ci.centos.org/job/libvirt-go-xml-check/systems=libvirt-fedora-31/ws/> 22.847s Build step 'Execute shell' marked build as failure
1 7
0 0
  • ← Newer
  • 1
  • 2
  • 3
  • 4
  • 5
  • 6
  • 7
  • 8
  • Older →

HyperKitty Powered by HyperKitty version 1.3.12.