libvirt List Archives
Sign In Sign Up
Manage this list Sign In Sign Up

Keyboard Shortcuts

Thread View

  • j: Next unread message
  • k: Previous unread message
  • j a: Jump to all threads
  • j l: Jump to MailingList overview

CI

Thread Start a new thread
Download
Threads by month
  • ----- 2025 -----
  • August
  • July
  • June
  • May
  • April
  • March
  • February
  • January
  • ----- 2024 -----
  • December
  • November
  • October
  • September
  • August
  • July
  • June
  • May
  • April
  • March
  • February
  • January
  • ----- 2023 -----
  • December
  • November
  • October
  • September
  • August
  • July
  • June
  • May
  • April
  • March
  • February
  • January
  • ----- 2022 -----
  • December
  • November
  • October
  • September
  • August
  • July
  • June
  • May
  • April
  • March
  • February
  • January
  • ----- 2021 -----
  • December
  • November
  • October
  • September
  • August
  • July
  • June
  • May
  • April
  • March
  • February
  • January
  • ----- 2020 -----
  • December
  • November
  • October
  • September
  • August
  • July
  • June
  • May
  • April
  • March
  • February
  • January
  • ----- 2019 -----
  • December
  • November
  • October
  • September
  • August
  • July
  • June
  • May
  • April
  • March
  • February
  • January
  • ----- 2018 -----
  • December
  • November
  • October
  • September
  • August
  • July
  • June
  • May
  • April
  • March
  • February
  • January
  • ----- 2017 -----
  • December
  • November
  • October
  • September
  • August
  • July
  • June
  • May
  • April
  • March
  • February
  • January
  • ----- 2016 -----
  • December
  • November
  • October
  • September
  • August
  • July
ci@lists.libvirt.org

June 2020

  • 3 participants
  • 74 discussions
Build failed in Jenkins: libvirt-go-xml-check » libvirt-debian-10 #1292
by ci@centos.org 11 Jun '20

11 Jun '20
See <https://ci.centos.org/job/libvirt-go-xml-check/systems=libvirt-debian-10/12…> ------------------------------------------ Started by upstream project "libvirt-go-xml-check" build number 1292 originally caused by: Started by upstream project "libvirt-go-xml-build" build number 1296 originally caused by: Started by upstream project "libvirt-build" build number 1484 originally caused by: Started by an SCM change Running as SYSTEM [EnvInject] - Loading node environment variables. Building remotely on libvirt-debian-10 (libvirt) in workspace <https://ci.centos.org/job/libvirt-go-xml-check/systems=libvirt-debian-10/ws/> [libvirt-go-xml] $ /bin/sh -xe /tmp/jenkins4966455298854400718.sh + export TEST_ARGS=-tags xmlroundtrip + go test -tags xmlroundtrip --- FAIL: TestRoundTrip (27.17s) xml_test.go:374: testdata/libvirt/tests/domaincapsdata/qemu_1.5.3-q35.x86_64.xml: /domainCapabilities[0]/cpu[0]/mode[0]/enum[0]: element in expected XML missing in actual XML FAIL exit status 1 FAIL _<https://ci.centos.org/job/libvirt-go-xml-check/systems=libvirt-debian-10/ws/> 27.254s Build step 'Execute shell' marked build as failure
1 5
0 0
Build failed in Jenkins: libvirt-go-xml-check » libvirt-fedora-31 #1292
by ci@centos.org 11 Jun '20

11 Jun '20
See <https://ci.centos.org/job/libvirt-go-xml-check/systems=libvirt-fedora-31/12…> ------------------------------------------ Started by upstream project "libvirt-go-xml-check" build number 1292 originally caused by: Started by upstream project "libvirt-go-xml-build" build number 1296 originally caused by: Started by upstream project "libvirt-build" build number 1484 originally caused by: Started by an SCM change Running as SYSTEM [EnvInject] - Loading node environment variables. Building remotely on libvirt-fedora-31 (libvirt) in workspace <https://ci.centos.org/job/libvirt-go-xml-check/systems=libvirt-fedora-31/ws/> [libvirt-go-xml] $ /bin/sh -xe /tmp/jenkins17983656011602592562.sh + export 'TEST_ARGS=-tags xmlroundtrip' + TEST_ARGS='-tags xmlroundtrip' + go test -tags xmlroundtrip --- FAIL: TestRoundTrip (16.64s) xml_test.go:374: testdata/libvirt/tests/domaincapsdata/qemu_1.5.3-q35.x86_64.xml: /domainCapabilities[0]/cpu[0]/mode[0]/enum[0]: element in expected XML missing in actual XML FAIL exit status 1 FAIL _<https://ci.centos.org/job/libvirt-go-xml-check/systems=libvirt-fedora-31/ws/> 16.825s Build step 'Execute shell' marked build as failure
1 5
0 0
Build failed in Jenkins: libvirt-go-xml-check » libvirt-freebsd-12 #1292
by ci@centos.org 11 Jun '20

11 Jun '20
See <https://ci.centos.org/job/libvirt-go-xml-check/systems=libvirt-freebsd-12/1…> ------------------------------------------ Started by upstream project "libvirt-go-xml-check" build number 1292 originally caused by: Started by upstream project "libvirt-go-xml-build" build number 1296 originally caused by: Started by upstream project "libvirt-build" build number 1484 originally caused by: Started by an SCM change Running as SYSTEM [EnvInject] - Loading node environment variables. Building remotely on libvirt-freebsd-12 (libvirt) in workspace <https://ci.centos.org/job/libvirt-go-xml-check/systems=libvirt-freebsd-12/w…> [libvirt-go-xml] $ /bin/sh -xe /tmp/jenkins15217024526221980540.sh + export 'TEST_ARGS=-tags xmlroundtrip' + go test -tags xmlroundtrip --- FAIL: TestRoundTrip (11.65s) xml_test.go:374: testdata/libvirt/tests/domaincapsdata/qemu_1.5.3-q35.x86_64.xml: /domainCapabilities[0]/cpu[0]/mode[0]/enum[0]: element in expected XML missing in actual XML FAIL exit status 1 FAIL _/usr<https://ci.centos.org/job/libvirt-go-xml-check/systems=libvirt-freebsd-12/w…> 11.767s Build step 'Execute shell' marked build as failure
1 5
0 0
Build failed in Jenkins: libvirt-go-xml-check » libvirt-freebsd-11 #1292
by ci@centos.org 11 Jun '20

11 Jun '20
See <https://ci.centos.org/job/libvirt-go-xml-check/systems=libvirt-freebsd-11/1…> ------------------------------------------ Started by upstream project "libvirt-go-xml-check" build number 1292 originally caused by: Started by upstream project "libvirt-go-xml-build" build number 1296 originally caused by: Started by upstream project "libvirt-build" build number 1484 originally caused by: Started by an SCM change Running as SYSTEM [EnvInject] - Loading node environment variables. Building remotely on libvirt-freebsd-11 (libvirt) in workspace <https://ci.centos.org/job/libvirt-go-xml-check/systems=libvirt-freebsd-11/w…> [libvirt-go-xml] $ /bin/sh -xe /tmp/jenkins13570556419360955893.sh + export 'TEST_ARGS=-tags xmlroundtrip' + go test -tags xmlroundtrip --- FAIL: TestRoundTrip (7.66s) xml_test.go:374: testdata/libvirt/tests/domaincapsdata/qemu_1.5.3-q35.x86_64.xml: /domainCapabilities[0]/cpu[0]/mode[0]/enum[0]: element in expected XML missing in actual XML FAIL exit status 1 FAIL _/usr<https://ci.centos.org/job/libvirt-go-xml-check/systems=libvirt-freebsd-11/w…> 7.769s Build step 'Execute shell' marked build as failure
1 5
0 0
libvirt-go-xml | Pipeline #155073692 has failed for master | dd07f98a
by GitLab 11 Jun '20

11 Jun '20
Your pipeline has failed. Project: libvirt-go-xml ( https://gitlab.com/libvirt/libvirt-go-xml ) Branch: master ( https://gitlab.com/libvirt/libvirt-go-xml/-/commits/master ) Commit: dd07f98a ( https://gitlab.com/libvirt/libvirt-go-xml/-/commit/dd07f98a02788c19568e799e… ) Commit Message: Add 'downscript' for domain interfaces Signed... Commit Author: Daniel Berrange ( https://gitlab.com/berrange ) Pipeline #155073692 ( https://gitlab.com/libvirt/libvirt-go-xml/-/pipelines/155073692 ) triggered by Daniel Berrange ( https://gitlab.com/berrange ) had 5 failed builds. Job #590560179 ( https://gitlab.com/libvirt/libvirt-go-xml/-/jobs/590560179/raw ) Stage: build Name: go_1_11 Trace: Skipping Git submodules setup section_end:1591844769:get_sources section_start:1591844769:restore_cache Restoring cache section_end:1591844770:restore_cache section_start:1591844770:download_artifacts Downloading artifacts section_end:1591844772:download_artifacts section_start:1591844772:build_script Running before_script and script $ go test -timeout 10m -tags xmlroundtrip -v === RUN TestDomainSnapshot --- PASS: TestDomainSnapshot (0.00s) === RUN TestDomain --- PASS: TestDomain (0.01s) === RUN TestNetwork --- PASS: TestNetwork (0.00s) === RUN TestNodeDevice --- PASS: TestNodeDevice (0.00s) === RUN TestSecret --- PASS: TestSecret (0.00s) === RUN TestStoragePool --- PASS: TestStoragePool (0.00s) === RUN TestStorageVolume --- PASS: TestStorageVolume (0.00s) === RUN TestRoundTrip --- FAIL: TestRoundTrip (61.41s) xml_test.go:374: testdata/libvirt/tests/domaincapsdata/qemu_1.5.3-q35.x86_64.xml: /domainCapabilities[0]/cpu[0]/mode[0]/enum[0]: element in expected XML missing in actual XML FAIL exit status 1 FAIL _/builds/libvirt/libvirt-go-xml 61.429s section_end:1591844840:build_script section_start:1591844840:after_script Running after_script section_end:1591844841:after_script section_start:1591844841:upload_artifacts_on_failure Uploading artifacts for failed job section_end:1591844843:upload_artifacts_on_failure ERROR: Job failed: exit code 1  Job #590560269 ( https://gitlab.com/libvirt/libvirt-go-xml/-/jobs/590560269/raw ) Stage: build Name: go_1_13 Trace: Skipping Git submodules setup section_end:1591844769:get_sources section_start:1591844769:restore_cache Restoring cache section_end:1591844770:restore_cache section_start:1591844770:download_artifacts Downloading artifacts section_end:1591844771:download_artifacts section_start:1591844771:build_script Running before_script and script $ go test -timeout 10m -tags xmlroundtrip -v === RUN TestDomainSnapshot --- PASS: TestDomainSnapshot (0.00s) === RUN TestDomain --- PASS: TestDomain (0.01s) === RUN TestNetwork --- PASS: TestNetwork (0.00s) === RUN TestNodeDevice --- PASS: TestNodeDevice (0.00s) === RUN TestSecret --- PASS: TestSecret (0.00s) === RUN TestStoragePool --- PASS: TestStoragePool (0.00s) === RUN TestStorageVolume --- PASS: TestStorageVolume (0.00s) === RUN TestRoundTrip --- FAIL: TestRoundTrip (60.73s) xml_test.go:374: testdata/libvirt/tests/domaincapsdata/qemu_1.5.3-q35.x86_64.xml: /domainCapabilities[0]/cpu[0]/mode[0]/enum[0]: element in expected XML missing in actual XML FAIL exit status 1 FAIL _/builds/libvirt/libvirt-go-xml 60.748s section_end:1591844839:build_script section_start:1591844839:after_script Running after_script section_end:1591844840:after_script section_start:1591844840:upload_artifacts_on_failure Uploading artifacts for failed job section_end:1591844842:upload_artifacts_on_failure ERROR: Job failed: exit code 1  Job #590560157 ( https://gitlab.com/libvirt/libvirt-go-xml/-/jobs/590560157/raw ) Stage: build Name: go_1_10 Trace: Skipping Git submodules setup section_end:1591844766:get_sources section_start:1591844766:restore_cache Restoring cache section_end:1591844768:restore_cache section_start:1591844768:download_artifacts Downloading artifacts section_end:1591844769:download_artifacts section_start:1591844769:build_script Running before_script and script $ go test -timeout 10m -tags xmlroundtrip -v === RUN TestDomainSnapshot --- PASS: TestDomainSnapshot (0.00s) === RUN TestDomain --- PASS: TestDomain (0.01s) === RUN TestNetwork --- PASS: TestNetwork (0.00s) === RUN TestNodeDevice --- PASS: TestNodeDevice (0.00s) === RUN TestSecret --- PASS: TestSecret (0.00s) === RUN TestStoragePool --- PASS: TestStoragePool (0.00s) === RUN TestStorageVolume --- PASS: TestStorageVolume (0.00s) === RUN TestRoundTrip --- FAIL: TestRoundTrip (64.40s) xml_test.go:374: testdata/libvirt/tests/domaincapsdata/qemu_1.5.3-q35.x86_64.xml: /domainCapabilities[0]/cpu[0]/mode[0]/enum[0]: element in expected XML missing in actual XML FAIL exit status 1 FAIL _/builds/libvirt/libvirt-go-xml 64.416s section_end:1591844838:build_script section_start:1591844838:after_script Running after_script section_end:1591844840:after_script section_start:1591844840:upload_artifacts_on_failure Uploading artifacts for failed job section_end:1591844841:upload_artifacts_on_failure ERROR: Job failed: exit code 1  Job #590560290 ( https://gitlab.com/libvirt/libvirt-go-xml/-/jobs/590560290/raw ) Stage: build Name: go_1_14 Trace: Skipping Git submodules setup section_end:1591844769:get_sources section_start:1591844769:restore_cache Restoring cache section_end:1591844770:restore_cache section_start:1591844770:download_artifacts Downloading artifacts section_end:1591844772:download_artifacts section_start:1591844772:build_script Running before_script and script $ go test -timeout 10m -tags xmlroundtrip -v === RUN TestDomainSnapshot --- PASS: TestDomainSnapshot (0.00s) === RUN TestDomain --- PASS: TestDomain (0.01s) === RUN TestNetwork --- PASS: TestNetwork (0.00s) === RUN TestNodeDevice --- PASS: TestNodeDevice (0.00s) === RUN TestSecret --- PASS: TestSecret (0.00s) === RUN TestStoragePool --- PASS: TestStoragePool (0.00s) === RUN TestStorageVolume --- PASS: TestStorageVolume (0.00s) === RUN TestRoundTrip TestRoundTrip: xml_test.go:374: testdata/libvirt/tests/domaincapsdata/qemu_1.5.3-q35.x86_64.xml: /domainCapabilities[0]/cpu[0]/mode[0]/enum[0]: element in expected XML missing in actual XML --- FAIL: TestRoundTrip (59.68s) FAIL exit status 1 FAIL _/builds/libvirt/libvirt-go-xml 59.692s section_end:1591844838:build_script section_start:1591844838:after_script Running after_script section_end:1591844840:after_script section_start:1591844840:upload_artifacts_on_failure Uploading artifacts for failed job section_end:1591844841:upload_artifacts_on_failure ERROR: Job failed: exit code 1  Job #590560242 ( https://gitlab.com/libvirt/libvirt-go-xml/-/jobs/590560242/raw ) Stage: build Name: go_1_12 Trace: Skipping Git submodules setup section_end:1591844767:get_sources section_start:1591844767:restore_cache Restoring cache section_end:1591844769:restore_cache section_start:1591844769:download_artifacts Downloading artifacts section_end:1591844770:download_artifacts section_start:1591844770:build_script Running before_script and script $ go test -timeout 10m -tags xmlroundtrip -v === RUN TestDomainSnapshot --- PASS: TestDomainSnapshot (0.00s) === RUN TestDomain --- PASS: TestDomain (0.01s) === RUN TestNetwork --- PASS: TestNetwork (0.00s) === RUN TestNodeDevice --- PASS: TestNodeDevice (0.00s) === RUN TestSecret --- PASS: TestSecret (0.00s) === RUN TestStoragePool --- PASS: TestStoragePool (0.00s) === RUN TestStorageVolume --- PASS: TestStorageVolume (0.00s) === RUN TestRoundTrip --- FAIL: TestRoundTrip (61.96s) xml_test.go:374: testdata/libvirt/tests/domaincapsdata/qemu_1.5.3-q35.x86_64.xml: /domainCapabilities[0]/cpu[0]/mode[0]/enum[0]: element in expected XML missing in actual XML FAIL exit status 1 FAIL _/builds/libvirt/libvirt-go-xml 61.968s section_end:1591844838:build_script section_start:1591844838:after_script Running after_script section_end:1591844840:after_script section_start:1591844840:upload_artifacts_on_failure Uploading artifacts for failed job section_end:1591844841:upload_artifacts_on_failure ERROR: Job failed: exit code 1  -- You're receiving this email because of your account on gitlab.com.
1 0
0 0
libvirt | Pipeline #154943070 has failed for master | 0d009ca6
by GitLab 10 Jun '20

10 Jun '20
Your pipeline has failed. Project: libvirt ( https://gitlab.com/libvirt/libvirt ) Branch: master ( https://gitlab.com/libvirt/libvirt/-/commits/master ) Commit: 0d009ca6 ( https://gitlab.com/libvirt/libvirt/-/commit/0d009ca646a4e7438952f6d2739ab7f… ) Commit Message: ci: Reduce number of stages Right now we're di... Commit Author: Andrea Bolognani ( https://gitlab.com/abologna ) Pipeline #154943070 ( https://gitlab.com/libvirt/libvirt/-/pipelines/154943070 ) triggered by Andrea Bolognani ( https://gitlab.com/abologna ) had 2 failed builds. Job #589985579 ( https://gitlab.com/libvirt/libvirt/-/jobs/589985579/raw ) Stage: builds Name: x64-freebsd-12-build Trace: ............................................................ ............................................................ ............................................................ ............................................................ ............................................................ ............................................................ ............................................................ ............................................................ ............................................................ ............................................................ ............................................................ ............................................................ ............................................................ ............................................................ ............................................................ ............................................................ ............................................................ ............................................................ ............................................................ ............................................................ ............................................................ ............................................................ .....................section_end:1591814053:build_script section_start:1591814053:after_script Running after_script WARNING: Failed to inspect build container baccb07e0e2c7fc9cebc23e6d14cf20b2df01bfc0d8a57fbdc2039f1f38df1a0 context deadline exceeded (docker_command.go:78:0s) Authenticating with credentials from job payload (GitLab Registry) Pulling docker image registry.gitlab.com/libvirt/libvirt-ci/cirrus-run:master ... section_end:1591814053:after_script section_start:1591814053:upload_artifacts_on_failure Uploading artifacts for failed job Pulling docker image gitlab/gitlab-runner-helper:x86_64-c127439c ... section_end:1591814053:upload_artifacts_on_failure ERROR: Job failed: execution took longer than 1h0m0s seconds  Job #589985581 ( https://gitlab.com/libvirt/libvirt/-/jobs/589985581/raw ) Stage: builds Name: x64-macos-1015-build Trace: ............................................................ ............................................................ ............................................................ ............................................................ ............................................................ ............................................................ ............................................................ ............................................................ ............................................................ ............................................................ ............................................................ ............................................................ ............................................................ ............................................................ ............................................................ ............................................................ ............................................................ ............................................................ ............................................................ ............................................................ ............................................................ ............................................................ ......................section_end:1591814051:build_script section_start:1591814051:after_script Running after_script WARNING: Failed to inspect build container 0e6eb910c70ce99e9cef5ae50fa1d74cbe6e6d333a5e83c2d0b7662428be185e context deadline exceeded (docker_command.go:78:0s) Authenticating with credentials from job payload (GitLab Registry) Pulling docker image registry.gitlab.com/libvirt/libvirt-ci/cirrus-run:master ... section_end:1591814051:after_script section_start:1591814051:upload_artifacts_on_failure Uploading artifacts for failed job Pulling docker image gitlab/gitlab-runner-helper:x86_64-c127439c ... section_end:1591814051:upload_artifacts_on_failure ERROR: Job failed: execution took longer than 1h0m0s seconds  -- You're receiving this email because of your account on gitlab.com.
1 0
0 0
libvirt-go-xml | Pipeline #154641496 has failed for master | dd07f98a
by GitLab 10 Jun '20

10 Jun '20
Your pipeline has failed. Project: libvirt-go-xml ( https://gitlab.com/libvirt/libvirt-go-xml ) Branch: master ( https://gitlab.com/libvirt/libvirt-go-xml/-/commits/master ) Commit: dd07f98a ( https://gitlab.com/libvirt/libvirt-go-xml/-/commit/dd07f98a02788c19568e799e… ) Commit Message: Add 'downscript' for domain interfaces Signed... Commit Author: Daniel Berrange ( https://gitlab.com/berrange ) Pipeline #154641496 ( https://gitlab.com/libvirt/libvirt-go-xml/-/pipelines/154641496 ) triggered by Daniel Berrange ( https://gitlab.com/berrange ) had 5 failed builds. Job #588666245 ( https://gitlab.com/libvirt/libvirt-go-xml/-/jobs/588666245/raw ) Stage: build Name: go_1_13 Trace: Skipping Git submodules setup section_end:1591758372:get_sources section_start:1591758372:restore_cache Restoring cache section_end:1591758374:restore_cache section_start:1591758374:download_artifacts Downloading artifacts section_end:1591758375:download_artifacts section_start:1591758375:build_script Running before_script and script $ go test -timeout 10m -tags xmlroundtrip -v === RUN TestDomainSnapshot --- PASS: TestDomainSnapshot (0.00s) === RUN TestDomain --- PASS: TestDomain (0.01s) === RUN TestNetwork --- PASS: TestNetwork (0.00s) === RUN TestNodeDevice --- PASS: TestNodeDevice (0.00s) === RUN TestSecret --- PASS: TestSecret (0.00s) === RUN TestStoragePool --- PASS: TestStoragePool (0.00s) === RUN TestStorageVolume --- PASS: TestStorageVolume (0.00s) === RUN TestRoundTrip --- FAIL: TestRoundTrip (61.56s) xml_test.go:374: testdata/libvirt/tests/domaincapsdata/qemu_1.5.3-q35.x86_64.xml: /domainCapabilities[0]/cpu[0]/mode[0]/enum[0]: element in expected XML missing in actual XML FAIL exit status 1 FAIL _/builds/libvirt/libvirt-go-xml 61.578s section_end:1591758444:build_script section_start:1591758444:after_script Running after_script section_end:1591758445:after_script section_start:1591758445:upload_artifacts_on_failure Uploading artifacts for failed job section_end:1591758447:upload_artifacts_on_failure ERROR: Job failed: exit code 1  Job #588666246 ( https://gitlab.com/libvirt/libvirt-go-xml/-/jobs/588666246/raw ) Stage: build Name: go_1_14 Trace: Skipping Git submodules setup section_end:1591758371:get_sources section_start:1591758371:restore_cache Restoring cache section_end:1591758373:restore_cache section_start:1591758373:download_artifacts Downloading artifacts section_end:1591758374:download_artifacts section_start:1591758374:build_script Running before_script and script $ go test -timeout 10m -tags xmlroundtrip -v === RUN TestDomainSnapshot --- PASS: TestDomainSnapshot (0.00s) === RUN TestDomain --- PASS: TestDomain (0.01s) === RUN TestNetwork --- PASS: TestNetwork (0.00s) === RUN TestNodeDevice --- PASS: TestNodeDevice (0.00s) === RUN TestSecret --- PASS: TestSecret (0.00s) === RUN TestStoragePool --- PASS: TestStoragePool (0.00s) === RUN TestStorageVolume --- PASS: TestStorageVolume (0.00s) === RUN TestRoundTrip TestRoundTrip: xml_test.go:374: testdata/libvirt/tests/domaincapsdata/qemu_1.5.3-q35.x86_64.xml: /domainCapabilities[0]/cpu[0]/mode[0]/enum[0]: element in expected XML missing in actual XML --- FAIL: TestRoundTrip (60.48s) FAIL exit status 1 FAIL _/builds/libvirt/libvirt-go-xml 60.495s section_end:1591758442:build_script section_start:1591758442:after_script Running after_script section_end:1591758444:after_script section_start:1591758444:upload_artifacts_on_failure Uploading artifacts for failed job section_end:1591758445:upload_artifacts_on_failure ERROR: Job failed: exit code 1  Job #588666240 ( https://gitlab.com/libvirt/libvirt-go-xml/-/jobs/588666240/raw ) Stage: build Name: go_1_11 Trace: Skipping Git submodules setup section_end:1591758371:get_sources section_start:1591758371:restore_cache Restoring cache section_end:1591758373:restore_cache section_start:1591758373:download_artifacts Downloading artifacts section_end:1591758374:download_artifacts section_start:1591758374:build_script Running before_script and script $ go test -timeout 10m -tags xmlroundtrip -v === RUN TestDomainSnapshot --- PASS: TestDomainSnapshot (0.00s) === RUN TestDomain --- PASS: TestDomain (0.01s) === RUN TestNetwork --- PASS: TestNetwork (0.00s) === RUN TestNodeDevice --- PASS: TestNodeDevice (0.00s) === RUN TestSecret --- PASS: TestSecret (0.00s) === RUN TestStoragePool --- PASS: TestStoragePool (0.00s) === RUN TestStorageVolume --- PASS: TestStorageVolume (0.00s) === RUN TestRoundTrip --- FAIL: TestRoundTrip (61.10s) xml_test.go:374: testdata/libvirt/tests/domaincapsdata/qemu_1.5.3-q35.x86_64.xml: /domainCapabilities[0]/cpu[0]/mode[0]/enum[0]: element in expected XML missing in actual XML FAIL exit status 1 FAIL _/builds/libvirt/libvirt-go-xml 61.112s section_end:1591758442:build_script section_start:1591758442:after_script Running after_script section_end:1591758444:after_script section_start:1591758444:upload_artifacts_on_failure Uploading artifacts for failed job section_end:1591758445:upload_artifacts_on_failure ERROR: Job failed: exit code 1  Job #588666244 ( https://gitlab.com/libvirt/libvirt-go-xml/-/jobs/588666244/raw ) Stage: build Name: go_1_12 Trace: Skipping Git submodules setup section_end:1591758372:get_sources section_start:1591758372:restore_cache Restoring cache section_end:1591758374:restore_cache section_start:1591758374:download_artifacts Downloading artifacts section_end:1591758375:download_artifacts section_start:1591758375:build_script Running before_script and script $ go test -timeout 10m -tags xmlroundtrip -v === RUN TestDomainSnapshot --- PASS: TestDomainSnapshot (0.00s) === RUN TestDomain --- PASS: TestDomain (0.01s) === RUN TestNetwork --- PASS: TestNetwork (0.00s) === RUN TestNodeDevice --- PASS: TestNodeDevice (0.00s) === RUN TestSecret --- PASS: TestSecret (0.00s) === RUN TestStoragePool --- PASS: TestStoragePool (0.00s) === RUN TestStorageVolume --- PASS: TestStorageVolume (0.00s) === RUN TestRoundTrip --- FAIL: TestRoundTrip (59.22s) xml_test.go:374: testdata/libvirt/tests/domaincapsdata/qemu_1.5.3-q35.x86_64.xml: /domainCapabilities[0]/cpu[0]/mode[0]/enum[0]: element in expected XML missing in actual XML FAIL exit status 1 FAIL _/builds/libvirt/libvirt-go-xml 59.233s section_end:1591758442:build_script section_start:1591758442:after_script Running after_script section_end:1591758443:after_script section_start:1591758443:upload_artifacts_on_failure Uploading artifacts for failed job section_end:1591758445:upload_artifacts_on_failure ERROR: Job failed: exit code 1  Job #588666238 ( https://gitlab.com/libvirt/libvirt-go-xml/-/jobs/588666238/raw ) Stage: build Name: go_1_10 Trace: Skipping Git submodules setup section_end:1591758369:get_sources section_start:1591758369:restore_cache Restoring cache section_end:1591758371:restore_cache section_start:1591758371:download_artifacts Downloading artifacts section_end:1591758372:download_artifacts section_start:1591758372:build_script Running before_script and script $ go test -timeout 10m -tags xmlroundtrip -v === RUN TestDomainSnapshot --- PASS: TestDomainSnapshot (0.00s) === RUN TestDomain --- PASS: TestDomain (0.01s) === RUN TestNetwork --- PASS: TestNetwork (0.00s) === RUN TestNodeDevice --- PASS: TestNodeDevice (0.00s) === RUN TestSecret --- PASS: TestSecret (0.00s) === RUN TestStoragePool --- PASS: TestStoragePool (0.00s) === RUN TestStorageVolume --- PASS: TestStorageVolume (0.00s) === RUN TestRoundTrip --- FAIL: TestRoundTrip (62.01s) xml_test.go:374: testdata/libvirt/tests/domaincapsdata/qemu_1.5.3-q35.x86_64.xml: /domainCapabilities[0]/cpu[0]/mode[0]/enum[0]: element in expected XML missing in actual XML FAIL exit status 1 FAIL _/builds/libvirt/libvirt-go-xml 62.026s section_end:1591758439:build_script section_start:1591758439:after_script Running after_script section_end:1591758440:after_script section_start:1591758440:upload_artifacts_on_failure Uploading artifacts for failed job section_end:1591758442:upload_artifacts_on_failure ERROR: Job failed: exit code 1  -- You're receiving this email because of your account on gitlab.com.
1 0
0 0
Build failed in Jenkins: libvirt-check » libvirt-freebsd-12 #1214
by ci@centos.org 09 Jun '20

09 Jun '20
See <https://ci.centos.org/job/libvirt-check/systems=libvirt-freebsd-12/1214/dis…> ------------------------------------------ [...truncated 2.75 KB...] /usr/local/bin/gmake all-recursive gmake[4]: Entering directory '/usr<https://ci.centos.org/job/libvirt-check/systems=libvirt-freebsd-12/ws/build'> Making all in . gmake[5]: Entering directory '/usr<https://ci.centos.org/job/libvirt-check/systems=libvirt-freebsd-12/ws/build'> gmake[5]: Leaving directory '/usr<https://ci.centos.org/job/libvirt-check/systems=libvirt-freebsd-12/ws/build'> Making all in include/libvirt gmake[5]: Entering directory '/usr<https://ci.centos.org/job/libvirt-check/systems=libvirt-freebsd-12/ws/build…'> gmake[5]: Nothing to be done for 'all'. gmake[5]: Leaving directory '/usr<https://ci.centos.org/job/libvirt-check/systems=libvirt-freebsd-12/ws/build…'> Making all in src gmake[5]: Entering directory '/usr<https://ci.centos.org/job/libvirt-check/systems=libvirt-freebsd-12/ws/build…'> /usr/local/bin/gmake all-am gmake[6]: Entering directory '/usr<https://ci.centos.org/job/libvirt-check/systems=libvirt-freebsd-12/ws/build…'> gmake[6]: Nothing to be done for 'all-am'. gmake[6]: Leaving directory '/usr<https://ci.centos.org/job/libvirt-check/systems=libvirt-freebsd-12/ws/build…'> gmake[5]: Leaving directory '/usr<https://ci.centos.org/job/libvirt-check/systems=libvirt-freebsd-12/ws/build…'> Making all in tools gmake[5]: Entering directory '/usr<https://ci.centos.org/job/libvirt-check/systems=libvirt-freebsd-12/ws/build…'> /usr/local/bin/gmake all-am gmake[6]: Entering directory '/usr<https://ci.centos.org/job/libvirt-check/systems=libvirt-freebsd-12/ws/build…'> gmake[6]: Nothing to be done for 'all-am'. gmake[6]: Leaving directory '/usr<https://ci.centos.org/job/libvirt-check/systems=libvirt-freebsd-12/ws/build…'> gmake[5]: Leaving directory '/usr<https://ci.centos.org/job/libvirt-check/systems=libvirt-freebsd-12/ws/build…'> Making all in docs gmake[5]: Entering directory '/usr<https://ci.centos.org/job/libvirt-check/systems=libvirt-freebsd-12/ws/build…'> gmake[5]: Leaving directory '/usr<https://ci.centos.org/job/libvirt-check/systems=libvirt-freebsd-12/ws/build…'> Making all in tests gmake[5]: Entering directory '/usr<https://ci.centos.org/job/libvirt-check/systems=libvirt-freebsd-12/ws/build…'> gmake[5]: Nothing to be done for 'all'. gmake[5]: Leaving directory '/usr<https://ci.centos.org/job/libvirt-check/systems=libvirt-freebsd-12/ws/build…'> Making all in po gmake[5]: Entering directory '/usr<https://ci.centos.org/job/libvirt-check/systems=libvirt-freebsd-12/ws/build…'> gmake[5]: Nothing to be done for 'all'. gmake[5]: Leaving directory '/usr<https://ci.centos.org/job/libvirt-check/systems=libvirt-freebsd-12/ws/build…'> Making all in examples gmake[5]: Entering directory '/usr<https://ci.centos.org/job/libvirt-check/systems=libvirt-freebsd-12/ws/build…'> gmake[5]: Nothing to be done for 'all'. gmake[5]: Leaving directory '/usr<https://ci.centos.org/job/libvirt-check/systems=libvirt-freebsd-12/ws/build…'> gmake[4]: Leaving directory '/usr<https://ci.centos.org/job/libvirt-check/systems=libvirt-freebsd-12/ws/build'> gmake[3]: Leaving directory '/usr<https://ci.centos.org/job/libvirt-check/systems=libvirt-freebsd-12/ws/build'> gmake[2]: Leaving directory '/usr<https://ci.centos.org/job/libvirt-check/systems=libvirt-freebsd-12/ws/build'> Making check in include/libvirt gmake[2]: Entering directory '/usr<https://ci.centos.org/job/libvirt-check/systems=libvirt-freebsd-12/ws/build…'> gmake[2]: Nothing to be done for 'check'. gmake[2]: Leaving directory '/usr<https://ci.centos.org/job/libvirt-check/systems=libvirt-freebsd-12/ws/build…'> Making check in src gmake[2]: Entering directory '/usr<https://ci.centos.org/job/libvirt-check/systems=libvirt-freebsd-12/ws/build…'> /usr/local/bin/gmake check-am gmake[3]: Entering directory '/usr<https://ci.centos.org/job/libvirt-check/systems=libvirt-freebsd-12/ws/build…'> /usr/local/bin/gmake check-local gmake[4]: Entering directory '/usr<https://ci.centos.org/job/libvirt-check/systems=libvirt-freebsd-12/ws/build…'> GEN ../../src/remote_protocol-struct GEN ../../src/lxc_protocol-struct GEN ../../src/qemu_protocol-struct WARNING: skipping pdwtags test with Clang WARNING: skipping pdwtags test with Clang GEN ../../src/virkeepaliveprotocol-struct GEN ../../src/virnetprotocol-struct WARNING: skipping pdwtags test with Clang WARNING: skipping pdwtags test with Clang GEN ../../src/lock_protocol-struct WARNING: skipping pdwtags test with Clang GEN check-symsorting GEN ../../src/admin_protocol-struct WARNING: skipping pdwtags test with Clang GEN check-drivername WARNING: skipping pdwtags test with Clang GEN check-driverimpls GEN check-aclrules GEN check-aclperms GEN check-admin-symsorting GEN check-admin-drivername GEN check-augeas gmake[4]: Leaving directory '/usr<https://ci.centos.org/job/libvirt-check/systems=libvirt-freebsd-12/ws/build…'> gmake[3]: Leaving directory '/usr<https://ci.centos.org/job/libvirt-check/systems=libvirt-freebsd-12/ws/build…'> gmake[2]: Leaving directory '/usr<https://ci.centos.org/job/libvirt-check/systems=libvirt-freebsd-12/ws/build…'> Making check in tools gmake[2]: Entering directory '/usr<https://ci.centos.org/job/libvirt-check/systems=libvirt-freebsd-12/ws/build…'> /usr/local/bin/gmake check-am gmake[3]: Entering directory '/usr<https://ci.centos.org/job/libvirt-check/systems=libvirt-freebsd-12/ws/build…'> gmake[3]: Nothing to be done for 'check-am'. gmake[3]: Leaving directory '/usr<https://ci.centos.org/job/libvirt-check/systems=libvirt-freebsd-12/ws/build…'> gmake[2]: Leaving directory '/usr<https://ci.centos.org/job/libvirt-check/systems=libvirt-freebsd-12/ws/build…'> Making check in docs gmake[2]: Entering directory '/usr<https://ci.centos.org/job/libvirt-check/systems=libvirt-freebsd-12/ws/build…'> /usr/local/bin/gmake check-local gmake[3]: Entering directory '/usr<https://ci.centos.org/job/libvirt-check/systems=libvirt-freebsd-12/ws/build…'> /usr/local/bin/xmllint --nonet --noout html/*.html gmake[3]: Leaving directory '/usr<https://ci.centos.org/job/libvirt-check/systems=libvirt-freebsd-12/ws/build…'> gmake[2]: Leaving directory '/usr<https://ci.centos.org/job/libvirt-check/systems=libvirt-freebsd-12/ws/build…'> Making check in tests gmake[2]: Entering directory '/usr<https://ci.centos.org/job/libvirt-check/systems=libvirt-freebsd-12/ws/build…'> /usr/local/bin/gmake gmake[3]: Entering directory '/usr<https://ci.centos.org/job/libvirt-check/systems=libvirt-freebsd-12/ws/build…'> gmake[3]: Nothing to be done for 'all'. gmake[3]: Leaving directory '/usr<https://ci.centos.org/job/libvirt-check/systems=libvirt-freebsd-12/ws/build…'> /usr/local/bin/gmake check-TESTS gmake[3]: Entering directory '/usr<https://ci.centos.org/job/libvirt-check/systems=libvirt-freebsd-12/ws/build…'> gmake[4]: Entering directory '/usr<https://ci.centos.org/job/libvirt-check/systems=libvirt-freebsd-12/ws/build…'> SKIP: virhostcputest PASS: sockettest PASS: virbuftest PASS: seclabeltest PASS: virhashtest PASS: virconftest PASS: utiltest SKIP: shunloadtest PASS: virtimetest PASS: viruritest PASS: viralloctest PASS: commandtest PASS: virauthconfigtest SKIP: vircgrouptest PASS: virbitmaptest SKIP: virpcitest PASS: virendiantest PASS: vircryptotest PASS: virfiletest PASS: virfilecachetest SKIP: virfirewalltest PASS: viriscsitest PASS: virkeycodetest PASS: virlockspacetest PASS: virlogtest PASS: virrotatingfiletest PASS: virstringtest SKIP: virportallocatortest PASS: sysinfotest SKIP: virkmodtest PASS: vircapstest PASS: domaincapstest PASS: domainconftest SKIP: virhostdevtest SKIP: virnetdevtest PASS: virtypedparamtest PASS: vshtabletest PASS: virerrortest PASS: virnetmessagetest PASS: virnetsockettest PASS: virnetdaemontest PASS: virnetserverclienttest PASS: virshtest SKIP: virnettlscontexttest SKIP: virnettlssessiontest PASS: fdstreamtest PASS: virdbustest SKIP: virsystemdtest PASS: virpolkittest PASS: qemuxml2xmltest PASS: qemudomaincheckpointxml2xmltest PASS: qemudomainsnapshotxml2xmltest PASS: virschematest PASS: qemumonitorjsontest PASS: qemuagenttest PASS: qemuhotplugtest PASS: qemucaps2xmltest PASS: qemumemlocktest PASS: qemucommandutiltest PASS: qemublocktest PASS: qemumigparamstest PASS: qemusecuritytest PASS: qemufirmwaretest PASS: qemuvhostusertest PASS: esxutilstest PASS: vboxsnapshotxmltest PASS: vmx2xmltest PASS: xml2vmxtest PASS: vmwarevertest PASS: bhyvexml2argvtest PASS: bhyvexml2xmltest PASS: bhyveargv2xmltest PASS: virjsontest PASS: networkxml2xmlupdatetest PASS: virnetworkportxml2xmltest PASS: networkxml2xmltest PASS: networkxml2conftest SKIP: networkxml2firewalltest PASS: qemucapabilitiestest PASS: virnwfilterbindingxml2xmltest PASS: storagevolxml2argvtest PASS: nwfilterxml2xmltest PASS: virstorageutiltest PASS: storagepoolxml2argvtest PASS: storagepoolxml2xmltest PASS: nsstest PASS: storagepoolcapstest PASS: storagevolxml2xmltest PASS: nodedevxml2xmltest PASS: interfacexml2xmltest PASS: nssguesttest PASS: metadatatest PASS: secretxml2xmltest PASS: genericxml2xmltest FAIL: eventtest PASS: virdrivermoduletest PASS: virdriverconnvalidatetest PASS: objecteventtest PASS: virmacmaptest PASS: qemuxml2argvtest PASS: virnetdevopenvswitchtest PASS: libvirtd-pool PASS: libvirtd-fail PASS: virsh-auth PASS: virsh-define-dev-segfault PASS: virsh-cpuset SKIP: virsh-optparse PASS: virsh-int-overflow PASS: virsh-read-non-seekable PASS: virsh-read-bufsiz PASS: virsh-schedinfo PASS: virsh-self-test PASS: virt-admin-self-test PASS: virsh-checkpoint PASS: virsh-start PASS: virsh-undefine PASS: virsh-snapshot PASS: virsh-vcpupin PASS: virsh-uriprecedence PASS: cputest ============================================================================ Testsuite summary for libvirt 6.5.0 ============================================================================ # TOTAL: 120 # PASS: 105 # SKIP: 14 # XFAIL: 0 # FAIL: 1 # XPASS: 0 # ERROR: 0 ============================================================================ See tests/test-suite.log Please report to libvir-list(a)redhat.com ============================================================================ gmake[4]: *** [Makefile:4840: test-suite.log] Error 1 gmake[4]: Leaving directory '/usr<https://ci.centos.org/job/libvirt-check/systems=libvirt-freebsd-12/ws/build…'> gmake[3]: *** [Makefile:4948: check-TESTS] Error 2 gmake[3]: Leaving directory '/usr<https://ci.centos.org/job/libvirt-check/systems=libvirt-freebsd-12/ws/build…'> gmake[2]: *** [Makefile:6002: check-am] Error 2 gmake[2]: Leaving directory '/usr<https://ci.centos.org/job/libvirt-check/systems=libvirt-freebsd-12/ws/build…'> gmake[1]: *** [Makefile:804: check-recursive] Error 1 gmake[1]: Leaving directory '/usr<https://ci.centos.org/job/libvirt-check/systems=libvirt-freebsd-12/ws/build'> gmake: *** [Makefile:1099: check] Error 2 + find -name test-suite.log + xargs cat find: illegal option -- n usage: find [-H | -L | -P] [-EXdsx] [-f path] path ... [expression] find [-H | -L | -P] [-EXdsx] -f path [path ...] [expression] + exit 1 Build step 'Execute shell' marked build as failure
1 1
0 0
Build failed in Jenkins: libvirt-rpm » libvirt-fedora-rawhide #1119
by ci@centos.org 08 Jun '20

08 Jun '20
See <https://ci.centos.org/job/libvirt-rpm/systems=libvirt-fedora-rawhide/1119/d…> ------------------------------------------ [...truncated 6.81 MB...] make[4]: Leaving directory '<https://ci.centos.org/job/libvirt-rpm/systems=libvirt-fedora-rawhide/ws/bui…'> make[3]: Leaving directory '<https://ci.centos.org/job/libvirt-rpm/systems=libvirt-fedora-rawhide/ws/bui…'> make[2]: Leaving directory '<https://ci.centos.org/job/libvirt-rpm/systems=libvirt-fedora-rawhide/ws/bui…'> Making check in include/libvirt make[2]: Entering directory '<https://ci.centos.org/job/libvirt-rpm/systems=libvirt-fedora-rawhide/ws/bui…'> make[2]: Nothing to be done for 'check'. make[2]: Leaving directory '<https://ci.centos.org/job/libvirt-rpm/systems=libvirt-fedora-rawhide/ws/bui…'> Making check in src make[2]: Entering directory '<https://ci.centos.org/job/libvirt-rpm/systems=libvirt-fedora-rawhide/ws/bui…'> /usr/bin/make check-am make[3]: Entering directory '<https://ci.centos.org/job/libvirt-rpm/systems=libvirt-fedora-rawhide/ws/bui…'> /usr/bin/make check-local make[4]: Entering directory '<https://ci.centos.org/job/libvirt-rpm/systems=libvirt-fedora-rawhide/ws/bui…'> GEN ../../src/remote_protocol-struct GEN ../../src/lxc_protocol-struct GEN ../../src/qemu_protocol-struct GEN ../../src/virnetprotocol-struct GEN ../../src/virkeepaliveprotocol-struct GEN ../../src/lxc_monitor_protocol-struct GEN ../../src/lock_protocol-struct GEN ../../src/admin_protocol-struct GEN check-symfile GEN check-symsorting GEN check-drivername GEN check-driverimpls GEN check-aclrules GEN check-aclperms GEN check-admin-symfile GEN check-admin-symsorting GEN check-admin-drivername GEN check-augeas make[4]: Leaving directory '<https://ci.centos.org/job/libvirt-rpm/systems=libvirt-fedora-rawhide/ws/bui…'> make[3]: Leaving directory '<https://ci.centos.org/job/libvirt-rpm/systems=libvirt-fedora-rawhide/ws/bui…'> make[2]: Leaving directory '<https://ci.centos.org/job/libvirt-rpm/systems=libvirt-fedora-rawhide/ws/bui…'> Making check in tools make[2]: Entering directory '<https://ci.centos.org/job/libvirt-rpm/systems=libvirt-fedora-rawhide/ws/bui…'> /usr/bin/make check-am make[3]: Entering directory '<https://ci.centos.org/job/libvirt-rpm/systems=libvirt-fedora-rawhide/ws/bui…'> make[3]: Nothing to be done for 'check-am'. make[3]: Leaving directory '<https://ci.centos.org/job/libvirt-rpm/systems=libvirt-fedora-rawhide/ws/bui…'> make[2]: Leaving directory '<https://ci.centos.org/job/libvirt-rpm/systems=libvirt-fedora-rawhide/ws/bui…'> Making check in docs make[2]: Entering directory '<https://ci.centos.org/job/libvirt-rpm/systems=libvirt-fedora-rawhide/ws/bui…'> /usr/bin/make check-local make[3]: Entering directory '<https://ci.centos.org/job/libvirt-rpm/systems=libvirt-fedora-rawhide/ws/bui…'> /usr/bin/xmllint --nonet --noout html/*.html make[3]: Leaving directory '<https://ci.centos.org/job/libvirt-rpm/systems=libvirt-fedora-rawhide/ws/bui…'> make[2]: Leaving directory '<https://ci.centos.org/job/libvirt-rpm/systems=libvirt-fedora-rawhide/ws/bui…'> Making check in tests make[2]: Entering directory '<https://ci.centos.org/job/libvirt-rpm/systems=libvirt-fedora-rawhide/ws/bui…'> /usr/bin/make make[3]: Entering directory '<https://ci.centos.org/job/libvirt-rpm/systems=libvirt-fedora-rawhide/ws/bui…'> make[3]: Nothing to be done for 'all'. make[3]: Leaving directory '<https://ci.centos.org/job/libvirt-rpm/systems=libvirt-fedora-rawhide/ws/bui…'> /usr/bin/make check-TESTS make[3]: Entering directory '<https://ci.centos.org/job/libvirt-rpm/systems=libvirt-fedora-rawhide/ws/bui…'> make[4]: Entering directory '<https://ci.centos.org/job/libvirt-rpm/systems=libvirt-fedora-rawhide/ws/bui…'> PASS: sockettest PASS: virhostcputest PASS: virbuftest PASS: virshtest PASS: seclabeltest PASS: commandtest PASS: virhashtest PASS: virconftest PASS: shunloadtest PASS: utiltest PASS: virtimetest PASS: viruritest PASS: viralloctest PASS: virauthconfigtest PASS: virbitmaptest PASS: vircgrouptest PASS: vircryptotest PASS: virendiantest PASS: virpcitest PASS: virfilecachetest PASS: virfiletest PASS: virfirewalltest PASS: viriscsitest PASS: virkeycodetest PASS: virlockspacetest PASS: virlogtest PASS: virrotatingfiletest PASS: virstringtest PASS: virportallocatortest PASS: sysinfotest PASS: virkmodtest PASS: virschematest PASS: vircapstest PASS: domainconftest PASS: domaincapstest PASS: virhostdevtest PASS: virnetdevtest PASS: virtypedparamtest PASS: vshtabletest PASS: virerrortest PASS: virnetmessagetest PASS: virnetsockettest PASS: virnetdaemontest PASS: virnetserverclienttest PASS: virnettlscontexttest PASS: virnettlssessiontest PASS: fchosttest PASS: scsihosttest PASS: virresctrltest PASS: vircaps2xmltest PASS: virdbustest PASS: fdstreamtest PASS: virsystemdtest PASS: virpolkittest PASS: securityselinuxtest PASS: viridentitytest PASS: securityselinuxlabeltest PASS: xlconfigtest PASS: xmconfigtest PASS: libxlxml2domconfigtest PASS: qemuxml2xmltest PASS: qemudomaincheckpointxml2xmltest PASS: qemudomainsnapshotxml2xmltest PASS: qemumonitorjsontest PASS: qemuhotplugtest PASS: qemuxml2argvtest PASS: qemuagenttest PASS: qemucapabilitiestest PASS: qemucaps2xmltest PASS: qemucommandutiltest PASS: qemumemlocktest PASS: qemumigparamstest PASS: qemublocktest PASS: qemufirmwaretest PASS: qemuvhostusertest PASS: qemusecuritytest PASS: lxcxml2xmltest PASS: lxcconf2xmltest PASS: openvzutilstest PASS: esxutilstest PASS: vboxsnapshotxmltest PASS: vmx2xmltest PASS: xml2vmxtest PASS: vmwarevertest PASS: virjsontest PASS: networkxml2xmlupdatetest PASS: virnetworkportxml2xmltest PASS: networkxml2xmltest PASS: networkxml2conftest PASS: networkxml2firewalltest PASS: storagebackendsheepdogtest PASS: nwfilterxml2xmltest PASS: virnwfilterbindingxml2xmltest PASS: nwfilterebiptablestest PASS: nwfilterxml2firewalltest PASS: storagevolxml2argvtest PASS: storagepoolxml2argvtest PASS: virstorageutiltest PASS: storagepoolxml2xmltest PASS: storagepoolcapstest PASS: virscsitest PASS: virstoragetest PASS: nsstest PASS: nssguesttest PASS: storagevolxml2xmltest PASS: nodedevxml2xmltest PASS: interfacexml2xmltest PASS: metadatatest PASS: secretxml2xmltest PASS: genericxml2xmltest PASS: cputest PASS: virusbtest PASS: virnetdevbandwidthtest PASS: eventtest PASS: virdrivermoduletest PASS: virdriverconnvalidatetest PASS: objecteventtest PASS: virmacmaptest PASS: virnetdevopenvswitchtest PASS: libvirtd-pool PASS: virsh-auth PASS: virsh-cpuset PASS: virsh-define-dev-segfault PASS: virsh-int-overflow PASS: libvirtd-fail PASS: virsh-read-bufsiz PASS: virsh-read-non-seekable PASS: virsh-schedinfo PASS: virsh-self-test PASS: virt-admin-self-test PASS: virsh-checkpoint PASS: virsh-snapshot PASS: virsh-start PASS: virsh-undefine PASS: virsh-uriprecedence PASS: virsh-optparse PASS: virsh-vcpupin ============================================================================ Testsuite summary for libvirt 6.5.0 ============================================================================ # TOTAL: 137 # PASS: 137 # SKIP: 0 # XFAIL: 0 # FAIL: 0 # XPASS: 0 # ERROR: 0 ============================================================================ make[4]: Leaving directory '<https://ci.centos.org/job/libvirt-rpm/systems=libvirt-fedora-rawhide/ws/bui…'> make[3]: Leaving directory '<https://ci.centos.org/job/libvirt-rpm/systems=libvirt-fedora-rawhide/ws/bui…'> make[2]: Leaving directory '<https://ci.centos.org/job/libvirt-rpm/systems=libvirt-fedora-rawhide/ws/bui…'> Making check in po make[2]: Entering directory '<https://ci.centos.org/job/libvirt-rpm/systems=libvirt-fedora-rawhide/ws/bui…'> make[2]: Nothing to be done for 'check'. make[2]: Leaving directory '<https://ci.centos.org/job/libvirt-rpm/systems=libvirt-fedora-rawhide/ws/bui…'> Making check in examples make[2]: Entering directory '<https://ci.centos.org/job/libvirt-rpm/systems=libvirt-fedora-rawhide/ws/bui…'> make[2]: Nothing to be done for 'check'. make[2]: Leaving directory '<https://ci.centos.org/job/libvirt-rpm/systems=libvirt-fedora-rawhide/ws/bui…'> make[1]: Leaving directory '<https://ci.centos.org/job/libvirt-rpm/systems=libvirt-fedora-rawhide/ws/bui…'> + RPM_EC=0 ++ jobs -p + exit 0 Processing files: libvirt-6.5.0-1.fc33.x86_64 Processing files: libvirt-docs-6.5.0-1.fc33.x86_64 Executing(%doc): /bin/sh -e /var/tmp/rpm-tmp.KgcX77 + umask 022 + cd <https://ci.centos.org/job/libvirt-rpm/systems=libvirt-fedora-rawhide/ws/bui…> + cd libvirt-6.5.0 + DOCDIR=<https://ci.centos.org/job/libvirt-rpm/systems=libvirt-fedora-rawhide/ws/bui…> + export LC_ALL=C + LC_ALL=C + export DOCDIR + /usr/bin/mkdir -p <https://ci.centos.org/job/libvirt-rpm/systems=libvirt-fedora-rawhide/ws/bui…> + cp -pr AUTHORS <https://ci.centos.org/job/libvirt-rpm/systems=libvirt-fedora-rawhide/ws/bui…> + cp -pr ChangeLog <https://ci.centos.org/job/libvirt-rpm/systems=libvirt-fedora-rawhide/ws/bui…> + cp -pr NEWS <https://ci.centos.org/job/libvirt-rpm/systems=libvirt-fedora-rawhide/ws/bui…> cp: cannot stat 'NEWS': No such file or directory + : + cp -pr README <https://ci.centos.org/job/libvirt-rpm/systems=libvirt-fedora-rawhide/ws/bui…> + cp -pr README.rst <https://ci.centos.org/job/libvirt-rpm/systems=libvirt-fedora-rawhide/ws/bui…> + cp -pr x86_64-redhat-linux-gnu/libvirt-docs/examples x86_64-redhat-linux-gnu/libvirt-docs/html <https://ci.centos.org/job/libvirt-rpm/systems=libvirt-fedora-rawhide/ws/bui…> + RPM_EC=0 ++ jobs -p + exit 0 error: File not found: <https://ci.centos.org/job/libvirt-rpm/systems=libvirt-fedora-rawhide/ws/bui…> RPM build errors: Found bdb Packages database while attempting sqlite backend: using bdb backend. File not found: <https://ci.centos.org/job/libvirt-rpm/systems=libvirt-fedora-rawhide/ws/bui…> Build step 'Execute shell' marked build as failure
1 2
0 0
Build failed in Jenkins: libvirt-rpm » libvirt-fedora-32 #1119
by ci@centos.org 08 Jun '20

08 Jun '20
See <https://ci.centos.org/job/libvirt-rpm/systems=libvirt-fedora-32/1119/displa…> ------------------------------------------ [...truncated 6.81 MB...] make[5]: Leaving directory '<https://ci.centos.org/job/libvirt-rpm/systems=libvirt-fedora-32/ws/build/rp…'> make[4]: Leaving directory '<https://ci.centos.org/job/libvirt-rpm/systems=libvirt-fedora-32/ws/build/rp…'> make[3]: Leaving directory '<https://ci.centos.org/job/libvirt-rpm/systems=libvirt-fedora-32/ws/build/rp…'> make[2]: Leaving directory '<https://ci.centos.org/job/libvirt-rpm/systems=libvirt-fedora-32/ws/build/rp…'> Making check in include/libvirt make[2]: Entering directory '<https://ci.centos.org/job/libvirt-rpm/systems=libvirt-fedora-32/ws/build/rp…'> make[2]: Nothing to be done for 'check'. make[2]: Leaving directory '<https://ci.centos.org/job/libvirt-rpm/systems=libvirt-fedora-32/ws/build/rp…'> Making check in src make[2]: Entering directory '<https://ci.centos.org/job/libvirt-rpm/systems=libvirt-fedora-32/ws/build/rp…'> /usr/bin/make check-am make[3]: Entering directory '<https://ci.centos.org/job/libvirt-rpm/systems=libvirt-fedora-32/ws/build/rp…'> /usr/bin/make check-local make[4]: Entering directory '<https://ci.centos.org/job/libvirt-rpm/systems=libvirt-fedora-32/ws/build/rp…'> GEN ../../src/remote_protocol-struct GEN ../../src/lxc_protocol-struct GEN ../../src/qemu_protocol-struct GEN ../../src/virnetprotocol-struct GEN ../../src/virkeepaliveprotocol-struct GEN ../../src/lxc_monitor_protocol-struct GEN ../../src/lock_protocol-struct GEN ../../src/admin_protocol-struct GEN check-symfile GEN check-symsorting GEN check-drivername GEN check-driverimpls GEN check-aclrules GEN check-aclperms GEN check-admin-symfile GEN check-admin-symsorting GEN check-admin-drivername GEN check-augeas make[4]: Leaving directory '<https://ci.centos.org/job/libvirt-rpm/systems=libvirt-fedora-32/ws/build/rp…'> make[3]: Leaving directory '<https://ci.centos.org/job/libvirt-rpm/systems=libvirt-fedora-32/ws/build/rp…'> make[2]: Leaving directory '<https://ci.centos.org/job/libvirt-rpm/systems=libvirt-fedora-32/ws/build/rp…'> Making check in tools make[2]: Entering directory '<https://ci.centos.org/job/libvirt-rpm/systems=libvirt-fedora-32/ws/build/rp…'> /usr/bin/make check-am make[3]: Entering directory '<https://ci.centos.org/job/libvirt-rpm/systems=libvirt-fedora-32/ws/build/rp…'> make[3]: Nothing to be done for 'check-am'. make[3]: Leaving directory '<https://ci.centos.org/job/libvirt-rpm/systems=libvirt-fedora-32/ws/build/rp…'> make[2]: Leaving directory '<https://ci.centos.org/job/libvirt-rpm/systems=libvirt-fedora-32/ws/build/rp…'> Making check in docs make[2]: Entering directory '<https://ci.centos.org/job/libvirt-rpm/systems=libvirt-fedora-32/ws/build/rp…'> /usr/bin/make check-local make[3]: Entering directory '<https://ci.centos.org/job/libvirt-rpm/systems=libvirt-fedora-32/ws/build/rp…'> /usr/bin/xmllint --nonet --noout html/*.html make[3]: Leaving directory '<https://ci.centos.org/job/libvirt-rpm/systems=libvirt-fedora-32/ws/build/rp…'> make[2]: Leaving directory '<https://ci.centos.org/job/libvirt-rpm/systems=libvirt-fedora-32/ws/build/rp…'> Making check in tests make[2]: Entering directory '<https://ci.centos.org/job/libvirt-rpm/systems=libvirt-fedora-32/ws/build/rp…'> /usr/bin/make make[3]: Entering directory '<https://ci.centos.org/job/libvirt-rpm/systems=libvirt-fedora-32/ws/build/rp…'> make[3]: Nothing to be done for 'all'. make[3]: Leaving directory '<https://ci.centos.org/job/libvirt-rpm/systems=libvirt-fedora-32/ws/build/rp…'> /usr/bin/make check-TESTS make[3]: Entering directory '<https://ci.centos.org/job/libvirt-rpm/systems=libvirt-fedora-32/ws/build/rp…'> make[4]: Entering directory '<https://ci.centos.org/job/libvirt-rpm/systems=libvirt-fedora-32/ws/build/rp…'> PASS: sockettest PASS: virhostcputest PASS: virbuftest PASS: virshtest PASS: seclabeltest PASS: commandtest PASS: virhashtest PASS: virconftest PASS: shunloadtest PASS: utiltest PASS: virtimetest PASS: viralloctest PASS: viruritest PASS: virbitmaptest PASS: virauthconfigtest PASS: vircryptotest PASS: vircgrouptest PASS: virpcitest PASS: virendiantest PASS: virfilecachetest PASS: virfiletest PASS: virfirewalltest PASS: viriscsitest PASS: virkeycodetest PASS: virlockspacetest PASS: virlogtest PASS: virrotatingfiletest PASS: virstringtest PASS: virportallocatortest PASS: sysinfotest PASS: virkmodtest PASS: vircapstest PASS: virschematest PASS: domainconftest PASS: virhostdevtest PASS: domaincapstest PASS: virnetdevtest PASS: virtypedparamtest PASS: vshtabletest PASS: virerrortest PASS: virnetmessagetest PASS: virnetsockettest PASS: virnetdaemontest PASS: virnetserverclienttest PASS: virnettlssessiontest PASS: virnettlscontexttest PASS: scsihosttest PASS: fchosttest PASS: vircaps2xmltest PASS: virresctrltest PASS: fdstreamtest PASS: virdbustest PASS: virsystemdtest PASS: virpolkittest PASS: securityselinuxtest PASS: viridentitytest PASS: xlconfigtest PASS: securityselinuxlabeltest PASS: xmconfigtest PASS: libxlxml2domconfigtest PASS: qemuxml2xmltest PASS: qemudomaincheckpointxml2xmltest PASS: qemudomainsnapshotxml2xmltest PASS: qemumonitorjsontest PASS: qemuhotplugtest PASS: qemuxml2argvtest PASS: qemuagenttest PASS: qemucapabilitiestest PASS: qemucaps2xmltest PASS: qemucommandutiltest PASS: qemumemlocktest PASS: qemumigparamstest PASS: qemublocktest PASS: qemufirmwaretest PASS: qemuvhostusertest PASS: qemusecuritytest PASS: lxcxml2xmltest PASS: lxcconf2xmltest PASS: openvzutilstest PASS: esxutilstest PASS: vboxsnapshotxmltest PASS: vmx2xmltest PASS: xml2vmxtest PASS: vmwarevertest PASS: virjsontest PASS: networkxml2xmlupdatetest PASS: virnetworkportxml2xmltest PASS: networkxml2xmltest PASS: networkxml2conftest PASS: networkxml2firewalltest PASS: storagebackendsheepdogtest PASS: nwfilterxml2xmltest PASS: virnwfilterbindingxml2xmltest PASS: nwfilterebiptablestest PASS: nwfilterxml2firewalltest PASS: storagevolxml2argvtest PASS: storagepoolxml2argvtest PASS: virstorageutiltest PASS: storagepoolxml2xmltest PASS: storagepoolcapstest PASS: virscsitest PASS: virstoragetest PASS: nsstest PASS: nssguesttest PASS: storagevolxml2xmltest PASS: nodedevxml2xmltest PASS: interfacexml2xmltest PASS: metadatatest PASS: secretxml2xmltest PASS: genericxml2xmltest PASS: virusbtest PASS: cputest PASS: virnetdevbandwidthtest PASS: eventtest PASS: virdrivermoduletest PASS: virdriverconnvalidatetest PASS: objecteventtest PASS: virmacmaptest PASS: virnetdevopenvswitchtest PASS: libvirtd-pool PASS: virsh-auth PASS: virsh-cpuset PASS: virsh-define-dev-segfault PASS: virsh-int-overflow PASS: libvirtd-fail PASS: virsh-read-bufsiz PASS: virsh-read-non-seekable PASS: virsh-schedinfo PASS: virsh-self-test PASS: virt-admin-self-test PASS: virsh-checkpoint PASS: virsh-snapshot PASS: virsh-start PASS: virsh-undefine PASS: virsh-uriprecedence PASS: virsh-optparse PASS: virsh-vcpupin ============================================================================ Testsuite summary for libvirt 6.5.0 ============================================================================ # TOTAL: 137 # PASS: 137 # SKIP: 0 # XFAIL: 0 # FAIL: 0 # XPASS: 0 # ERROR: 0 ============================================================================ make[4]: Leaving directory '<https://ci.centos.org/job/libvirt-rpm/systems=libvirt-fedora-32/ws/build/rp…'> make[3]: Leaving directory '<https://ci.centos.org/job/libvirt-rpm/systems=libvirt-fedora-32/ws/build/rp…'> make[2]: Leaving directory '<https://ci.centos.org/job/libvirt-rpm/systems=libvirt-fedora-32/ws/build/rp…'> Making check in po make[2]: Entering directory '<https://ci.centos.org/job/libvirt-rpm/systems=libvirt-fedora-32/ws/build/rp…'> make[2]: Nothing to be done for 'check'. make[2]: Leaving directory '<https://ci.centos.org/job/libvirt-rpm/systems=libvirt-fedora-32/ws/build/rp…'> Making check in examples make[2]: Entering directory '<https://ci.centos.org/job/libvirt-rpm/systems=libvirt-fedora-32/ws/build/rp…'> make[2]: Nothing to be done for 'check'. make[2]: Leaving directory '<https://ci.centos.org/job/libvirt-rpm/systems=libvirt-fedora-32/ws/build/rp…'> make[1]: Leaving directory '<https://ci.centos.org/job/libvirt-rpm/systems=libvirt-fedora-32/ws/build/rp…'> + RPM_EC=0 ++ jobs -p + exit 0 Processing files: libvirt-6.5.0-1.fc32.x86_64 Processing files: libvirt-docs-6.5.0-1.fc32.x86_64 Executing(%doc): /bin/sh -e /var/tmp/rpm-tmp.zjWdNo + umask 022 + cd <https://ci.centos.org/job/libvirt-rpm/systems=libvirt-fedora-32/ws/build/rp…> + cd libvirt-6.5.0 + DOCDIR=<https://ci.centos.org/job/libvirt-rpm/systems=libvirt-fedora-32/ws/build/rp…> + export LC_ALL=C + LC_ALL=C + export DOCDIR + /usr/bin/mkdir -p <https://ci.centos.org/job/libvirt-rpm/systems=libvirt-fedora-32/ws/build/rp…> + cp -pr AUTHORS <https://ci.centos.org/job/libvirt-rpm/systems=libvirt-fedora-32/ws/build/rp…> + cp -pr ChangeLog <https://ci.centos.org/job/libvirt-rpm/systems=libvirt-fedora-32/ws/build/rp…> + cp -pr NEWS <https://ci.centos.org/job/libvirt-rpm/systems=libvirt-fedora-32/ws/build/rp…> cp: cannot stat 'NEWS': No such file or directory + : + cp -pr README <https://ci.centos.org/job/libvirt-rpm/systems=libvirt-fedora-32/ws/build/rp…> + cp -pr README.rst <https://ci.centos.org/job/libvirt-rpm/systems=libvirt-fedora-32/ws/build/rp…> + cp -pr x86_64-redhat-linux-gnu/libvirt-docs/examples x86_64-redhat-linux-gnu/libvirt-docs/html <https://ci.centos.org/job/libvirt-rpm/systems=libvirt-fedora-32/ws/build/rp…> + RPM_EC=0 ++ jobs -p + exit 0 error: File not found: <https://ci.centos.org/job/libvirt-rpm/systems=libvirt-fedora-32/ws/build/rp…> RPM build errors: File not found: <https://ci.centos.org/job/libvirt-rpm/systems=libvirt-fedora-32/ws/build/rp…> Build step 'Execute shell' marked build as failure
1 2
0 0
  • ← Newer
  • 1
  • 2
  • 3
  • 4
  • 5
  • 6
  • 7
  • 8
  • Older →

HyperKitty Powered by HyperKitty version 1.3.12.