libvirt List Archives
Sign In Sign Up
Manage this list Sign In Sign Up

Keyboard Shortcuts

Thread View

  • j: Next unread message
  • k: Previous unread message
  • j a: Jump to all threads
  • j l: Jump to MailingList overview

CI

Thread Start a new thread
Download
Threads by month
  • ----- 2025 -----
  • August
  • July
  • June
  • May
  • April
  • March
  • February
  • January
  • ----- 2024 -----
  • December
  • November
  • October
  • September
  • August
  • July
  • June
  • May
  • April
  • March
  • February
  • January
  • ----- 2023 -----
  • December
  • November
  • October
  • September
  • August
  • July
  • June
  • May
  • April
  • March
  • February
  • January
  • ----- 2022 -----
  • December
  • November
  • October
  • September
  • August
  • July
  • June
  • May
  • April
  • March
  • February
  • January
  • ----- 2021 -----
  • December
  • November
  • October
  • September
  • August
  • July
  • June
  • May
  • April
  • March
  • February
  • January
  • ----- 2020 -----
  • December
  • November
  • October
  • September
  • August
  • July
  • June
  • May
  • April
  • March
  • February
  • January
  • ----- 2019 -----
  • December
  • November
  • October
  • September
  • August
  • July
  • June
  • May
  • April
  • March
  • February
  • January
  • ----- 2018 -----
  • December
  • November
  • October
  • September
  • August
  • July
  • June
  • May
  • April
  • March
  • February
  • January
  • ----- 2017 -----
  • December
  • November
  • October
  • September
  • August
  • July
  • June
  • May
  • April
  • March
  • February
  • January
  • ----- 2016 -----
  • December
  • November
  • October
  • September
  • August
  • July
ci@lists.libvirt.org

June 2020

  • 3 participants
  • 74 discussions
Build failed in Jenkins: libvirt-rpm » libvirt-fedora-31 #1119
by ci@centos.org 08 Jun '20

08 Jun '20
See <https://ci.centos.org/job/libvirt-rpm/systems=libvirt-fedora-31/1119/displa…> ------------------------------------------ [...truncated 6.81 MB...] make[5]: Leaving directory '<https://ci.centos.org/job/libvirt-rpm/systems=libvirt-fedora-31/ws/build/rp…'> make[4]: Leaving directory '<https://ci.centos.org/job/libvirt-rpm/systems=libvirt-fedora-31/ws/build/rp…'> make[3]: Leaving directory '<https://ci.centos.org/job/libvirt-rpm/systems=libvirt-fedora-31/ws/build/rp…'> make[2]: Leaving directory '<https://ci.centos.org/job/libvirt-rpm/systems=libvirt-fedora-31/ws/build/rp…'> Making check in include/libvirt make[2]: Entering directory '<https://ci.centos.org/job/libvirt-rpm/systems=libvirt-fedora-31/ws/build/rp…'> make[2]: Nothing to be done for 'check'. make[2]: Leaving directory '<https://ci.centos.org/job/libvirt-rpm/systems=libvirt-fedora-31/ws/build/rp…'> Making check in src make[2]: Entering directory '<https://ci.centos.org/job/libvirt-rpm/systems=libvirt-fedora-31/ws/build/rp…'> /usr/bin/make check-am make[3]: Entering directory '<https://ci.centos.org/job/libvirt-rpm/systems=libvirt-fedora-31/ws/build/rp…'> /usr/bin/make check-local make[4]: Entering directory '<https://ci.centos.org/job/libvirt-rpm/systems=libvirt-fedora-31/ws/build/rp…'> GEN ../../src/remote_protocol-struct GEN ../../src/lxc_protocol-struct GEN ../../src/qemu_protocol-struct GEN ../../src/virnetprotocol-struct GEN ../../src/virkeepaliveprotocol-struct GEN ../../src/lxc_monitor_protocol-struct GEN ../../src/lock_protocol-struct GEN ../../src/admin_protocol-struct GEN check-symfile GEN check-symsorting GEN check-drivername GEN check-driverimpls GEN check-aclrules GEN check-aclperms GEN check-admin-symfile GEN check-admin-symsorting GEN check-admin-drivername GEN check-augeas make[4]: Leaving directory '<https://ci.centos.org/job/libvirt-rpm/systems=libvirt-fedora-31/ws/build/rp…'> make[3]: Leaving directory '<https://ci.centos.org/job/libvirt-rpm/systems=libvirt-fedora-31/ws/build/rp…'> make[2]: Leaving directory '<https://ci.centos.org/job/libvirt-rpm/systems=libvirt-fedora-31/ws/build/rp…'> Making check in tools make[2]: Entering directory '<https://ci.centos.org/job/libvirt-rpm/systems=libvirt-fedora-31/ws/build/rp…'> /usr/bin/make check-am make[3]: Entering directory '<https://ci.centos.org/job/libvirt-rpm/systems=libvirt-fedora-31/ws/build/rp…'> make[3]: Nothing to be done for 'check-am'. make[3]: Leaving directory '<https://ci.centos.org/job/libvirt-rpm/systems=libvirt-fedora-31/ws/build/rp…'> make[2]: Leaving directory '<https://ci.centos.org/job/libvirt-rpm/systems=libvirt-fedora-31/ws/build/rp…'> Making check in docs make[2]: Entering directory '<https://ci.centos.org/job/libvirt-rpm/systems=libvirt-fedora-31/ws/build/rp…'> /usr/bin/make check-local make[3]: Entering directory '<https://ci.centos.org/job/libvirt-rpm/systems=libvirt-fedora-31/ws/build/rp…'> /usr/bin/xmllint --nonet --noout html/*.html make[3]: Leaving directory '<https://ci.centos.org/job/libvirt-rpm/systems=libvirt-fedora-31/ws/build/rp…'> make[2]: Leaving directory '<https://ci.centos.org/job/libvirt-rpm/systems=libvirt-fedora-31/ws/build/rp…'> Making check in tests make[2]: Entering directory '<https://ci.centos.org/job/libvirt-rpm/systems=libvirt-fedora-31/ws/build/rp…'> /usr/bin/make make[3]: Entering directory '<https://ci.centos.org/job/libvirt-rpm/systems=libvirt-fedora-31/ws/build/rp…'> make[3]: Nothing to be done for 'all'. make[3]: Leaving directory '<https://ci.centos.org/job/libvirt-rpm/systems=libvirt-fedora-31/ws/build/rp…'> /usr/bin/make check-TESTS make[3]: Entering directory '<https://ci.centos.org/job/libvirt-rpm/systems=libvirt-fedora-31/ws/build/rp…'> make[4]: Entering directory '<https://ci.centos.org/job/libvirt-rpm/systems=libvirt-fedora-31/ws/build/rp…'> PASS: sockettest PASS: virhostcputest PASS: virbuftest PASS: virshtest PASS: seclabeltest PASS: commandtest PASS: virhashtest PASS: virconftest PASS: shunloadtest PASS: utiltest PASS: virtimetest PASS: viruritest PASS: viralloctest PASS: virauthconfigtest PASS: virbitmaptest PASS: vircgrouptest PASS: vircryptotest PASS: virpcitest PASS: virendiantest PASS: virfilecachetest PASS: virfiletest PASS: virfirewalltest PASS: viriscsitest PASS: virkeycodetest PASS: virlockspacetest PASS: virlogtest PASS: virrotatingfiletest PASS: virstringtest PASS: virportallocatortest PASS: sysinfotest PASS: virkmodtest PASS: virschematest PASS: vircapstest PASS: domainconftest PASS: domaincapstest PASS: virhostdevtest PASS: virnetdevtest PASS: virtypedparamtest PASS: virerrortest PASS: vshtabletest PASS: virnetmessagetest PASS: virnetsockettest PASS: virnetdaemontest PASS: virnetserverclienttest PASS: virnettlscontexttest PASS: virnettlssessiontest PASS: fchosttest PASS: scsihosttest PASS: vircaps2xmltest PASS: virresctrltest PASS: fdstreamtest PASS: virdbustest PASS: virsystemdtest PASS: virpolkittest PASS: securityselinuxtest PASS: viridentitytest PASS: xlconfigtest PASS: securityselinuxlabeltest PASS: xmconfigtest PASS: libxlxml2domconfigtest PASS: qemuxml2xmltest PASS: qemudomaincheckpointxml2xmltest PASS: qemudomainsnapshotxml2xmltest PASS: qemumonitorjsontest PASS: qemuhotplugtest PASS: qemuxml2argvtest PASS: qemuagenttest PASS: qemucapabilitiestest PASS: qemucaps2xmltest PASS: qemumemlocktest PASS: qemucommandutiltest PASS: qemublocktest PASS: qemumigparamstest PASS: qemufirmwaretest PASS: qemuvhostusertest PASS: qemusecuritytest PASS: lxcxml2xmltest PASS: lxcconf2xmltest PASS: openvzutilstest PASS: esxutilstest PASS: vboxsnapshotxmltest PASS: vmx2xmltest PASS: xml2vmxtest PASS: vmwarevertest PASS: virjsontest PASS: networkxml2xmlupdatetest PASS: virnetworkportxml2xmltest PASS: networkxml2xmltest PASS: networkxml2conftest PASS: networkxml2firewalltest PASS: storagebackendsheepdogtest PASS: nwfilterxml2xmltest PASS: virnwfilterbindingxml2xmltest PASS: nwfilterebiptablestest PASS: nwfilterxml2firewalltest PASS: storagevolxml2argvtest PASS: storagepoolxml2argvtest PASS: virstorageutiltest PASS: storagepoolxml2xmltest PASS: storagepoolcapstest PASS: virscsitest PASS: virstoragetest PASS: nsstest PASS: nssguesttest PASS: storagevolxml2xmltest PASS: nodedevxml2xmltest PASS: interfacexml2xmltest PASS: metadatatest PASS: secretxml2xmltest PASS: genericxml2xmltest PASS: virusbtest PASS: cputest PASS: virnetdevbandwidthtest PASS: eventtest PASS: virdrivermoduletest PASS: virdriverconnvalidatetest PASS: objecteventtest PASS: virmacmaptest PASS: virnetdevopenvswitchtest PASS: libvirtd-pool PASS: virsh-auth PASS: libvirtd-fail PASS: virsh-cpuset PASS: virsh-define-dev-segfault PASS: virsh-int-overflow PASS: virsh-read-bufsiz PASS: virsh-read-non-seekable PASS: virsh-schedinfo PASS: virsh-self-test PASS: virt-admin-self-test PASS: virsh-checkpoint PASS: virsh-snapshot PASS: virsh-start PASS: virsh-undefine PASS: virsh-uriprecedence PASS: virsh-optparse PASS: virsh-vcpupin ============================================================================ Testsuite summary for libvirt 6.5.0 ============================================================================ # TOTAL: 137 # PASS: 137 # SKIP: 0 # XFAIL: 0 # FAIL: 0 # XPASS: 0 # ERROR: 0 ============================================================================ make[4]: Leaving directory '<https://ci.centos.org/job/libvirt-rpm/systems=libvirt-fedora-31/ws/build/rp…'> make[3]: Leaving directory '<https://ci.centos.org/job/libvirt-rpm/systems=libvirt-fedora-31/ws/build/rp…'> make[2]: Leaving directory '<https://ci.centos.org/job/libvirt-rpm/systems=libvirt-fedora-31/ws/build/rp…'> Making check in po make[2]: Entering directory '<https://ci.centos.org/job/libvirt-rpm/systems=libvirt-fedora-31/ws/build/rp…'> make[2]: Nothing to be done for 'check'. make[2]: Leaving directory '<https://ci.centos.org/job/libvirt-rpm/systems=libvirt-fedora-31/ws/build/rp…'> Making check in examples make[2]: Entering directory '<https://ci.centos.org/job/libvirt-rpm/systems=libvirt-fedora-31/ws/build/rp…'> make[2]: Nothing to be done for 'check'. make[2]: Leaving directory '<https://ci.centos.org/job/libvirt-rpm/systems=libvirt-fedora-31/ws/build/rp…'> make[1]: Leaving directory '<https://ci.centos.org/job/libvirt-rpm/systems=libvirt-fedora-31/ws/build/rp…'> + RPM_EC=0 ++ jobs -p + exit 0 Processing files: libvirt-6.5.0-1.fc31.x86_64 Processing files: libvirt-docs-6.5.0-1.fc31.x86_64 Executing(%doc): /bin/sh -e /var/tmp/rpm-tmp.Z6Wkq9 + umask 022 + cd <https://ci.centos.org/job/libvirt-rpm/systems=libvirt-fedora-31/ws/build/rp…> + cd libvirt-6.5.0 + DOCDIR=<https://ci.centos.org/job/libvirt-rpm/systems=libvirt-fedora-31/ws/build/rp…> + export LC_ALL=C + LC_ALL=C + export DOCDIR + /usr/bin/mkdir -p <https://ci.centos.org/job/libvirt-rpm/systems=libvirt-fedora-31/ws/build/rp…> + cp -pr AUTHORS <https://ci.centos.org/job/libvirt-rpm/systems=libvirt-fedora-31/ws/build/rp…> + cp -pr ChangeLog <https://ci.centos.org/job/libvirt-rpm/systems=libvirt-fedora-31/ws/build/rp…> + cp -pr NEWS <https://ci.centos.org/job/libvirt-rpm/systems=libvirt-fedora-31/ws/build/rp…> cp: cannot stat 'NEWS': No such file or directory + : + cp -pr README <https://ci.centos.org/job/libvirt-rpm/systems=libvirt-fedora-31/ws/build/rp…> + cp -pr README.rst <https://ci.centos.org/job/libvirt-rpm/systems=libvirt-fedora-31/ws/build/rp…> + cp -pr x86_64-redhat-linux-gnu/libvirt-docs/examples x86_64-redhat-linux-gnu/libvirt-docs/html <https://ci.centos.org/job/libvirt-rpm/systems=libvirt-fedora-31/ws/build/rp…> + RPM_EC=0 ++ jobs -p + exit 0 error: File not found: <https://ci.centos.org/job/libvirt-rpm/systems=libvirt-fedora-31/ws/build/rp…> RPM build errors: File not found: <https://ci.centos.org/job/libvirt-rpm/systems=libvirt-fedora-31/ws/build/rp…> Build step 'Execute shell' marked build as failure
1 2
0 0
Build failed in Jenkins: libvirt-rpm » libvirt-centos-7 #1119
by ci@centos.org 08 Jun '20

08 Jun '20
See <https://ci.centos.org/job/libvirt-rpm/systems=libvirt-centos-7/1119/display…> ------------------------------------------ [...truncated 4.19 MB...] make[5]: Leaving directory `<https://ci.centos.org/job/libvirt-rpm/systems=libvirt-centos-7/ws/build/rpm…'> Making all in tests make[5]: Entering directory `<https://ci.centos.org/job/libvirt-rpm/systems=libvirt-centos-7/ws/build/rpm…'> make[5]: Nothing to be done for `all'. make[5]: Leaving directory `<https://ci.centos.org/job/libvirt-rpm/systems=libvirt-centos-7/ws/build/rpm…'> Making all in po make[5]: Entering directory `<https://ci.centos.org/job/libvirt-rpm/systems=libvirt-centos-7/ws/build/rpm…'> make[5]: Nothing to be done for `all'. make[5]: Leaving directory `<https://ci.centos.org/job/libvirt-rpm/systems=libvirt-centos-7/ws/build/rpm…'> Making all in examples make[5]: Entering directory `<https://ci.centos.org/job/libvirt-rpm/systems=libvirt-centos-7/ws/build/rpm…'> make[5]: Nothing to be done for `all'. make[5]: Leaving directory `<https://ci.centos.org/job/libvirt-rpm/systems=libvirt-centos-7/ws/build/rpm…'> make[4]: Leaving directory `<https://ci.centos.org/job/libvirt-rpm/systems=libvirt-centos-7/ws/build/rpm…'> make[3]: Leaving directory `<https://ci.centos.org/job/libvirt-rpm/systems=libvirt-centos-7/ws/build/rpm…'> make[2]: Leaving directory `<https://ci.centos.org/job/libvirt-rpm/systems=libvirt-centos-7/ws/build/rpm…'> Making check in include/libvirt make[2]: Entering directory `<https://ci.centos.org/job/libvirt-rpm/systems=libvirt-centos-7/ws/build/rpm…'> make[2]: Nothing to be done for `check'. make[2]: Leaving directory `<https://ci.centos.org/job/libvirt-rpm/systems=libvirt-centos-7/ws/build/rpm…'> Making check in src make[2]: Entering directory `<https://ci.centos.org/job/libvirt-rpm/systems=libvirt-centos-7/ws/build/rpm…'> /usr/bin/make check-am make[3]: Entering directory `<https://ci.centos.org/job/libvirt-rpm/systems=libvirt-centos-7/ws/build/rpm…'> /usr/bin/make check-local make[4]: Entering directory `<https://ci.centos.org/job/libvirt-rpm/systems=libvirt-centos-7/ws/build/rpm…'> GEN ../../src/remote_protocol-struct GEN ../../src/lxc_protocol-struct GEN ../../src/qemu_protocol-struct GEN ../../src/virnetprotocol-struct GEN ../../src/virkeepaliveprotocol-struct GEN ../../src/lxc_monitor_protocol-struct GEN ../../src/lock_protocol-struct GEN ../../src/admin_protocol-struct GEN check-symfile GEN check-symsorting GEN check-drivername GEN check-driverimpls GEN check-aclrules GEN check-aclperms GEN check-admin-symfile GEN check-admin-symsorting GEN check-admin-drivername GEN check-augeas make[4]: Leaving directory `<https://ci.centos.org/job/libvirt-rpm/systems=libvirt-centos-7/ws/build/rpm…'> make[3]: Leaving directory `<https://ci.centos.org/job/libvirt-rpm/systems=libvirt-centos-7/ws/build/rpm…'> make[2]: Leaving directory `<https://ci.centos.org/job/libvirt-rpm/systems=libvirt-centos-7/ws/build/rpm…'> Making check in tools make[2]: Entering directory `<https://ci.centos.org/job/libvirt-rpm/systems=libvirt-centos-7/ws/build/rpm…'> /usr/bin/make check-am make[3]: Entering directory `<https://ci.centos.org/job/libvirt-rpm/systems=libvirt-centos-7/ws/build/rpm…'> make[3]: Nothing to be done for `check-am'. make[3]: Leaving directory `<https://ci.centos.org/job/libvirt-rpm/systems=libvirt-centos-7/ws/build/rpm…'> make[2]: Leaving directory `<https://ci.centos.org/job/libvirt-rpm/systems=libvirt-centos-7/ws/build/rpm…'> Making check in docs make[2]: Entering directory `<https://ci.centos.org/job/libvirt-rpm/systems=libvirt-centos-7/ws/build/rpm…'> /usr/bin/make check-local make[3]: Entering directory `<https://ci.centos.org/job/libvirt-rpm/systems=libvirt-centos-7/ws/build/rpm…'> /usr/bin/xmllint --nonet --noout html/*.html make[3]: Leaving directory `<https://ci.centos.org/job/libvirt-rpm/systems=libvirt-centos-7/ws/build/rpm…'> make[2]: Leaving directory `<https://ci.centos.org/job/libvirt-rpm/systems=libvirt-centos-7/ws/build/rpm…'> Making check in tests make[2]: Entering directory `<https://ci.centos.org/job/libvirt-rpm/systems=libvirt-centos-7/ws/build/rpm…'> /usr/bin/make make[3]: Entering directory `<https://ci.centos.org/job/libvirt-rpm/systems=libvirt-centos-7/ws/build/rpm…'> make[3]: Nothing to be done for `all'. make[3]: Leaving directory `<https://ci.centos.org/job/libvirt-rpm/systems=libvirt-centos-7/ws/build/rpm…'> /usr/bin/make check-TESTS make[3]: Entering directory `<https://ci.centos.org/job/libvirt-rpm/systems=libvirt-centos-7/ws/build/rpm…'> make[4]: Entering directory `<https://ci.centos.org/job/libvirt-rpm/systems=libvirt-centos-7/ws/build/rpm…'> PASS: sockettest PASS: virhostcputest PASS: virbuftest PASS: commandtest PASS: seclabeltest PASS: virhashtest PASS: virconftest PASS: utiltest PASS: shunloadtest PASS: virtimetest PASS: viruritest PASS: virshtest PASS: viralloctest PASS: virauthconfigtest PASS: virbitmaptest PASS: vircgrouptest PASS: vircryptotest PASS: virendiantest PASS: virpcitest PASS: virfilecachetest PASS: virfiletest PASS: virfirewalltest PASS: viriscsitest PASS: virkeycodetest PASS: virlockspacetest PASS: virlogtest PASS: virrotatingfiletest PASS: virstringtest PASS: virportallocatortest PASS: sysinfotest PASS: virkmodtest PASS: vircapstest PASS: virschematest PASS: domainconftest PASS: domaincapstest PASS: virhostdevtest PASS: virnetdevtest PASS: virtypedparamtest PASS: vshtabletest PASS: virerrortest PASS: virnetmessagetest PASS: virnetsockettest PASS: virnetdaemontest PASS: virnetserverclienttest PASS: virnettlssessiontest PASS: fchosttest PASS: scsihosttest PASS: vircaps2xmltest PASS: virnettlscontexttest PASS: virresctrltest PASS: fdstreamtest PASS: virdbustest PASS: virsystemdtest PASS: virpolkittest PASS: securityselinuxtest PASS: viridentitytest PASS: securityselinuxlabeltest PASS: qemuxml2xmltest PASS: qemudomaincheckpointxml2xmltest PASS: qemudomainsnapshotxml2xmltest PASS: qemumonitorjsontest PASS: qemuhotplugtest PASS: qemuxml2argvtest PASS: qemuagenttest PASS: qemucaps2xmltest PASS: qemumemlocktest PASS: qemucommandutiltest PASS: qemublocktest PASS: qemucapabilitiestest PASS: qemumigparamstest PASS: qemufirmwaretest PASS: qemuvhostusertest PASS: lxcxml2xmltest PASS: lxcconf2xmltest PASS: qemusecuritytest PASS: esxutilstest PASS: vmx2xmltest PASS: xml2vmxtest PASS: virjsontest PASS: networkxml2xmlupdatetest PASS: virnetworkportxml2xmltest PASS: networkxml2xmltest PASS: networkxml2conftest PASS: networkxml2firewalltest PASS: nwfilterxml2xmltest PASS: virnwfilterbindingxml2xmltest PASS: nwfilterebiptablestest PASS: nwfilterxml2firewalltest PASS: storagevolxml2argvtest PASS: storagepoolxml2argvtest PASS: virstorageutiltest PASS: storagepoolxml2xmltest PASS: storagepoolcapstest PASS: virscsitest PASS: nsstest PASS: virstoragetest PASS: nssguesttest PASS: storagevolxml2xmltest PASS: nodedevxml2xmltest PASS: interfacexml2xmltest PASS: metadatatest PASS: secretxml2xmltest PASS: genericxml2xmltest PASS: virusbtest PASS: cputest PASS: virnetdevbandwidthtest PASS: virdrivermoduletest PASS: eventtest PASS: virdriverconnvalidatetest PASS: objecteventtest PASS: virmacmaptest PASS: virnetdevopenvswitchtest PASS: libvirtd-pool PASS: virsh-auth PASS: libvirtd-fail PASS: virsh-cpuset PASS: virsh-define-dev-segfault PASS: virsh-int-overflow PASS: virsh-read-bufsiz PASS: virsh-read-non-seekable PASS: virsh-schedinfo PASS: virsh-self-test PASS: virt-admin-self-test PASS: virsh-checkpoint PASS: virsh-snapshot PASS: virsh-start PASS: virsh-undefine PASS: virsh-uriprecedence PASS: virsh-optparse PASS: virsh-vcpupin make[5]: Entering directory `<https://ci.centos.org/job/libvirt-rpm/systems=libvirt-centos-7/ws/build/rpm…'> make[5]: Nothing to be done for `all'. make[5]: Leaving directory `<https://ci.centos.org/job/libvirt-rpm/systems=libvirt-centos-7/ws/build/rpm…'> ============================================================================ Testsuite summary for libvirt 6.5.0 ============================================================================ # TOTAL: 130 # PASS: 130 # SKIP: 0 # XFAIL: 0 # FAIL: 0 # XPASS: 0 # ERROR: 0 ============================================================================ make[4]: Leaving directory `<https://ci.centos.org/job/libvirt-rpm/systems=libvirt-centos-7/ws/build/rpm…'> make[3]: Leaving directory `<https://ci.centos.org/job/libvirt-rpm/systems=libvirt-centos-7/ws/build/rpm…'> make[2]: Leaving directory `<https://ci.centos.org/job/libvirt-rpm/systems=libvirt-centos-7/ws/build/rpm…'> Making check in po make[2]: Entering directory `<https://ci.centos.org/job/libvirt-rpm/systems=libvirt-centos-7/ws/build/rpm…'> make[2]: Nothing to be done for `check'. make[2]: Leaving directory `<https://ci.centos.org/job/libvirt-rpm/systems=libvirt-centos-7/ws/build/rpm…'> Making check in examples make[2]: Entering directory `<https://ci.centos.org/job/libvirt-rpm/systems=libvirt-centos-7/ws/build/rpm…'> make[2]: Nothing to be done for `check'. make[2]: Leaving directory `<https://ci.centos.org/job/libvirt-rpm/systems=libvirt-centos-7/ws/build/rpm…'> make[1]: Leaving directory `<https://ci.centos.org/job/libvirt-rpm/systems=libvirt-centos-7/ws/build/rpm…'> + exit 0 Processing files: libvirt-6.5.0-1.el7.x86_64 Provides: libvirt = 6.5.0-1.el7 libvirt(x86-64) = 6.5.0-1.el7 Requires(rpmlib): rpmlib(FileDigests) <= 4.6.0-1 rpmlib(PayloadFilesHavePrefix) <= 4.0-1 rpmlib(CompressedFileNames) <= 3.0.4-1 Obsoletes: libvirt-daemon-driver-uml <= 5.0.0 libvirt-daemon-uml <= 5.0.0 Processing files: libvirt-docs-6.5.0-1.el7.x86_64 Executing(%doc): /bin/sh -e /var/tmp/rpm-tmp.RhsjTr + umask 022 + cd <https://ci.centos.org/job/libvirt-rpm/systems=libvirt-centos-7/ws/build/rpm…> + cd libvirt-6.5.0 + DOCDIR=<https://ci.centos.org/job/libvirt-rpm/systems=libvirt-centos-7/ws/build/rpm…> + export DOCDIR + /usr/bin/mkdir -p <https://ci.centos.org/job/libvirt-rpm/systems=libvirt-centos-7/ws/build/rpm…> + cp -pr AUTHORS <https://ci.centos.org/job/libvirt-rpm/systems=libvirt-centos-7/ws/build/rpm…> + cp -pr ChangeLog <https://ci.centos.org/job/libvirt-rpm/systems=libvirt-centos-7/ws/build/rpm…> + cp -pr NEWS <https://ci.centos.org/job/libvirt-rpm/systems=libvirt-centos-7/ws/build/rpm…> cp: cannot stat 'NEWS': No such file or directory error: Bad exit status from /var/tmp/rpm-tmp.RhsjTr (%doc) RPM build errors: Bad exit status from /var/tmp/rpm-tmp.RhsjTr (%doc) Build step 'Execute shell' marked build as failure
1 2
0 0
Build failed in Jenkins: libosinfo-check » libvirt-freebsd-12 #391
by ci@centos.org 05 Jun '20

05 Jun '20
See <https://ci.centos.org/job/libosinfo-check/systems=libvirt-freebsd-12/391/di…> ------------------------------------------ [...truncated 12.22 KB...] 23.00 error_message_period 23.00 error_message_warn_fatal 23.00 po_check 23.00 preprocessor_indentation 23.00 prohibit_HAVE_MBRTOWC 24.00 prohibit_S_IS_definition 24.00 prohibit_assert_without_use 24.00 prohibit_atoi_atof 24.00 prohibit_backup_files 24.00 prohibit_argmatch_without_use 24.00 prohibit_c_ctype_without_use 24.00 prohibit_cloexec_without_use 24.00 prohibit_canonicalize_without_use 24.00 prohibit_close_stream_without_use 24.00 prohibit_defined_have_decl_tests 24.00 prohibit_double_semicolon 23.00 prohibit_dirent_without_use 24.00 prohibit_doubled_word 24.00 prohibit_error_without_use 24.00 prohibit_empty_lines_at_EOF 24.00 prohibit_hash_pjw_without_use 24.00 prohibit_getopt_without_use 24.00 prohibit_ignore_value_without_use 24.00 prohibit_hash_without_use 24.00 prohibit_inttostr_without_use 24.00 prohibit_long_options_without_use 24.00 prohibit_magic_number_exit 25.00 prohibit_openat_without_use 25.00 prohibit_path_max_allocation 24.00 prohibit_posixver_without_use 24.00 prohibit_quotearg_without_use 24.00 prohibit_reversed_compare_failure 24.00 prohibit_quote_without_use 24.00 prohibit_root_dev_ino_without_use 24.00 prohibit_safe_read_without_use 24.00 prohibit_same_without_use 24.00 prohibit_signal_without_use 24.00 prohibit_stddef_without_use 24.00 prohibit_stat_st_blocks 25.00 prohibit_stdio-safer_without_use 25.00 prohibit_stdio--_without_use 25.00 prohibit_strcmp 25.00 prohibit_strings_without_use 24.00 prohibit_strncpy 25.00 prohibit_test_double_equal 25.00 prohibit_xalloc_without_use 25.00 prohibit_test_minus_ao 24.00 prohibit_xfreopen_without_use 24.00 redundant_const 25.00 space_tab 25.00 unmarked_diagnostics 25.00 trailing_blank 25.00 useless_cpp_parens ------- 2/17 libosinfo:unit / test-db OK 0.48 s --- command --- 10:24:32 /usr<https://ci.centos.org/job/libosinfo-check/systems=libvirt-freebsd-12/ws/bui…> --- stdout --- /db/basic: OK /db/device: OK /db/platform: OK /db/os: OK /db/prop_device: OK /db/prop_platform: OK /db/prop_os: OK /db/rel_os: OK /db/identify_media: OK /db/identify_tree: OK ------- 3/17 libosinfo:unit / test-device OK 0.12 s --- command --- 10:24:33 /usr<https://ci.centos.org/job/libosinfo-check/systems=libvirt-freebsd-12/ws/bui…> --- stdout --- /device/basic: OK ------- 4/17 libosinfo:unit / test-devicelinklist OK 0.28 s --- command --- 10:24:33 /usr<https://ci.centos.org/job/libosinfo-check/systems=libvirt-freebsd-12/ws/bui…> --- stdout --- /devicelinklist/get_devices: OK ------- 5/17 libosinfo:unit / test-entity OK 0.25 s --- command --- 10:24:33 /usr<https://ci.centos.org/job/libosinfo-check/systems=libvirt-freebsd-12/ws/bui…> --- stdout --- /entity/id: OK /entity/empty_props: OK /entity/single_prop_value: OK /entity/multi_prop_value: OK /entity/multi_props: OK /entity/multi_props_clear: OK /entity/int64_props: OK ------- 6/17 libosinfo:unit / test-filter OK 0.33 s --- command --- 10:24:34 /usr<https://ci.centos.org/job/libosinfo-check/systems=libvirt-freebsd-12/ws/bui…> --- stdout --- /filter/basic: OK /filter/filter_single: OK /filter/filter_multi: OK /filter/filter_combine: OK ------- 7/17 libosinfo:unit / test-firmware OK 0.31 s --- command --- 10:24:34 /usr<https://ci.centos.org/job/libosinfo-check/systems=libvirt-freebsd-12/ws/bui…> --- stdout --- /firmware/basic: OK /firmware/loaded/basic: OK ------- 8/17 libosinfo:unit / test-image OK 0.46 s --- command --- 10:24:34 /usr<https://ci.centos.org/job/libosinfo-check/systems=libvirt-freebsd-12/ws/bui…> --- stdout --- /image/basic: OK /image/loaded: OK ------- 9/17 libosinfo:unit / test-install-script OK 1.33 s --- command --- 10:24:35 /usr<https://ci.centos.org/job/libosinfo-check/systems=libvirt-freebsd-12/ws/bui…> --- stdout --- /install-script/script_file: OK /install-script/script_data: OK /install-script/script_datamap: OK /install-script/preferred_injection_method: OK /install-script/installation_source: OK ------- 10/17 libosinfo:unit / test-list OK 0.23 s --- command --- 10:24:36 /usr<https://ci.centos.org/job/libosinfo-check/systems=libvirt-freebsd-12/ws/bui…> --- stdout --- /list/basic: OK /list/lookup: OK /list/duplicate: OK /list/union: OK /list/intersect: OK /list/filter: OK /list/iterate: OK ------- 11/17 libosinfo:unit / test-loader OK 21.37 s --- command --- 10:24:36 /usr<https://ci.centos.org/job/libosinfo-check/systems=libvirt-freebsd-12/ws/bui…> --- stdout --- /loader/basic: OK ------- 12/17 libosinfo:unit / test-media OK 0.25 s --- command --- 10:24:58 /usr<https://ci.centos.org/job/libosinfo-check/systems=libvirt-freebsd-12/ws/bui…> --- stdout --- /media/basic: OK /media/loaded/attributes: OK /media/loaded/no-installer: OK /media/loaded/installer-script: OK ------- 13/17 libosinfo:unit / test-os OK 2.41 s --- command --- 10:24:58 /usr<https://ci.centos.org/job/libosinfo-check/systems=libvirt-freebsd-12/ws/bui…> --- stdout --- /os/basic: OK /os/loader: OK /os/devices: OK /os/devices_filter: OK /os/device_driver: OK /os/find_install_script: OK /os/mulitple_short_ids: OK /os/kernel_url_arg: OK /os/cloud_image_username_arg: OK /os/device_driver/priority: OK /os/device_driver/prioritized_priority: OK /os/devices/inheritance/basic: OK /os/devices/inheritance/removal: OK /os/resources/basic: OK /os/resources/inheritance: OK /os/firmwares/inheritance: OK ------- 14/17 libosinfo:unit / test-platform OK 0.12 s --- command --- 10:25:00 /usr<https://ci.centos.org/job/libosinfo-check/systems=libvirt-freebsd-12/ws/bui…> --- stdout --- /platform/basic: OK /platform/devices: OK /platform/devices_filter: OK ------- 15/17 libosinfo:unit / test-product OK 0.09 s --- command --- 10:25:00 /usr<https://ci.centos.org/job/libosinfo-check/systems=libvirt-freebsd-12/ws/bui…> --- stdout --- /product/basic: OK /product/relproduct: OK /product/supportdate: OK ------- 16/17 libosinfo:unit / test-productfilter OK 0.10 s --- command --- 10:25:00 /usr<https://ci.centos.org/job/libosinfo-check/systems=libvirt-freebsd-12/ws/bui…> --- stdout --- /productfilter/basic: OK /productfilter/productfilter_single: OK /productfilter/productfilter_multi: OK /productfilter/productfilter_combine: OK ------- 17/17 libosinfo:unit / test-tree OK 0.27 s --- command --- 10:25:01 /usr<https://ci.centos.org/job/libosinfo-check/systems=libvirt-freebsd-12/ws/bui…> --- stdout --- /tree/basic: OK /tree/os-variants: OK /tree/create-from-treeinfo: OK ------- Ok: 16 Expected Fail: 0 Fail: 0 Unexpected Pass: 0 Skipped: 0 Timeout: 1 + exit 1 Build step 'Execute shell' marked build as failure
1 1
0 0
libvirt | Pipeline #152492144 has failed for master | ec07aad8
by GitLab 04 Jun '20

04 Jun '20
Your pipeline has failed. Project: libvirt ( https://gitlab.com/libvirt/libvirt ) Branch: master ( https://gitlab.com/libvirt/libvirt/-/commits/master ) Commit: ec07aad8 ( https://gitlab.com/libvirt/libvirt/-/commit/ec07aad8f8a6ead8e9363c8deec4845… ) Commit Message: libxl: Normalize MAC address in device conf whe... Commit Author: Jim Fehlig ( https://gitlab.com/jfehlig ) Pipeline #152492144 ( https://gitlab.com/libvirt/libvirt/-/pipelines/152492144 ) triggered by Jim Fehlig ( https://gitlab.com/jfehlig ) had 5 failed builds. Job #582032394 ( https://gitlab.com/libvirt/libvirt/-/jobs/582032394/raw ) Stage: cross_build Name: mingw32-fedora-rawhide Trace: ../../src/conf/domain_event.c: In function 'virDomainEventDispatchDefaultFunc': ../../src/conf/domain_event.c:1656:30: error: cast increases required alignment of target type [-Werror=cast-align] 1656 | rtcChangeEvent = (virDomainEventRTCChangePtr)event; | ^ ../../src/conf/domain_event.c:1785:34: error: cast increases required alignment of target type [-Werror=cast-align] 1785 | balloonChangeEvent = (virDomainEventBalloonChangePtr)event; | ^ ../../src/conf/domain_event.c:1896:35: error: cast increases required alignment of target type [-Werror=cast-align] 1896 | blockThresholdEvent = (virDomainEventBlockThresholdPtr)event; | ^ ../../src/conf/domain_event.c: In function 'virDomainQemuMonitorEventDispatchFunc': ../../src/conf/domain_event.c:1974:24: error: cast increases required alignment of target type [-Werror=cast-align] 1974 | qemuMonitorEvent = (virDomainQemuMonitorEventPtr)event; | ^ ../../src/conf/domain_event.c: In function 'virDomainQemuMonitorEventFilter': ../../src/conf/domain_event.c:2179:20: error: cast increases required alignment of target type [-Werror=cast-align] 2179 | monitorEvent = (virDomainQemuMonitorEventPtr) event; | ^ cc1: all warnings being treated as errors make[3]: *** [Makefile:8979: conf/libvirt_conf_la-domain_event.lo] Error 1 make[3]: Leaving directory '/builds/libvirt/libvirt/build/src' make[2]: *** [Makefile:6443: all] Error 2 make[2]: Leaving directory '/builds/libvirt/libvirt/build/src' make[1]: *** [Makefile:777: all-recursive] Error 1 make[1]: Leaving directory '/builds/libvirt/libvirt/build' make: *** [Makefile:670: all] Error 2 section_end:1591302007:build_script section_start:1591302007:after_script Running after_script section_end:1591302008:after_script section_start:1591302008:upload_artifacts_on_failure Uploading artifacts for failed job section_end:1591302010:upload_artifacts_on_failure ERROR: Job failed: exit code 1  Job #582032419 ( https://gitlab.com/libvirt/libvirt/-/jobs/582032419/raw ) Stage: cross_build Name: mips-debian-9 Trace: ../../src/conf/domain_event.c:1785:34: error: cast increases required alignment of target type [-Werror=cast-align] balloonChangeEvent = (virDomainEventBalloonChangePtr)event; ^ ../../src/conf/domain_event.c:1896:35: error: cast increases required alignment of target type [-Werror=cast-align] blockThresholdEvent = (virDomainEventBlockThresholdPtr)event; ^ ../../src/conf/domain_event.c: In function 'virDomainQemuMonitorEventDispatchFunc': ../../src/conf/domain_event.c:1974:24: error: cast increases required alignment of target type [-Werror=cast-align] qemuMonitorEvent = (virDomainQemuMonitorEventPtr)event; ^ ../../src/conf/domain_event.c: In function 'virDomainQemuMonitorEventFilter': ../../src/conf/domain_event.c:2179:20: error: cast increases required alignment of target type [-Werror=cast-align] monitorEvent = (virDomainQemuMonitorEventPtr) event; ^ cc1: all warnings being treated as errors Makefile:8525: recipe for target 'conf/libvirt_conf_la-domain_event.lo' failed make[3]: *** [conf/libvirt_conf_la-domain_event.lo] Error 1 make[3]: Leaving directory '/builds/libvirt/libvirt/build/src' Makefile:5995: recipe for target 'all' failed make[2]: *** [all] Error 2 make[2]: Leaving directory '/builds/libvirt/libvirt/build/src' Makefile:777: recipe for target 'all-recursive' failed make[1]: *** [all-recursive] Error 1 make[1]: Leaving directory '/builds/libvirt/libvirt/build' Makefile:670: recipe for target 'all' failed make: *** [all] Error 2 section_end:1591302006:build_script section_start:1591302006:after_script Running after_script section_end:1591302008:after_script section_start:1591302008:upload_artifacts_on_failure Uploading artifacts for failed job section_end:1591302009:upload_artifacts_on_failure ERROR: Job failed: exit code 1  Job #582032258 ( https://gitlab.com/libvirt/libvirt/-/jobs/582032258/raw ) Stage: cross_build Name: armv6l-debian-9 Trace: ../../src/conf/domain_event.c:1785:34: error: cast increases required alignment of target type [-Werror=cast-align] balloonChangeEvent = (virDomainEventBalloonChangePtr)event; ^ ../../src/conf/domain_event.c:1896:35: error: cast increases required alignment of target type [-Werror=cast-align] blockThresholdEvent = (virDomainEventBlockThresholdPtr)event; ^ ../../src/conf/domain_event.c: In function 'virDomainQemuMonitorEventDispatchFunc': ../../src/conf/domain_event.c:1974:24: error: cast increases required alignment of target type [-Werror=cast-align] qemuMonitorEvent = (virDomainQemuMonitorEventPtr)event; ^ ../../src/conf/domain_event.c: In function 'virDomainQemuMonitorEventFilter': ../../src/conf/domain_event.c:2179:20: error: cast increases required alignment of target type [-Werror=cast-align] monitorEvent = (virDomainQemuMonitorEventPtr) event; ^ cc1: all warnings being treated as errors Makefile:8525: recipe for target 'conf/libvirt_conf_la-domain_event.lo' failed make[3]: *** [conf/libvirt_conf_la-domain_event.lo] Error 1 make[3]: Leaving directory '/builds/libvirt/libvirt/build/src' Makefile:5995: recipe for target 'all' failed make[2]: *** [all] Error 2 make[2]: Leaving directory '/builds/libvirt/libvirt/build/src' Makefile:777: recipe for target 'all-recursive' failed make[1]: *** [all-recursive] Error 1 make[1]: Leaving directory '/builds/libvirt/libvirt/build' Makefile:670: recipe for target 'all' failed make: *** [all] Error 2 section_end:1591301978:build_script section_start:1591301978:after_script Running after_script section_end:1591301979:after_script section_start:1591301979:upload_artifacts_on_failure Uploading artifacts for failed job section_end:1591301981:upload_artifacts_on_failure ERROR: Job failed: exit code 1  Job #582032443 ( https://gitlab.com/libvirt/libvirt/-/jobs/582032443/raw ) Stage: cross_build Name: mipsel-debian-sid Trace: ../../src/conf/domain_event.c: In function 'virDomainEventDispatchDefaultFunc': ../../src/conf/domain_event.c:1656:30: error: cast increases required alignment of target type [-Werror=cast-align] 1656 | rtcChangeEvent = (virDomainEventRTCChangePtr)event; | ^ ../../src/conf/domain_event.c:1785:34: error: cast increases required alignment of target type [-Werror=cast-align] 1785 | balloonChangeEvent = (virDomainEventBalloonChangePtr)event; | ^ ../../src/conf/domain_event.c:1896:35: error: cast increases required alignment of target type [-Werror=cast-align] 1896 | blockThresholdEvent = (virDomainEventBlockThresholdPtr)event; | ^ ../../src/conf/domain_event.c: In function 'virDomainQemuMonitorEventDispatchFunc': ../../src/conf/domain_event.c:1974:24: error: cast increases required alignment of target type [-Werror=cast-align] 1974 | qemuMonitorEvent = (virDomainQemuMonitorEventPtr)event; | ^ ../../src/conf/domain_event.c: In function 'virDomainQemuMonitorEventFilter': ../../src/conf/domain_event.c:2179:20: error: cast increases required alignment of target type [-Werror=cast-align] 2179 | monitorEvent = (virDomainQemuMonitorEventPtr) event; | ^ cc1: all warnings being treated as errors make[3]: *** [Makefile:8979: conf/libvirt_conf_la-domain_event.lo] Error 1 make[3]: Leaving directory '/builds/libvirt/libvirt/build/src' make[2]: *** [Makefile:6443: all] Error 2 make[2]: Leaving directory '/builds/libvirt/libvirt/build/src' make[1]: *** [Makefile:777: all-recursive] Error 1 make[1]: Leaving directory '/builds/libvirt/libvirt/build' make: *** [Makefile:670: all] Error 2 section_end:1591301971:build_script section_start:1591301971:after_script Running after_script section_end:1591301973:after_script section_start:1591301973:upload_artifacts_on_failure Uploading artifacts for failed job section_end:1591301974:upload_artifacts_on_failure ERROR: Job failed: exit code 1  Job #582032327 ( https://gitlab.com/libvirt/libvirt/-/jobs/582032327/raw ) Stage: cross_build Name: armv7l-debian-sid Trace: ../../src/conf/domain_event.c: In function 'virDomainEventDispatchDefaultFunc': ../../src/conf/domain_event.c:1656:30: error: cast increases required alignment of target type [-Werror=cast-align] 1656 | rtcChangeEvent = (virDomainEventRTCChangePtr)event; | ^ ../../src/conf/domain_event.c:1785:34: error: cast increases required alignment of target type [-Werror=cast-align] 1785 | balloonChangeEvent = (virDomainEventBalloonChangePtr)event; | ^ ../../src/conf/domain_event.c:1896:35: error: cast increases required alignment of target type [-Werror=cast-align] 1896 | blockThresholdEvent = (virDomainEventBlockThresholdPtr)event; | ^ ../../src/conf/domain_event.c: In function 'virDomainQemuMonitorEventDispatchFunc': ../../src/conf/domain_event.c:1974:24: error: cast increases required alignment of target type [-Werror=cast-align] 1974 | qemuMonitorEvent = (virDomainQemuMonitorEventPtr)event; | ^ ../../src/conf/domain_event.c: In function 'virDomainQemuMonitorEventFilter': ../../src/conf/domain_event.c:2179:20: error: cast increases required alignment of target type [-Werror=cast-align] 2179 | monitorEvent = (virDomainQemuMonitorEventPtr) event; | ^ cc1: all warnings being treated as errors make[3]: *** [Makefile:8979: conf/libvirt_conf_la-domain_event.lo] Error 1 make[3]: Leaving directory '/builds/libvirt/libvirt/build/src' make[2]: *** [Makefile:6443: all] Error 2 make[2]: Leaving directory '/builds/libvirt/libvirt/build/src' make[1]: *** [Makefile:777: all-recursive] Error 1 make[1]: Leaving directory '/builds/libvirt/libvirt/build' make: *** [Makefile:670: all] Error 2 section_end:1591301954:build_script section_start:1591301954:after_script Running after_script section_end:1591301956:after_script section_start:1591301956:upload_artifacts_on_failure Uploading artifacts for failed job section_end:1591301957:upload_artifacts_on_failure ERROR: Job failed: exit code 1  -- You're receiving this email because of your account on gitlab.com.
1 0
0 0
libvirt | Pipeline #152842192 has failed for master | 611e0312
by GitLab 04 Jun '20

04 Jun '20
Your pipeline has failed. Project: libvirt ( https://gitlab.com/libvirt/libvirt ) Branch: master ( https://gitlab.com/libvirt/libvirt/-/commits/master ) Commit: 611e0312 ( https://gitlab.com/libvirt/libvirt/-/commit/611e03127fcc84c7cd64b1da30140ca… ) Commit Message: po: go back to storing the .pot file in git To... Commit Author: Daniel Berrange ( https://gitlab.com/berrange ) Pipeline #152842192 ( https://gitlab.com/libvirt/libvirt/-/pipelines/152842192 ) triggered by Daniel Berrange ( https://gitlab.com/berrange ) had 1 failed build. Job #581149021 ( https://gitlab.com/libvirt/libvirt/-/jobs/581149021/raw ) Stage: prebuild Name: potfile Trace: GEN virtstoraged-admin.socket GEN libvirtd.service GEN libvirtd.socket GEN libvirtd-ro.socket GEN libvirtd-admin.socket GEN libvirtd-tcp.socket GEN libvirtd-tls.socket GEN virtproxyd.service GEN virtproxyd.socket GEN virtproxyd-ro.socket GEN virtproxyd-admin.socket GEN virtproxyd-tcp.socket GEN virtproxyd-tls.socket GEN virt-guest-shutdown.target make: Leaving directory '/builds/libvirt/libvirt/build/src' $ $MAKE -C po libvirt.pot make: Entering directory '/builds/libvirt/libvirt/build/po' GEN POTFILES xgettext -o libvirt.pot-t --default-domain=libvirt --from-code=utf-8 --add-comments=TRANSLATORS: --keyword=_ --keyword=N_ --copyright-holder='The Libvirt authors' --package-name="libvirt" --package-version="6.5.0" --msgid-bugs-address="https://libvirt.org/bugs.html" --sort-output \ --files-from=/builds/libvirt/libvirt/build/po/POTFILES /usr/bin/sed -e "s|text/plain; charset=CHARSET|text/plain; charset=UTF-8|g" -e "s|SOME DESCRIPTIVE TITLE|Libvirt package strings|g" -e "s|Copyright (C) YEAR|Copyright (C) $(date +'%Y')|" < libvirt.pot-t > ../../po/libvirt.pot rm -f libvirt.pot-t make: Leaving directory '/builds/libvirt/libvirt/build/po' $ cd .. $ mv build/po/libvirt.pot libvirt.pot mv: cannot stat 'build/po/libvirt.pot': No such file or directory section_end:1591272340:build_script section_start:1591272340:after_script Running after_script section_end:1591272341:after_script section_start:1591272341:upload_artifacts_on_failure Uploading artifacts for failed job section_end:1591272343:upload_artifacts_on_failure ERROR: Job failed: exit code 1  -- You're receiving this email because of your account on gitlab.com.
1 0
0 0
Build failed in Jenkins: libvirt+mingw32-build » libvirt-fedora-rawhide #1586
by ci@centos.org 04 Jun '20

04 Jun '20
See <https://ci.centos.org/job/libvirt+mingw32-build/systems=libvirt-fedora-rawh…> Changes: [berrange] qemu: stop checking virObjectUnref return value [berrange] src: make virObjectUnref return void [berrange] test: allocate numa cells separately from driver [berrange] src: don't include ref count in debug messages / probes [berrange] src: don't use VIR_FREE on an object allocation [berrange] src: make virObject inherit from GObject ------------------------------------------ [...truncated 40.67 KB...] GEN access/viraccessapichecklxc.c GEN libvirt_access.xml GEN libvirt_access_qemu.xml GEN libvirt_access_lxc.xml GEN logging/log_protocol.h GEN logging/log_daemon_dispatch_stubs.h GEN locking/lock_protocol.h GEN locking/lock_daemon_dispatch_stubs.h GEN admin/admin_protocol.h GEN admin/admin_client.h GEN admin/admin_server_dispatch_stubs.h GEN rpc/virnetprotocol.h GEN rpc/virkeepaliveprotocol.h GEN .esx_vi_generator.stamp GEN .hyperv_wmi_generator.stamp GEN lxc/lxc_monitor_protocol.h GEN lxc/lxc_monitor_dispatch.h GEN hyperv/hyperv_wmi_classes.generated.typedef GEN hyperv/hyperv_wmi_classes.generated.h GEN hyperv/hyperv_wmi_classes.generated.c GEN esx/esx_vi_types.generated.typedef GEN esx/esx_vi_types.generated.typeenum GEN esx/esx_vi_types.generated.typetostring GEN esx/esx_vi_types.generated.typefromstring GEN esx/esx_vi_types.generated.h GEN esx/esx_vi_types.generated.c GEN esx/esx_vi_methods.generated.h GEN esx/esx_vi_methods.generated.c GEN esx/esx_vi_methods.generated.macro GEN esx/esx_vi.generated.h GEN esx/esx_vi.generated.c GEN lxc/lxc_controller_dispatch.h GEN remote/remote_protocol.h GEN remote/remote_client_bodies.h GEN remote/lxc_protocol.h GEN remote/lxc_client_bodies.h GEN remote/qemu_protocol.h GEN remote/qemu_client_bodies.h GEN remote/remote_daemon_dispatch_stubs.h GEN remote/lxc_daemon_dispatch_stubs.h GEN remote/qemu_daemon_dispatch_stubs.h GEN libvirt_access.syms GEN libvirt_access_qemu.syms GEN libvirt_access_lxc.syms GEN admin/libvirt_admin.syms GEN libvirt_qemu.def GEN libvirt_lxc.def GEN libvirtd.qemu.logrotate GEN libvirtd.lxc.logrotate GEN libvirtd.libxl.logrotate GEN libvirtd.logrotate GEN logging/log_protocol.c GEN locking/lock_protocol.c GEN admin/admin_protocol.c GEN rpc/virnetprotocol.c GEN rpc/virkeepaliveprotocol.c GEN lxc/lxc_monitor_protocol.c GEN remote/remote_protocol.c GEN remote/lxc_protocol.c GEN remote/qemu_protocol.c GEN admin/libvirt_admin.def GEN libvirt.syms GEN libvirt.def /usr/bin/make all-am make[3]: Entering directory '<https://ci.centos.org/job/libvirt+mingw32-build/systems=libvirt-fedora-rawh…'> CC libvirt_driver_la-driver.lo CC libvirt_driver_la-datatypes.lo CC libvirt_driver_la-libvirt.lo CC libvirt_driver_la-libvirt-domain.lo CC libvirt_driver_la-libvirt-domain-checkpoint.lo CC libvirt_driver_la-libvirt-domain-snapshot.lo CC libvirt_driver_la-libvirt-host.lo CC libvirt_driver_la-libvirt-interface.lo CC libvirt_driver_la-libvirt-network.lo CC libvirt_driver_la-libvirt-nodedev.lo CC libvirt_driver_la-libvirt-nwfilter.lo CC libvirt_driver_la-libvirt-secret.lo CC libvirt_driver_la-libvirt-storage.lo CC libvirt_driver_la-libvirt-stream.lo CC libvirt_qemu_la-libvirt-qemu.lo CC libvirt_lxc_la-libvirt-lxc.lo CC libvirt_admin_la-datatypes.lo CC admin/libvirt_admin_la-admin_protocol.lo CC admin/libvirt_driver_admin_la-admin_server.lo CC admin/libvirt_driver_admin_la-admin_server_dispatch.lo CC admin/libvirt_driver_admin_la-admin_protocol.lo CC util/libvirt_util_la-glibcompat.lo CC util/libvirt_util_la-viralloc.lo CC util/libvirt_util_la-virarch.lo CC util/libvirt_util_la-virarptable.lo CC util/libvirt_util_la-viraudit.lo CC util/libvirt_util_la-virauth.lo CC util/libvirt_util_la-virauthconfig.lo CC util/libvirt_util_la-virbitmap.lo CC util/libvirt_util_la-virbpf.lo CC util/libvirt_util_la-virbuffer.lo CC util/libvirt_util_la-virperf.lo CC util/libvirt_util_la-vircgroup.lo CC util/libvirt_util_la-vircgroupbackend.lo CC util/libvirt_util_la-vircgroupv1.lo CC util/libvirt_util_la-vircgroupv2.lo CC util/libvirt_util_la-vircgroupv2devices.lo CC util/libvirt_util_la-vircommand.lo CC util/libvirt_util_la-virconf.lo CC util/libvirt_util_la-vircrypto.lo CC util/libvirt_util_la-virdaemon.lo CC util/libvirt_util_la-virdbus.lo CC util/libvirt_util_la-virdevmapper.lo CC util/libvirt_util_la-virdnsmasq.lo CC util/libvirt_util_la-virebtables.lo CC util/libvirt_util_la-virenum.lo CC util/libvirt_util_la-virerror.lo CC util/libvirt_util_la-virevent.lo CC util/libvirt_util_la-vireventglib.lo CC util/libvirt_util_la-vireventglibwatch.lo CC util/libvirt_util_la-vireventthread.lo CC util/libvirt_util_la-virfcp.lo CC util/libvirt_util_la-virfdstream.lo CC util/libvirt_util_la-virfile.lo CC util/libvirt_util_la-virfirewall.lo CC util/libvirt_util_la-virfirewalld.lo CC util/libvirt_util_la-virfirmware.lo CC util/libvirt_util_la-virgettext.lo CC util/libvirt_util_la-virgic.lo CC util/libvirt_util_la-virhash.lo CC util/libvirt_util_la-virhashcode.lo CC util/libvirt_util_la-virhook.lo CC util/libvirt_util_la-virhostcpu.lo CC util/libvirt_util_la-virhostmem.lo CC util/libvirt_util_la-virhostuptime.lo CC util/libvirt_util_la-viridentity.lo CC util/libvirt_util_la-virinitctl.lo CC util/libvirt_util_la-viriptables.lo CC util/libvirt_util_la-viriscsi.lo CC util/libvirt_util_la-virjson.lo CC util/libvirt_util_la-virkeycode.lo CC util/libvirt_util_la-virlease.lo CC util/libvirt_util_la-virlockspace.lo CC util/libvirt_util_la-virlog.lo CC util/libvirt_util_la-virmacaddr.lo CC util/libvirt_util_la-virmacmap.lo CC util/libvirt_util_la-virmodule.lo CC util/libvirt_util_la-virnetdev.lo CC util/libvirt_util_la-virnetdevbandwidth.lo CC util/libvirt_util_la-virnetdevbridge.lo CC util/libvirt_util_la-virnetdevip.lo CC util/libvirt_util_la-virnetdevmacvlan.lo CC util/libvirt_util_la-virnetdevmidonet.lo CC util/libvirt_util_la-virnetdevopenvswitch.lo CC util/libvirt_util_la-virnetdevtap.lo CC util/libvirt_util_la-virnetdevveth.lo CC util/libvirt_util_la-virnetdevvlan.lo CC util/libvirt_util_la-virnetdevvportprofile.lo CC util/libvirt_util_la-virnetlink.lo CC util/libvirt_util_la-virnodesuspend.lo CC util/libvirt_util_la-virnvme.lo CC util/libvirt_util_la-virkmod.lo CC util/libvirt_util_la-virnuma.lo CC util/libvirt_util_la-virobject.lo CC util/libvirt_util_la-virpci.lo CC util/libvirt_util_la-virpidfile.lo CC util/libvirt_util_la-virpolkit.lo CC util/libvirt_util_la-virportallocator.lo CC util/libvirt_util_la-virprocess.lo CC util/libvirt_util_la-virqemu.lo CC util/libvirt_util_la-virrandom.lo CC util/libvirt_util_la-virresctrl.lo CC util/libvirt_util_la-virrotatingfile.lo CC util/libvirt_util_la-virscsi.lo CC util/libvirt_util_la-virscsihost.lo CC util/libvirt_util_la-virscsivhost.lo CC util/libvirt_util_la-virseclabel.lo CC util/libvirt_util_la-virsecret.lo CC util/libvirt_util_la-virsocket.lo CC util/libvirt_util_la-virsocketaddr.lo CC util/libvirt_util_la-virstorageencryption.lo CC util/libvirt_util_la-virstoragefile.lo CC util/libvirt_util_la-virstoragefilebackend.lo CC util/libvirt_util_la-virstring.lo CC util/libvirt_util_la-virsysinfo.lo CC util/libvirt_util_la-virsystemd.lo CC util/libvirt_util_la-virthread.lo CC util/libvirt_util_la-virthreadjob.lo CC util/libvirt_util_la-virthreadpool.lo CC util/libvirt_util_la-virtime.lo CC util/libvirt_util_la-virtpm.lo CC util/libvirt_util_la-virtypedparam-public.lo CC util/libvirt_util_la-virtypedparam.lo CC util/libvirt_util_la-virusb.lo CC util/libvirt_util_la-viruri.lo CC util/libvirt_util_la-virutil.lo CC util/libvirt_util_la-viruuid.lo CC util/libvirt_util_la-virvhba.lo CC util/libvirt_util_la-virvsock.lo CC util/libvirt_util_la-virxml.lo CC util/libvirt_util_la-virmdev.lo CC util/libvirt_util_la-virfilecache.lo CC conf/libvirt_conf_la-netdev_bandwidth_conf.lo CC conf/libvirt_conf_la-netdev_vport_profile_conf.lo CC conf/libvirt_conf_la-netdev_vlan_conf.lo CC conf/libvirt_conf_la-virnetworkportdef.lo CC conf/libvirt_conf_la-backup_conf.lo CC conf/libvirt_conf_la-capabilities.lo CC conf/libvirt_conf_la-checkpoint_conf.lo CC conf/libvirt_conf_la-domain_addr.lo CC conf/libvirt_conf_la-domain_capabilities.lo CC conf/libvirt_conf_la-domain_conf.lo CC conf/libvirt_conf_la-domain_audit.lo CC conf/libvirt_conf_la-domain_nwfilter.lo CC conf/libvirt_conf_la-virsavecookie.lo CC conf/libvirt_conf_la-moment_conf.lo CC conf/libvirt_conf_la-snapshot_conf.lo CC conf/libvirt_conf_la-numa_conf.lo CC conf/libvirt_conf_la-virdomaincheckpointobjlist.lo CC conf/libvirt_conf_la-virdomainobjlist.lo CC conf/libvirt_conf_la-virdomainmomentobjlist.lo CC conf/libvirt_conf_la-virdomainsnapshotobjlist.lo CC conf/libvirt_conf_la-object_event.lo CC conf/libvirt_conf_la-domain_event.lo CC conf/libvirt_conf_la-network_event.lo CC conf/libvirt_conf_la-storage_event.lo ../../src/conf/domain_event.c: In function 'virDomainEventDispatchDefaultFunc': ../../src/conf/domain_event.c:1656:30: error: cast increases required alignment of target type [-Werror=cast-align] 1656 | rtcChangeEvent = (virDomainEventRTCChangePtr)event; | ^ ../../src/conf/domain_event.c:1785:34: error: cast increases required alignment of target type [-Werror=cast-align] 1785 | balloonChangeEvent = (virDomainEventBalloonChangePtr)event; | ^ ../../src/conf/domain_event.c:1896:35: error: cast increases required alignment of target type [-Werror=cast-align] 1896 | blockThresholdEvent = (virDomainEventBlockThresholdPtr)event; | ^ ../../src/conf/domain_event.c: In function 'virDomainQemuMonitorEventDispatchFunc': ../../src/conf/domain_event.c:1974:24: error: cast increases required alignment of target type [-Werror=cast-align] 1974 | qemuMonitorEvent = (virDomainQemuMonitorEventPtr)event; | ^ ../../src/conf/domain_event.c: In function 'virDomainQemuMonitorEventFilter': ../../src/conf/domain_event.c:2179:20: error: cast increases required alignment of target type [-Werror=cast-align] 2179 | monitorEvent = (virDomainQemuMonitorEventPtr) event; | ^ cc1: all warnings being treated as errors make[3]: *** [Makefile:8979: conf/libvirt_conf_la-domain_event.lo] Error 1 make[3]: *** Waiting for unfinished jobs.... make[3]: Leaving directory '<https://ci.centos.org/job/libvirt+mingw32-build/systems=libvirt-fedora-rawh…'> make[2]: *** [Makefile:6443: all] Error 2 make[2]: Leaving directory '<https://ci.centos.org/job/libvirt+mingw32-build/systems=libvirt-fedora-rawh…'> make[1]: *** [Makefile:777: all-recursive] Error 1 make[1]: Leaving directory '<https://ci.centos.org/job/libvirt+mingw32-build/systems=libvirt-fedora-rawh…'> make: *** [Makefile:670: all] Error 2 Build step 'Execute shell' marked build as failure
1 9
0 0
libvirt | Pipeline #152798508 has failed for master | 03aec9c3
by GitLab 04 Jun '20

04 Jun '20
Your pipeline has failed. Project: libvirt ( https://gitlab.com/libvirt/libvirt ) Branch: master ( https://gitlab.com/libvirt/libvirt/-/commits/master ) Commit: 03aec9c3 ( https://gitlab.com/libvirt/libvirt/-/commit/03aec9c350670d3c3f3833d0dafb0ed… ) Commit Message: gitdm: Add missing entries A few new individua... Commit Author: Andrea Bolognani ( https://gitlab.com/abologna ) Pipeline #152798508 ( https://gitlab.com/libvirt/libvirt/-/pipelines/152798508 ) triggered by Andrea Bolognani ( https://gitlab.com/abologna ) had 5 failed builds. Job #580950190 ( https://gitlab.com/libvirt/libvirt/-/jobs/580950190/raw ) Stage: cross_build Name: mingw32-fedora-rawhide Trace: ../../src/conf/domain_event.c: In function 'virDomainEventDispatchDefaultFunc': ../../src/conf/domain_event.c:1656:30: error: cast increases required alignment of target type [-Werror=cast-align] 1656 | rtcChangeEvent = (virDomainEventRTCChangePtr)event; | ^ ../../src/conf/domain_event.c:1785:34: error: cast increases required alignment of target type [-Werror=cast-align] 1785 | balloonChangeEvent = (virDomainEventBalloonChangePtr)event; | ^ ../../src/conf/domain_event.c:1896:35: error: cast increases required alignment of target type [-Werror=cast-align] 1896 | blockThresholdEvent = (virDomainEventBlockThresholdPtr)event; | ^ ../../src/conf/domain_event.c: In function 'virDomainQemuMonitorEventDispatchFunc': ../../src/conf/domain_event.c:1974:24: error: cast increases required alignment of target type [-Werror=cast-align] 1974 | qemuMonitorEvent = (virDomainQemuMonitorEventPtr)event; | ^ ../../src/conf/domain_event.c: In function 'virDomainQemuMonitorEventFilter': ../../src/conf/domain_event.c:2179:20: error: cast increases required alignment of target type [-Werror=cast-align] 2179 | monitorEvent = (virDomainQemuMonitorEventPtr) event; | ^ cc1: all warnings being treated as errors make[3]: *** [Makefile:8979: conf/libvirt_conf_la-domain_event.lo] Error 1 make[3]: Leaving directory '/builds/libvirt/libvirt/build/src' make[2]: *** [Makefile:6443: all] Error 2 make[2]: Leaving directory '/builds/libvirt/libvirt/build/src' make[1]: *** [Makefile:777: all-recursive] Error 1 make[1]: Leaving directory '/builds/libvirt/libvirt/build' make: *** [Makefile:670: all] Error 2 section_end:1591266589:build_script section_start:1591266589:after_script Running after_script section_end:1591266591:after_script section_start:1591266591:upload_artifacts_on_failure Uploading artifacts for failed job section_end:1591266592:upload_artifacts_on_failure ERROR: Job failed: exit code 1  Job #580950166 ( https://gitlab.com/libvirt/libvirt/-/jobs/580950166/raw ) Stage: cross_build Name: mips-debian-9 Trace: ../../src/conf/domain_event.c:1785:34: error: cast increases required alignment of target type [-Werror=cast-align] balloonChangeEvent = (virDomainEventBalloonChangePtr)event; ^ ../../src/conf/domain_event.c:1896:35: error: cast increases required alignment of target type [-Werror=cast-align] blockThresholdEvent = (virDomainEventBlockThresholdPtr)event; ^ ../../src/conf/domain_event.c: In function 'virDomainQemuMonitorEventDispatchFunc': ../../src/conf/domain_event.c:1974:24: error: cast increases required alignment of target type [-Werror=cast-align] qemuMonitorEvent = (virDomainQemuMonitorEventPtr)event; ^ ../../src/conf/domain_event.c: In function 'virDomainQemuMonitorEventFilter': ../../src/conf/domain_event.c:2179:20: error: cast increases required alignment of target type [-Werror=cast-align] monitorEvent = (virDomainQemuMonitorEventPtr) event; ^ cc1: all warnings being treated as errors Makefile:8525: recipe for target 'conf/libvirt_conf_la-domain_event.lo' failed make[3]: *** [conf/libvirt_conf_la-domain_event.lo] Error 1 make[3]: Leaving directory '/builds/libvirt/libvirt/build/src' Makefile:5995: recipe for target 'all' failed make[2]: *** [all] Error 2 make[2]: Leaving directory '/builds/libvirt/libvirt/build/src' Makefile:777: recipe for target 'all-recursive' failed make[1]: *** [all-recursive] Error 1 make[1]: Leaving directory '/builds/libvirt/libvirt/build' Makefile:670: recipe for target 'all' failed make: *** [all] Error 2 section_end:1591266579:build_script section_start:1591266579:after_script Running after_script section_end:1591266581:after_script section_start:1591266581:upload_artifacts_on_failure Uploading artifacts for failed job section_end:1591266582:upload_artifacts_on_failure ERROR: Job failed: exit code 1  Job #580950162 ( https://gitlab.com/libvirt/libvirt/-/jobs/580950162/raw ) Stage: cross_build Name: armv6l-debian-9 Trace: ../../src/conf/domain_event.c:1785:34: error: cast increases required alignment of target type [-Werror=cast-align] balloonChangeEvent = (virDomainEventBalloonChangePtr)event; ^ ../../src/conf/domain_event.c:1896:35: error: cast increases required alignment of target type [-Werror=cast-align] blockThresholdEvent = (virDomainEventBlockThresholdPtr)event; ^ ../../src/conf/domain_event.c: In function 'virDomainQemuMonitorEventDispatchFunc': ../../src/conf/domain_event.c:1974:24: error: cast increases required alignment of target type [-Werror=cast-align] qemuMonitorEvent = (virDomainQemuMonitorEventPtr)event; ^ ../../src/conf/domain_event.c: In function 'virDomainQemuMonitorEventFilter': ../../src/conf/domain_event.c:2179:20: error: cast increases required alignment of target type [-Werror=cast-align] monitorEvent = (virDomainQemuMonitorEventPtr) event; ^ cc1: all warnings being treated as errors Makefile:8525: recipe for target 'conf/libvirt_conf_la-domain_event.lo' failed make[3]: *** [conf/libvirt_conf_la-domain_event.lo] Error 1 make[3]: Leaving directory '/builds/libvirt/libvirt/build/src' Makefile:5995: recipe for target 'all' failed make[2]: *** [all] Error 2 make[2]: Leaving directory '/builds/libvirt/libvirt/build/src' Makefile:777: recipe for target 'all-recursive' failed make[1]: *** [all-recursive] Error 1 make[1]: Leaving directory '/builds/libvirt/libvirt/build' Makefile:670: recipe for target 'all' failed make: *** [all] Error 2 section_end:1591266577:build_script section_start:1591266577:after_script Running after_script section_end:1591266579:after_script section_start:1591266579:upload_artifacts_on_failure Uploading artifacts for failed job section_end:1591266580:upload_artifacts_on_failure ERROR: Job failed: exit code 1  Job #580950187 ( https://gitlab.com/libvirt/libvirt/-/jobs/580950187/raw ) Stage: cross_build Name: mipsel-debian-sid Trace: ../../src/conf/domain_event.c: In function 'virDomainEventDispatchDefaultFunc': ../../src/conf/domain_event.c:1656:30: error: cast increases required alignment of target type [-Werror=cast-align] 1656 | rtcChangeEvent = (virDomainEventRTCChangePtr)event; | ^ ../../src/conf/domain_event.c:1785:34: error: cast increases required alignment of target type [-Werror=cast-align] 1785 | balloonChangeEvent = (virDomainEventBalloonChangePtr)event; | ^ ../../src/conf/domain_event.c:1896:35: error: cast increases required alignment of target type [-Werror=cast-align] 1896 | blockThresholdEvent = (virDomainEventBlockThresholdPtr)event; | ^ ../../src/conf/domain_event.c: In function 'virDomainQemuMonitorEventDispatchFunc': ../../src/conf/domain_event.c:1974:24: error: cast increases required alignment of target type [-Werror=cast-align] 1974 | qemuMonitorEvent = (virDomainQemuMonitorEventPtr)event; | ^ ../../src/conf/domain_event.c: In function 'virDomainQemuMonitorEventFilter': ../../src/conf/domain_event.c:2179:20: error: cast increases required alignment of target type [-Werror=cast-align] 2179 | monitorEvent = (virDomainQemuMonitorEventPtr) event; | ^ cc1: all warnings being treated as errors make[3]: *** [Makefile:8979: conf/libvirt_conf_la-domain_event.lo] Error 1 make[3]: Leaving directory '/builds/libvirt/libvirt/build/src' make[2]: *** [Makefile:6443: all] Error 2 make[2]: Leaving directory '/builds/libvirt/libvirt/build/src' make[1]: *** [Makefile:777: all-recursive] Error 1 make[1]: Leaving directory '/builds/libvirt/libvirt/build' make: *** [Makefile:670: all] Error 2 section_end:1591266565:build_script section_start:1591266565:after_script Running after_script section_end:1591266567:after_script section_start:1591266567:upload_artifacts_on_failure Uploading artifacts for failed job section_end:1591266568:upload_artifacts_on_failure ERROR: Job failed: exit code 1  Job #580950179 ( https://gitlab.com/libvirt/libvirt/-/jobs/580950179/raw ) Stage: cross_build Name: armv7l-debian-sid Trace: ../../src/conf/domain_event.c: In function 'virDomainEventDispatchDefaultFunc': ../../src/conf/domain_event.c:1656:30: error: cast increases required alignment of target type [-Werror=cast-align] 1656 | rtcChangeEvent = (virDomainEventRTCChangePtr)event; | ^ ../../src/conf/domain_event.c:1785:34: error: cast increases required alignment of target type [-Werror=cast-align] 1785 | balloonChangeEvent = (virDomainEventBalloonChangePtr)event; | ^ ../../src/conf/domain_event.c:1896:35: error: cast increases required alignment of target type [-Werror=cast-align] 1896 | blockThresholdEvent = (virDomainEventBlockThresholdPtr)event; | ^ ../../src/conf/domain_event.c: In function 'virDomainQemuMonitorEventDispatchFunc': ../../src/conf/domain_event.c:1974:24: error: cast increases required alignment of target type [-Werror=cast-align] 1974 | qemuMonitorEvent = (virDomainQemuMonitorEventPtr)event; | ^ ../../src/conf/domain_event.c: In function 'virDomainQemuMonitorEventFilter': ../../src/conf/domain_event.c:2179:20: error: cast increases required alignment of target type [-Werror=cast-align] 2179 | monitorEvent = (virDomainQemuMonitorEventPtr) event; | ^ cc1: all warnings being treated as errors make[3]: *** [Makefile:8979: conf/libvirt_conf_la-domain_event.lo] Error 1 make[3]: Leaving directory '/builds/libvirt/libvirt/build/src' make[2]: *** [Makefile:6443: all] Error 2 make[2]: Leaving directory '/builds/libvirt/libvirt/build/src' make[1]: *** [Makefile:777: all-recursive] Error 1 make[1]: Leaving directory '/builds/libvirt/libvirt/build' make: *** [Makefile:670: all] Error 2 section_end:1591266541:build_script section_start:1591266541:after_script Running after_script section_end:1591266543:after_script section_start:1591266543:upload_artifacts_on_failure Uploading artifacts for failed job section_end:1591266544:upload_artifacts_on_failure ERROR: Job failed: exit code 1  -- You're receiving this email because of your account on gitlab.com.
1 0
0 0
libvirt | Pipeline #152766818 has failed for master | 37ae0426
by GitLab 04 Jun '20

04 Jun '20
Your pipeline has failed. Project: libvirt ( https://gitlab.com/libvirt/libvirt ) Branch: master ( https://gitlab.com/libvirt/libvirt/-/commits/master ) Commit: 37ae0426 ( https://gitlab.com/libvirt/libvirt/-/commit/37ae0426420a2f682cc96ee457a8cae… ) Commit Message: conf: force 8 byte alignment for virObjectEvent... Commit Author: Daniel Berrange ( https://gitlab.com/berrange ) Pipeline #152766818 ( https://gitlab.com/libvirt/libvirt/-/pipelines/152766818 ) triggered by Daniel Berrange ( https://gitlab.com/berrange ) had 5 failed builds. Job #580803557 ( https://gitlab.com/libvirt/libvirt/-/jobs/580803557/raw ) Stage: cross_build Name: mingw32-fedora-rawhide Trace: ../../src/conf/domain_event.c: In function 'virDomainEventDispatchDefaultFunc': ../../src/conf/domain_event.c:1656:30: error: cast increases required alignment of target type [-Werror=cast-align] 1656 | rtcChangeEvent = (virDomainEventRTCChangePtr)event; | ^ ../../src/conf/domain_event.c:1785:34: error: cast increases required alignment of target type [-Werror=cast-align] 1785 | balloonChangeEvent = (virDomainEventBalloonChangePtr)event; | ^ ../../src/conf/domain_event.c:1896:35: error: cast increases required alignment of target type [-Werror=cast-align] 1896 | blockThresholdEvent = (virDomainEventBlockThresholdPtr)event; | ^ ../../src/conf/domain_event.c: In function 'virDomainQemuMonitorEventDispatchFunc': ../../src/conf/domain_event.c:1974:24: error: cast increases required alignment of target type [-Werror=cast-align] 1974 | qemuMonitorEvent = (virDomainQemuMonitorEventPtr)event; | ^ ../../src/conf/domain_event.c: In function 'virDomainQemuMonitorEventFilter': ../../src/conf/domain_event.c:2179:20: error: cast increases required alignment of target type [-Werror=cast-align] 2179 | monitorEvent = (virDomainQemuMonitorEventPtr) event; | ^ cc1: all warnings being treated as errors make[3]: *** [Makefile:8979: conf/libvirt_conf_la-domain_event.lo] Error 1 make[3]: Leaving directory '/builds/libvirt/libvirt/build/src' make[2]: *** [Makefile:6443: all] Error 2 make[2]: Leaving directory '/builds/libvirt/libvirt/build/src' make[1]: *** [Makefile:777: all-recursive] Error 1 make[1]: Leaving directory '/builds/libvirt/libvirt/build' make: *** [Makefile:670: all] Error 2 section_end:1591262700:build_script section_start:1591262700:after_script Running after_script section_end:1591262702:after_script section_start:1591262702:upload_artifacts_on_failure Uploading artifacts for failed job section_end:1591262703:upload_artifacts_on_failure ERROR: Job failed: exit code 1  Job #580803539 ( https://gitlab.com/libvirt/libvirt/-/jobs/580803539/raw ) Stage: cross_build Name: mips-debian-9 Trace: ../../src/conf/domain_event.c:1785:34: error: cast increases required alignment of target type [-Werror=cast-align] balloonChangeEvent = (virDomainEventBalloonChangePtr)event; ^ ../../src/conf/domain_event.c:1896:35: error: cast increases required alignment of target type [-Werror=cast-align] blockThresholdEvent = (virDomainEventBlockThresholdPtr)event; ^ ../../src/conf/domain_event.c: In function 'virDomainQemuMonitorEventDispatchFunc': ../../src/conf/domain_event.c:1974:24: error: cast increases required alignment of target type [-Werror=cast-align] qemuMonitorEvent = (virDomainQemuMonitorEventPtr)event; ^ ../../src/conf/domain_event.c: In function 'virDomainQemuMonitorEventFilter': ../../src/conf/domain_event.c:2179:20: error: cast increases required alignment of target type [-Werror=cast-align] monitorEvent = (virDomainQemuMonitorEventPtr) event; ^ cc1: all warnings being treated as errors Makefile:8525: recipe for target 'conf/libvirt_conf_la-domain_event.lo' failed make[3]: *** [conf/libvirt_conf_la-domain_event.lo] Error 1 make[3]: Leaving directory '/builds/libvirt/libvirt/build/src' Makefile:5995: recipe for target 'all' failed make[2]: *** [all] Error 2 make[2]: Leaving directory '/builds/libvirt/libvirt/build/src' Makefile:777: recipe for target 'all-recursive' failed make[1]: *** [all-recursive] Error 1 make[1]: Leaving directory '/builds/libvirt/libvirt/build' Makefile:670: recipe for target 'all' failed make: *** [all] Error 2 section_end:1591262695:build_script section_start:1591262695:after_script Running after_script section_end:1591262696:after_script section_start:1591262696:upload_artifacts_on_failure Uploading artifacts for failed job section_end:1591262697:upload_artifacts_on_failure ERROR: Job failed: exit code 1  Job #580803532 ( https://gitlab.com/libvirt/libvirt/-/jobs/580803532/raw ) Stage: cross_build Name: armv6l-debian-9 Trace: ../../src/conf/domain_event.c:1785:34: error: cast increases required alignment of target type [-Werror=cast-align] balloonChangeEvent = (virDomainEventBalloonChangePtr)event; ^ ../../src/conf/domain_event.c:1896:35: error: cast increases required alignment of target type [-Werror=cast-align] blockThresholdEvent = (virDomainEventBlockThresholdPtr)event; ^ ../../src/conf/domain_event.c: In function 'virDomainQemuMonitorEventDispatchFunc': ../../src/conf/domain_event.c:1974:24: error: cast increases required alignment of target type [-Werror=cast-align] qemuMonitorEvent = (virDomainQemuMonitorEventPtr)event; ^ ../../src/conf/domain_event.c: In function 'virDomainQemuMonitorEventFilter': ../../src/conf/domain_event.c:2179:20: error: cast increases required alignment of target type [-Werror=cast-align] monitorEvent = (virDomainQemuMonitorEventPtr) event; ^ cc1: all warnings being treated as errors Makefile:8525: recipe for target 'conf/libvirt_conf_la-domain_event.lo' failed make[3]: *** [conf/libvirt_conf_la-domain_event.lo] Error 1 make[3]: Leaving directory '/builds/libvirt/libvirt/build/src' Makefile:5995: recipe for target 'all' failed make[2]: *** [all] Error 2 make[2]: Leaving directory '/builds/libvirt/libvirt/build/src' Makefile:777: recipe for target 'all-recursive' failed make[1]: *** [all-recursive] Error 1 make[1]: Leaving directory '/builds/libvirt/libvirt/build' Makefile:670: recipe for target 'all' failed make: *** [all] Error 2 section_end:1591262685:build_script section_start:1591262685:after_script Running after_script section_end:1591262687:after_script section_start:1591262687:upload_artifacts_on_failure Uploading artifacts for failed job section_end:1591262688:upload_artifacts_on_failure ERROR: Job failed: exit code 1  Job #580803554 ( https://gitlab.com/libvirt/libvirt/-/jobs/580803554/raw ) Stage: cross_build Name: mipsel-debian-sid Trace: ../../src/conf/domain_event.c: In function 'virDomainEventDispatchDefaultFunc': ../../src/conf/domain_event.c:1656:30: error: cast increases required alignment of target type [-Werror=cast-align] 1656 | rtcChangeEvent = (virDomainEventRTCChangePtr)event; | ^ ../../src/conf/domain_event.c:1785:34: error: cast increases required alignment of target type [-Werror=cast-align] 1785 | balloonChangeEvent = (virDomainEventBalloonChangePtr)event; | ^ ../../src/conf/domain_event.c:1896:35: error: cast increases required alignment of target type [-Werror=cast-align] 1896 | blockThresholdEvent = (virDomainEventBlockThresholdPtr)event; | ^ ../../src/conf/domain_event.c: In function 'virDomainQemuMonitorEventDispatchFunc': ../../src/conf/domain_event.c:1974:24: error: cast increases required alignment of target type [-Werror=cast-align] 1974 | qemuMonitorEvent = (virDomainQemuMonitorEventPtr)event; | ^ ../../src/conf/domain_event.c: In function 'virDomainQemuMonitorEventFilter': ../../src/conf/domain_event.c:2179:20: error: cast increases required alignment of target type [-Werror=cast-align] 2179 | monitorEvent = (virDomainQemuMonitorEventPtr) event; | ^ cc1: all warnings being treated as errors make[3]: *** [Makefile:8979: conf/libvirt_conf_la-domain_event.lo] Error 1 make[3]: Leaving directory '/builds/libvirt/libvirt/build/src' make[2]: *** [Makefile:6443: all] Error 2 make[2]: Leaving directory '/builds/libvirt/libvirt/build/src' make[1]: *** [Makefile:777: all-recursive] Error 1 make[1]: Leaving directory '/builds/libvirt/libvirt/build' make: *** [Makefile:670: all] Error 2 section_end:1591262674:build_script section_start:1591262674:after_script Running after_script section_end:1591262675:after_script section_start:1591262675:upload_artifacts_on_failure Uploading artifacts for failed job section_end:1591262677:upload_artifacts_on_failure ERROR: Job failed: exit code 1  Job #580803549 ( https://gitlab.com/libvirt/libvirt/-/jobs/580803549/raw ) Stage: cross_build Name: armv7l-debian-sid Trace: ../../src/conf/domain_event.c: In function 'virDomainEventDispatchDefaultFunc': ../../src/conf/domain_event.c:1656:30: error: cast increases required alignment of target type [-Werror=cast-align] 1656 | rtcChangeEvent = (virDomainEventRTCChangePtr)event; | ^ ../../src/conf/domain_event.c:1785:34: error: cast increases required alignment of target type [-Werror=cast-align] 1785 | balloonChangeEvent = (virDomainEventBalloonChangePtr)event; | ^ ../../src/conf/domain_event.c:1896:35: error: cast increases required alignment of target type [-Werror=cast-align] 1896 | blockThresholdEvent = (virDomainEventBlockThresholdPtr)event; | ^ ../../src/conf/domain_event.c: In function 'virDomainQemuMonitorEventDispatchFunc': ../../src/conf/domain_event.c:1974:24: error: cast increases required alignment of target type [-Werror=cast-align] 1974 | qemuMonitorEvent = (virDomainQemuMonitorEventPtr)event; | ^ ../../src/conf/domain_event.c: In function 'virDomainQemuMonitorEventFilter': ../../src/conf/domain_event.c:2179:20: error: cast increases required alignment of target type [-Werror=cast-align] 2179 | monitorEvent = (virDomainQemuMonitorEventPtr) event; | ^ cc1: all warnings being treated as errors make[3]: *** [Makefile:8979: conf/libvirt_conf_la-domain_event.lo] Error 1 make[3]: Leaving directory '/builds/libvirt/libvirt/build/src' make[2]: *** [Makefile:6443: all] Error 2 make[2]: Leaving directory '/builds/libvirt/libvirt/build/src' make[1]: *** [Makefile:777: all-recursive] Error 1 make[1]: Leaving directory '/builds/libvirt/libvirt/build' make: *** [Makefile:670: all] Error 2 section_end:1591262652:build_script section_start:1591262652:after_script Running after_script section_end:1591262653:after_script section_start:1591262653:upload_artifacts_on_failure Uploading artifacts for failed job section_end:1591262655:upload_artifacts_on_failure ERROR: Job failed: exit code 1  -- You're receiving this email because of your account on gitlab.com.
1 0
0 0
libvirt | Pipeline #152735554 has failed for master | 031a6be1
by GitLab 04 Jun '20

04 Jun '20
Your pipeline has failed. Project: libvirt ( https://gitlab.com/libvirt/libvirt ) Branch: master ( https://gitlab.com/libvirt/libvirt/-/commits/master ) Commit: 031a6be1 ( https://gitlab.com/libvirt/libvirt/-/commit/031a6be1323069c627859f9cf086c43… ) Commit Message: qemucapabilitiestest: Bump qemu-5.1 capabilitie... Commit Author: Peter Krempa ( https://gitlab.com/pipo.sk ) Pipeline #152735554 ( https://gitlab.com/libvirt/libvirt/-/pipelines/152735554 ) triggered by Peter Krempa ( https://gitlab.com/pipo.sk ) had 5 failed builds. Job #580651401 ( https://gitlab.com/libvirt/libvirt/-/jobs/580651401/raw ) Stage: cross_build Name: mingw32-fedora-rawhide Trace: ../../src/conf/domain_event.c: In function 'virDomainEventDispatchDefaultFunc': ../../src/conf/domain_event.c:1656:30: error: cast increases required alignment of target type [-Werror=cast-align] 1656 | rtcChangeEvent = (virDomainEventRTCChangePtr)event; | ^ ../../src/conf/domain_event.c:1785:34: error: cast increases required alignment of target type [-Werror=cast-align] 1785 | balloonChangeEvent = (virDomainEventBalloonChangePtr)event; | ^ ../../src/conf/domain_event.c:1896:35: error: cast increases required alignment of target type [-Werror=cast-align] 1896 | blockThresholdEvent = (virDomainEventBlockThresholdPtr)event; | ^ ../../src/conf/domain_event.c: In function 'virDomainQemuMonitorEventDispatchFunc': ../../src/conf/domain_event.c:1974:24: error: cast increases required alignment of target type [-Werror=cast-align] 1974 | qemuMonitorEvent = (virDomainQemuMonitorEventPtr)event; | ^ ../../src/conf/domain_event.c: In function 'virDomainQemuMonitorEventFilter': ../../src/conf/domain_event.c:2179:20: error: cast increases required alignment of target type [-Werror=cast-align] 2179 | monitorEvent = (virDomainQemuMonitorEventPtr) event; | ^ cc1: all warnings being treated as errors make[3]: *** [Makefile:8979: conf/libvirt_conf_la-domain_event.lo] Error 1 make[3]: Leaving directory '/builds/libvirt/libvirt/build/src' make[2]: *** [Makefile:6443: all] Error 2 make[2]: Leaving directory '/builds/libvirt/libvirt/build/src' make[1]: *** [Makefile:777: all-recursive] Error 1 make[1]: Leaving directory '/builds/libvirt/libvirt/build' make: *** [Makefile:670: all] Error 2 section_end:1591257826:build_script section_start:1591257826:after_script Running after_script section_end:1591257827:after_script section_start:1591257827:upload_artifacts_on_failure Uploading artifacts for failed job section_end:1591257829:upload_artifacts_on_failure ERROR: Job failed: exit code 1  Job #580651384 ( https://gitlab.com/libvirt/libvirt/-/jobs/580651384/raw ) Stage: cross_build Name: mips-debian-9 Trace: ../../src/conf/domain_event.c:1785:34: error: cast increases required alignment of target type [-Werror=cast-align] balloonChangeEvent = (virDomainEventBalloonChangePtr)event; ^ ../../src/conf/domain_event.c:1896:35: error: cast increases required alignment of target type [-Werror=cast-align] blockThresholdEvent = (virDomainEventBlockThresholdPtr)event; ^ ../../src/conf/domain_event.c: In function 'virDomainQemuMonitorEventDispatchFunc': ../../src/conf/domain_event.c:1974:24: error: cast increases required alignment of target type [-Werror=cast-align] qemuMonitorEvent = (virDomainQemuMonitorEventPtr)event; ^ ../../src/conf/domain_event.c: In function 'virDomainQemuMonitorEventFilter': ../../src/conf/domain_event.c:2179:20: error: cast increases required alignment of target type [-Werror=cast-align] monitorEvent = (virDomainQemuMonitorEventPtr) event; ^ cc1: all warnings being treated as errors Makefile:8525: recipe for target 'conf/libvirt_conf_la-domain_event.lo' failed make[3]: *** [conf/libvirt_conf_la-domain_event.lo] Error 1 make[3]: Leaving directory '/builds/libvirt/libvirt/build/src' Makefile:5995: recipe for target 'all' failed make[2]: *** [all] Error 2 make[2]: Leaving directory '/builds/libvirt/libvirt/build/src' Makefile:777: recipe for target 'all-recursive' failed make[1]: *** [all-recursive] Error 1 make[1]: Leaving directory '/builds/libvirt/libvirt/build' Makefile:670: recipe for target 'all' failed make: *** [all] Error 2 section_end:1591257816:build_script section_start:1591257816:after_script Running after_script section_end:1591257817:after_script section_start:1591257817:upload_artifacts_on_failure Uploading artifacts for failed job section_end:1591257818:upload_artifacts_on_failure ERROR: Job failed: exit code 1  Job #580651381 ( https://gitlab.com/libvirt/libvirt/-/jobs/580651381/raw ) Stage: cross_build Name: armv6l-debian-9 Trace: ../../src/conf/domain_event.c:1785:34: error: cast increases required alignment of target type [-Werror=cast-align] balloonChangeEvent = (virDomainEventBalloonChangePtr)event; ^ ../../src/conf/domain_event.c:1896:35: error: cast increases required alignment of target type [-Werror=cast-align] blockThresholdEvent = (virDomainEventBlockThresholdPtr)event; ^ ../../src/conf/domain_event.c: In function 'virDomainQemuMonitorEventDispatchFunc': ../../src/conf/domain_event.c:1974:24: error: cast increases required alignment of target type [-Werror=cast-align] qemuMonitorEvent = (virDomainQemuMonitorEventPtr)event; ^ ../../src/conf/domain_event.c: In function 'virDomainQemuMonitorEventFilter': ../../src/conf/domain_event.c:2179:20: error: cast increases required alignment of target type [-Werror=cast-align] monitorEvent = (virDomainQemuMonitorEventPtr) event; ^ cc1: all warnings being treated as errors Makefile:8525: recipe for target 'conf/libvirt_conf_la-domain_event.lo' failed make[3]: *** [conf/libvirt_conf_la-domain_event.lo] Error 1 make[3]: Leaving directory '/builds/libvirt/libvirt/build/src' Makefile:5995: recipe for target 'all' failed make[2]: *** [all] Error 2 make[2]: Leaving directory '/builds/libvirt/libvirt/build/src' Makefile:777: recipe for target 'all-recursive' failed make[1]: *** [all-recursive] Error 1 make[1]: Leaving directory '/builds/libvirt/libvirt/build' Makefile:670: recipe for target 'all' failed make: *** [all] Error 2 section_end:1591257814:build_script section_start:1591257814:after_script Running after_script section_end:1591257816:after_script section_start:1591257816:upload_artifacts_on_failure Uploading artifacts for failed job section_end:1591257817:upload_artifacts_on_failure ERROR: Job failed: exit code 1  Job #580651398 ( https://gitlab.com/libvirt/libvirt/-/jobs/580651398/raw ) Stage: cross_build Name: mipsel-debian-sid Trace: ../../src/conf/domain_event.c: In function 'virDomainEventDispatchDefaultFunc': ../../src/conf/domain_event.c:1656:30: error: cast increases required alignment of target type [-Werror=cast-align] 1656 | rtcChangeEvent = (virDomainEventRTCChangePtr)event; | ^ ../../src/conf/domain_event.c:1785:34: error: cast increases required alignment of target type [-Werror=cast-align] 1785 | balloonChangeEvent = (virDomainEventBalloonChangePtr)event; | ^ ../../src/conf/domain_event.c:1896:35: error: cast increases required alignment of target type [-Werror=cast-align] 1896 | blockThresholdEvent = (virDomainEventBlockThresholdPtr)event; | ^ ../../src/conf/domain_event.c: In function 'virDomainQemuMonitorEventDispatchFunc': ../../src/conf/domain_event.c:1974:24: error: cast increases required alignment of target type [-Werror=cast-align] 1974 | qemuMonitorEvent = (virDomainQemuMonitorEventPtr)event; | ^ ../../src/conf/domain_event.c: In function 'virDomainQemuMonitorEventFilter': ../../src/conf/domain_event.c:2179:20: error: cast increases required alignment of target type [-Werror=cast-align] 2179 | monitorEvent = (virDomainQemuMonitorEventPtr) event; | ^ cc1: all warnings being treated as errors make[3]: *** [Makefile:8979: conf/libvirt_conf_la-domain_event.lo] Error 1 make[3]: Leaving directory '/builds/libvirt/libvirt/build/src' make[2]: *** [Makefile:6443: all] Error 2 make[2]: Leaving directory '/builds/libvirt/libvirt/build/src' make[1]: *** [Makefile:777: all-recursive] Error 1 make[1]: Leaving directory '/builds/libvirt/libvirt/build' make: *** [Makefile:670: all] Error 2 section_end:1591257800:build_script section_start:1591257800:after_script Running after_script section_end:1591257801:after_script section_start:1591257801:upload_artifacts_on_failure Uploading artifacts for failed job section_end:1591257803:upload_artifacts_on_failure ERROR: Job failed: exit code 1  Job #580651390 ( https://gitlab.com/libvirt/libvirt/-/jobs/580651390/raw ) Stage: cross_build Name: armv7l-debian-sid Trace: ../../src/conf/domain_event.c: In function 'virDomainEventDispatchDefaultFunc': ../../src/conf/domain_event.c:1656:30: error: cast increases required alignment of target type [-Werror=cast-align] 1656 | rtcChangeEvent = (virDomainEventRTCChangePtr)event; | ^ ../../src/conf/domain_event.c:1785:34: error: cast increases required alignment of target type [-Werror=cast-align] 1785 | balloonChangeEvent = (virDomainEventBalloonChangePtr)event; | ^ ../../src/conf/domain_event.c:1896:35: error: cast increases required alignment of target type [-Werror=cast-align] 1896 | blockThresholdEvent = (virDomainEventBlockThresholdPtr)event; | ^ ../../src/conf/domain_event.c: In function 'virDomainQemuMonitorEventDispatchFunc': ../../src/conf/domain_event.c:1974:24: error: cast increases required alignment of target type [-Werror=cast-align] 1974 | qemuMonitorEvent = (virDomainQemuMonitorEventPtr)event; | ^ ../../src/conf/domain_event.c: In function 'virDomainQemuMonitorEventFilter': ../../src/conf/domain_event.c:2179:20: error: cast increases required alignment of target type [-Werror=cast-align] 2179 | monitorEvent = (virDomainQemuMonitorEventPtr) event; | ^ cc1: all warnings being treated as errors make[3]: *** [Makefile:8979: conf/libvirt_conf_la-domain_event.lo] Error 1 make[3]: Leaving directory '/builds/libvirt/libvirt/build/src' make[2]: *** [Makefile:6443: all] Error 2 make[2]: Leaving directory '/builds/libvirt/libvirt/build/src' make[1]: *** [Makefile:777: all-recursive] Error 1 make[1]: Leaving directory '/builds/libvirt/libvirt/build' make: *** [Makefile:670: all] Error 2 section_end:1591257791:build_script section_start:1591257791:after_script Running after_script section_end:1591257792:after_script section_start:1591257792:upload_artifacts_on_failure Uploading artifacts for failed job section_end:1591257794:upload_artifacts_on_failure ERROR: Job failed: exit code 1  -- You're receiving this email because of your account on gitlab.com.
1 0
0 0
libvirt | Pipeline #152571779 has failed for master | d3a7479c
by GitLab 03 Jun '20

03 Jun '20
Your pipeline has failed. Project: libvirt ( https://gitlab.com/libvirt/libvirt ) Branch: master ( https://gitlab.com/libvirt/libvirt/-/commits/master ) Commit: d3a7479c ( https://gitlab.com/libvirt/libvirt/-/commit/d3a7479c0b1f098b53e9fd3029e4ed0… ) Commit Message: Use more of VIR_XPATH_NODE_AUTORESTORE This is... Commit Author: Michal Privoznik Pipeline #152571779 ( https://gitlab.com/libvirt/libvirt/-/pipelines/152571779 ) triggered by Michal Prívozník ( https://gitlab.com/MichalPrivoznik ) had 5 failed builds. Job #579870976 ( https://gitlab.com/libvirt/libvirt/-/jobs/579870976/raw ) Stage: cross_build Name: mingw32-fedora-rawhide Trace: ../../src/conf/domain_event.c: In function 'virDomainEventDispatchDefaultFunc': ../../src/conf/domain_event.c:1656:30: error: cast increases required alignment of target type [-Werror=cast-align] 1656 | rtcChangeEvent = (virDomainEventRTCChangePtr)event; | ^ ../../src/conf/domain_event.c:1785:34: error: cast increases required alignment of target type [-Werror=cast-align] 1785 | balloonChangeEvent = (virDomainEventBalloonChangePtr)event; | ^ ../../src/conf/domain_event.c:1896:35: error: cast increases required alignment of target type [-Werror=cast-align] 1896 | blockThresholdEvent = (virDomainEventBlockThresholdPtr)event; | ^ ../../src/conf/domain_event.c: In function 'virDomainQemuMonitorEventDispatchFunc': ../../src/conf/domain_event.c:1974:24: error: cast increases required alignment of target type [-Werror=cast-align] 1974 | qemuMonitorEvent = (virDomainQemuMonitorEventPtr)event; | ^ ../../src/conf/domain_event.c: In function 'virDomainQemuMonitorEventFilter': ../../src/conf/domain_event.c:2179:20: error: cast increases required alignment of target type [-Werror=cast-align] 2179 | monitorEvent = (virDomainQemuMonitorEventPtr) event; | ^ cc1: all warnings being treated as errors make[3]: *** [Makefile:8979: conf/libvirt_conf_la-domain_event.lo] Error 1 make[3]: Leaving directory '/builds/libvirt/libvirt/build/src' make[2]: *** [Makefile:6443: all] Error 2 make[2]: Leaving directory '/builds/libvirt/libvirt/build/src' make[1]: *** [Makefile:777: all-recursive] Error 1 make[1]: Leaving directory '/builds/libvirt/libvirt/build' make: *** [Makefile:670: all] Error 2 section_end:1591212658:build_script section_start:1591212658:after_script Running after_script section_end:1591212660:after_script section_start:1591212660:upload_artifacts_on_failure Uploading artifacts for failed job section_end:1591212661:upload_artifacts_on_failure ERROR: Job failed: exit code 1  Job #579870965 ( https://gitlab.com/libvirt/libvirt/-/jobs/579870965/raw ) Stage: cross_build Name: mips-debian-9 Trace: ../../src/conf/domain_event.c:1785:34: error: cast increases required alignment of target type [-Werror=cast-align] balloonChangeEvent = (virDomainEventBalloonChangePtr)event; ^ ../../src/conf/domain_event.c:1896:35: error: cast increases required alignment of target type [-Werror=cast-align] blockThresholdEvent = (virDomainEventBlockThresholdPtr)event; ^ ../../src/conf/domain_event.c: In function 'virDomainQemuMonitorEventDispatchFunc': ../../src/conf/domain_event.c:1974:24: error: cast increases required alignment of target type [-Werror=cast-align] qemuMonitorEvent = (virDomainQemuMonitorEventPtr)event; ^ ../../src/conf/domain_event.c: In function 'virDomainQemuMonitorEventFilter': ../../src/conf/domain_event.c:2179:20: error: cast increases required alignment of target type [-Werror=cast-align] monitorEvent = (virDomainQemuMonitorEventPtr) event; ^ cc1: all warnings being treated as errors Makefile:8525: recipe for target 'conf/libvirt_conf_la-domain_event.lo' failed make[3]: *** [conf/libvirt_conf_la-domain_event.lo] Error 1 make[3]: Leaving directory '/builds/libvirt/libvirt/build/src' Makefile:5995: recipe for target 'all' failed make[2]: *** [all] Error 2 make[2]: Leaving directory '/builds/libvirt/libvirt/build/src' Makefile:777: recipe for target 'all-recursive' failed make[1]: *** [all-recursive] Error 1 make[1]: Leaving directory '/builds/libvirt/libvirt/build' Makefile:670: recipe for target 'all' failed make: *** [all] Error 2 section_end:1591212657:build_script section_start:1591212657:after_script Running after_script section_end:1591212658:after_script section_start:1591212658:upload_artifacts_on_failure Uploading artifacts for failed job section_end:1591212659:upload_artifacts_on_failure ERROR: Job failed: exit code 1  Job #579870958 ( https://gitlab.com/libvirt/libvirt/-/jobs/579870958/raw ) Stage: cross_build Name: armv6l-debian-9 Trace: ../../src/conf/domain_event.c:1785:34: error: cast increases required alignment of target type [-Werror=cast-align] balloonChangeEvent = (virDomainEventBalloonChangePtr)event; ^ ../../src/conf/domain_event.c:1896:35: error: cast increases required alignment of target type [-Werror=cast-align] blockThresholdEvent = (virDomainEventBlockThresholdPtr)event; ^ ../../src/conf/domain_event.c: In function 'virDomainQemuMonitorEventDispatchFunc': ../../src/conf/domain_event.c:1974:24: error: cast increases required alignment of target type [-Werror=cast-align] qemuMonitorEvent = (virDomainQemuMonitorEventPtr)event; ^ ../../src/conf/domain_event.c: In function 'virDomainQemuMonitorEventFilter': ../../src/conf/domain_event.c:2179:20: error: cast increases required alignment of target type [-Werror=cast-align] monitorEvent = (virDomainQemuMonitorEventPtr) event; ^ cc1: all warnings being treated as errors Makefile:8525: recipe for target 'conf/libvirt_conf_la-domain_event.lo' failed make[3]: *** [conf/libvirt_conf_la-domain_event.lo] Error 1 make[3]: Leaving directory '/builds/libvirt/libvirt/build/src' Makefile:5995: recipe for target 'all' failed make[2]: *** [all] Error 2 make[2]: Leaving directory '/builds/libvirt/libvirt/build/src' Makefile:777: recipe for target 'all-recursive' failed make[1]: *** [all-recursive] Error 1 make[1]: Leaving directory '/builds/libvirt/libvirt/build' Makefile:670: recipe for target 'all' failed make: *** [all] Error 2 section_end:1591212639:build_script section_start:1591212639:after_script Running after_script section_end:1591212641:after_script section_start:1591212641:upload_artifacts_on_failure Uploading artifacts for failed job section_end:1591212642:upload_artifacts_on_failure ERROR: Job failed: exit code 1  Job #579870974 ( https://gitlab.com/libvirt/libvirt/-/jobs/579870974/raw ) Stage: cross_build Name: mipsel-debian-sid Trace: ../../src/conf/domain_event.c: In function 'virDomainEventDispatchDefaultFunc': ../../src/conf/domain_event.c:1656:30: error: cast increases required alignment of target type [-Werror=cast-align] 1656 | rtcChangeEvent = (virDomainEventRTCChangePtr)event; | ^ ../../src/conf/domain_event.c:1785:34: error: cast increases required alignment of target type [-Werror=cast-align] 1785 | balloonChangeEvent = (virDomainEventBalloonChangePtr)event; | ^ ../../src/conf/domain_event.c:1896:35: error: cast increases required alignment of target type [-Werror=cast-align] 1896 | blockThresholdEvent = (virDomainEventBlockThresholdPtr)event; | ^ ../../src/conf/domain_event.c: In function 'virDomainQemuMonitorEventDispatchFunc': ../../src/conf/domain_event.c:1974:24: error: cast increases required alignment of target type [-Werror=cast-align] 1974 | qemuMonitorEvent = (virDomainQemuMonitorEventPtr)event; | ^ ../../src/conf/domain_event.c: In function 'virDomainQemuMonitorEventFilter': ../../src/conf/domain_event.c:2179:20: error: cast increases required alignment of target type [-Werror=cast-align] 2179 | monitorEvent = (virDomainQemuMonitorEventPtr) event; | ^ cc1: all warnings being treated as errors make[3]: *** [Makefile:8979: conf/libvirt_conf_la-domain_event.lo] Error 1 make[3]: Leaving directory '/builds/libvirt/libvirt/build/src' make[2]: *** [Makefile:6443: all] Error 2 make[2]: Leaving directory '/builds/libvirt/libvirt/build/src' make[1]: *** [Makefile:777: all-recursive] Error 1 make[1]: Leaving directory '/builds/libvirt/libvirt/build' make: *** [Makefile:670: all] Error 2 section_end:1591212628:build_script section_start:1591212628:after_script Running after_script section_end:1591212629:after_script section_start:1591212630:upload_artifacts_on_failure Uploading artifacts for failed job section_end:1591212631:upload_artifacts_on_failure ERROR: Job failed: exit code 1  Job #579870971 ( https://gitlab.com/libvirt/libvirt/-/jobs/579870971/raw ) Stage: cross_build Name: armv7l-debian-sid Trace: ../../src/conf/domain_event.c: In function 'virDomainEventDispatchDefaultFunc': ../../src/conf/domain_event.c:1656:30: error: cast increases required alignment of target type [-Werror=cast-align] 1656 | rtcChangeEvent = (virDomainEventRTCChangePtr)event; | ^ ../../src/conf/domain_event.c:1785:34: error: cast increases required alignment of target type [-Werror=cast-align] 1785 | balloonChangeEvent = (virDomainEventBalloonChangePtr)event; | ^ ../../src/conf/domain_event.c:1896:35: error: cast increases required alignment of target type [-Werror=cast-align] 1896 | blockThresholdEvent = (virDomainEventBlockThresholdPtr)event; | ^ ../../src/conf/domain_event.c: In function 'virDomainQemuMonitorEventDispatchFunc': ../../src/conf/domain_event.c:1974:24: error: cast increases required alignment of target type [-Werror=cast-align] 1974 | qemuMonitorEvent = (virDomainQemuMonitorEventPtr)event; | ^ ../../src/conf/domain_event.c: In function 'virDomainQemuMonitorEventFilter': ../../src/conf/domain_event.c:2179:20: error: cast increases required alignment of target type [-Werror=cast-align] 2179 | monitorEvent = (virDomainQemuMonitorEventPtr) event; | ^ cc1: all warnings being treated as errors make[3]: *** [Makefile:8979: conf/libvirt_conf_la-domain_event.lo] Error 1 make[3]: Leaving directory '/builds/libvirt/libvirt/build/src' make[2]: *** [Makefile:6443: all] Error 2 make[2]: Leaving directory '/builds/libvirt/libvirt/build/src' make[1]: *** [Makefile:777: all-recursive] Error 1 make[1]: Leaving directory '/builds/libvirt/libvirt/build' make: *** [Makefile:670: all] Error 2 section_end:1591212612:build_script section_start:1591212612:after_script Running after_script section_end:1591212613:after_script section_start:1591212613:upload_artifacts_on_failure Uploading artifacts for failed job section_end:1591212614:upload_artifacts_on_failure ERROR: Job failed: exit code 1  -- You're receiving this email because of your account on gitlab.com.
1 0
0 0
  • ← Newer
  • 1
  • 2
  • 3
  • 4
  • 5
  • 6
  • 7
  • 8
  • Older →

HyperKitty Powered by HyperKitty version 1.3.12.