libvirt List Archives
Sign In Sign Up
Manage this list Sign In Sign Up

Keyboard Shortcuts

Thread View

  • j: Next unread message
  • k: Previous unread message
  • j a: Jump to all threads
  • j l: Jump to MailingList overview

CI

Thread Start a new thread
Download
Threads by month
  • ----- 2025 -----
  • August
  • July
  • June
  • May
  • April
  • March
  • February
  • January
  • ----- 2024 -----
  • December
  • November
  • October
  • September
  • August
  • July
  • June
  • May
  • April
  • March
  • February
  • January
  • ----- 2023 -----
  • December
  • November
  • October
  • September
  • August
  • July
  • June
  • May
  • April
  • March
  • February
  • January
  • ----- 2022 -----
  • December
  • November
  • October
  • September
  • August
  • July
  • June
  • May
  • April
  • March
  • February
  • January
  • ----- 2021 -----
  • December
  • November
  • October
  • September
  • August
  • July
  • June
  • May
  • April
  • March
  • February
  • January
  • ----- 2020 -----
  • December
  • November
  • October
  • September
  • August
  • July
  • June
  • May
  • April
  • March
  • February
  • January
  • ----- 2019 -----
  • December
  • November
  • October
  • September
  • August
  • July
  • June
  • May
  • April
  • March
  • February
  • January
  • ----- 2018 -----
  • December
  • November
  • October
  • September
  • August
  • July
  • June
  • May
  • April
  • March
  • February
  • January
  • ----- 2017 -----
  • December
  • November
  • October
  • September
  • August
  • July
  • June
  • May
  • April
  • March
  • February
  • January
  • ----- 2016 -----
  • December
  • November
  • October
  • September
  • August
  • July
ci@lists.libvirt.org

June 2020

  • 3 participants
  • 74 discussions
Build failed in Jenkins: libvirt-go-xml-check » libvirt-fedora-rawhide #1258
by ci@centos.org 02 Jun '20

02 Jun '20
See <https://ci.centos.org/job/libvirt-go-xml-check/systems=libvirt-fedora-rawhi…> ------------------------------------------ Started by upstream project "libvirt-go-xml-check" build number 1258 originally caused by: Started by upstream project "libvirt-go-xml-build" build number 1262 originally caused by: Started by upstream project "libvirt-build" build number 1451 originally caused by: Started by an SCM change Running as SYSTEM [EnvInject] - Loading node environment variables. Building remotely on libvirt-fedora-rawhide (libvirt) in workspace <https://ci.centos.org/job/libvirt-go-xml-check/systems=libvirt-fedora-rawhi…> [libvirt-go-xml] $ /bin/sh -xe /tmp/jenkins17677106623134814539.sh + export 'TEST_ARGS=-tags xmlroundtrip' + TEST_ARGS='-tags xmlroundtrip' + go test -tags xmlroundtrip --- FAIL: TestRoundTrip (48.52s) xml_test.go:374: testdata/libvirt/tests/qemuxml2argvdata/downscript.xml: /domain[0]/devices[0]/interface[0]/downscript[0]: element in expected XML missing in actual XML FAIL exit status 1 FAIL _<https://ci.centos.org/job/libvirt-go-xml-check/systems=libvirt-fedora-rawhi…> 48.789s Build step 'Execute shell' marked build as failure
1 7
0 0
Build failed in Jenkins: libvirt-go-xml-check » libvirt-centos-7 #1258
by ci@centos.org 02 Jun '20

02 Jun '20
See <https://ci.centos.org/job/libvirt-go-xml-check/systems=libvirt-centos-7/125…> ------------------------------------------ Started by upstream project "libvirt-go-xml-check" build number 1258 originally caused by: Started by upstream project "libvirt-go-xml-build" build number 1262 originally caused by: Started by upstream project "libvirt-build" build number 1451 originally caused by: Started by an SCM change Running as SYSTEM [EnvInject] - Loading node environment variables. Building remotely on libvirt-centos-7 (libvirt) in workspace <https://ci.centos.org/job/libvirt-go-xml-check/systems=libvirt-centos-7/ws/> [libvirt-go-xml] $ /bin/sh -xe /tmp/jenkins4287548975773318889.sh + export 'TEST_ARGS=-tags xmlroundtrip' + TEST_ARGS='-tags xmlroundtrip' + go test -tags xmlroundtrip --- FAIL: TestRoundTrip (54.05s) xml_test.go:374: testdata/libvirt/tests/qemuxml2argvdata/downscript.xml: /domain[0]/devices[0]/interface[0]/downscript[0]: element in expected XML missing in actual XML FAIL exit status 1 FAIL _<https://ci.centos.org/job/libvirt-go-xml-check/systems=libvirt-centos-7/ws/> 54.171s Build step 'Execute shell' marked build as failure
1 7
0 0
Build failed in Jenkins: libvirt-go-xml-check » libvirt-freebsd-11 #1258
by ci@centos.org 02 Jun '20

02 Jun '20
See <https://ci.centos.org/job/libvirt-go-xml-check/systems=libvirt-freebsd-11/1…> ------------------------------------------ Started by upstream project "libvirt-go-xml-check" build number 1258 originally caused by: Started by upstream project "libvirt-go-xml-build" build number 1262 originally caused by: Started by upstream project "libvirt-build" build number 1451 originally caused by: Started by an SCM change Running as SYSTEM [EnvInject] - Loading node environment variables. Building remotely on libvirt-freebsd-11 (libvirt) in workspace <https://ci.centos.org/job/libvirt-go-xml-check/systems=libvirt-freebsd-11/w…> [libvirt-go-xml] $ /bin/sh -xe /tmp/jenkins3335937531604187246.sh + export 'TEST_ARGS=-tags xmlroundtrip' + go test -tags xmlroundtrip --- FAIL: TestRoundTrip (9.37s) xml_test.go:374: testdata/libvirt/tests/qemuxml2argvdata/downscript.xml: /domain[0]/devices[0]/interface[0]/downscript[0]: element in expected XML missing in actual XML FAIL exit status 1 FAIL _/usr<https://ci.centos.org/job/libvirt-go-xml-check/systems=libvirt-freebsd-11/w…> 9.453s Build step 'Execute shell' marked build as failure
1 7
0 0
Build failed in Jenkins: libvirt-go-xml-check » libvirt-freebsd-12 #1258
by ci@centos.org 02 Jun '20

02 Jun '20
See <https://ci.centos.org/job/libvirt-go-xml-check/systems=libvirt-freebsd-12/1…> ------------------------------------------ Started by upstream project "libvirt-go-xml-check" build number 1258 originally caused by: Started by upstream project "libvirt-go-xml-build" build number 1262 originally caused by: Started by upstream project "libvirt-build" build number 1451 originally caused by: Started by an SCM change Running as SYSTEM [EnvInject] - Loading node environment variables. Building remotely on libvirt-freebsd-12 (libvirt) in workspace <https://ci.centos.org/job/libvirt-go-xml-check/systems=libvirt-freebsd-12/w…> [libvirt-go-xml] $ /bin/sh -xe /tmp/jenkins1925141001144637768.sh + export 'TEST_ARGS=-tags xmlroundtrip' + go test -tags xmlroundtrip --- FAIL: TestRoundTrip (12.63s) xml_test.go:374: testdata/libvirt/tests/qemuxml2argvdata/downscript.xml: /domain[0]/devices[0]/interface[0]/downscript[0]: element in expected XML missing in actual XML FAIL exit status 1 FAIL _/usr<https://ci.centos.org/job/libvirt-go-xml-check/systems=libvirt-freebsd-12/w…> 12.757s Build step 'Execute shell' marked build as failure
1 7
0 0
Build failed in Jenkins: libvirt-go-xml-check » libvirt-debian-9 #1258
by ci@centos.org 02 Jun '20

02 Jun '20
See <https://ci.centos.org/job/libvirt-go-xml-check/systems=libvirt-debian-9/125…> ------------------------------------------ Started by upstream project "libvirt-go-xml-check" build number 1258 originally caused by: Started by upstream project "libvirt-go-xml-build" build number 1262 originally caused by: Started by upstream project "libvirt-build" build number 1451 originally caused by: Started by an SCM change Running as SYSTEM [EnvInject] - Loading node environment variables. Building remotely on libvirt-debian-9 (libvirt) in workspace <https://ci.centos.org/job/libvirt-go-xml-check/systems=libvirt-debian-9/ws/> [libvirt-go-xml] $ /bin/sh -xe /tmp/jenkins9095820521647392256.sh + export TEST_ARGS=-tags xmlroundtrip + go test -tags xmlroundtrip --- FAIL: TestRoundTrip (54.94s) xml_test.go:374: testdata/libvirt/tests/qemuxml2argvdata/downscript.xml: /domain[0]/devices[0]/interface[0]/downscript[0]: element in expected XML missing in actual XML FAIL exit status 1 FAIL _<https://ci.centos.org/job/libvirt-go-xml-check/systems=libvirt-debian-9/ws/> 55.096s Build step 'Execute shell' marked build as failure
1 7
0 0
Build failed in Jenkins: libvirt-go-xml-check » libvirt-debian-10 #1258
by ci@centos.org 02 Jun '20

02 Jun '20
See <https://ci.centos.org/job/libvirt-go-xml-check/systems=libvirt-debian-10/12…> ------------------------------------------ Started by upstream project "libvirt-go-xml-check" build number 1258 originally caused by: Started by upstream project "libvirt-go-xml-build" build number 1262 originally caused by: Started by upstream project "libvirt-build" build number 1451 originally caused by: Started by an SCM change Running as SYSTEM [EnvInject] - Loading node environment variables. Building remotely on libvirt-debian-10 (libvirt) in workspace <https://ci.centos.org/job/libvirt-go-xml-check/systems=libvirt-debian-10/ws/> [libvirt-go-xml] $ /bin/sh -xe /tmp/jenkins15577079970945630902.sh + export TEST_ARGS=-tags xmlroundtrip + go test -tags xmlroundtrip --- FAIL: TestRoundTrip (34.43s) xml_test.go:374: testdata/libvirt/tests/qemuxml2argvdata/downscript.xml: /domain[0]/devices[0]/interface[0]/downscript[0]: element in expected XML missing in actual XML FAIL exit status 1 FAIL _<https://ci.centos.org/job/libvirt-go-xml-check/systems=libvirt-debian-10/ws/> 34.553s Build step 'Execute shell' marked build as failure
1 7
0 0
Build failed in Jenkins: libvirt-check » libvirt-freebsd-11 #1190
by ci@centos.org 02 Jun '20

02 Jun '20
See <https://ci.centos.org/job/libvirt-check/systems=libvirt-freebsd-11/1190/dis…> ------------------------------------------ [...truncated 2.85 KB...] Making all in . gmake[5]: Entering directory '/usr<https://ci.centos.org/job/libvirt-check/systems=libvirt-freebsd-11/ws/build'> gmake[5]: Leaving directory '/usr<https://ci.centos.org/job/libvirt-check/systems=libvirt-freebsd-11/ws/build'> Making all in include/libvirt gmake[5]: Entering directory '/usr<https://ci.centos.org/job/libvirt-check/systems=libvirt-freebsd-11/ws/build…'> gmake[5]: Nothing to be done for 'all'. gmake[5]: Leaving directory '/usr<https://ci.centos.org/job/libvirt-check/systems=libvirt-freebsd-11/ws/build…'> Making all in src gmake[5]: Entering directory '/usr<https://ci.centos.org/job/libvirt-check/systems=libvirt-freebsd-11/ws/build…'> /usr/local/bin/gmake all-am gmake[6]: Entering directory '/usr<https://ci.centos.org/job/libvirt-check/systems=libvirt-freebsd-11/ws/build…'> gmake[6]: Nothing to be done for 'all-am'. gmake[6]: Leaving directory '/usr<https://ci.centos.org/job/libvirt-check/systems=libvirt-freebsd-11/ws/build…'> gmake[5]: Leaving directory '/usr<https://ci.centos.org/job/libvirt-check/systems=libvirt-freebsd-11/ws/build…'> Making all in tools gmake[5]: Entering directory '/usr<https://ci.centos.org/job/libvirt-check/systems=libvirt-freebsd-11/ws/build…'> /usr/local/bin/gmake all-am gmake[6]: Entering directory '/usr<https://ci.centos.org/job/libvirt-check/systems=libvirt-freebsd-11/ws/build…'> gmake[6]: Nothing to be done for 'all-am'. gmake[6]: Leaving directory '/usr<https://ci.centos.org/job/libvirt-check/systems=libvirt-freebsd-11/ws/build…'> gmake[5]: Leaving directory '/usr<https://ci.centos.org/job/libvirt-check/systems=libvirt-freebsd-11/ws/build…'> Making all in docs gmake[5]: Entering directory '/usr<https://ci.centos.org/job/libvirt-check/systems=libvirt-freebsd-11/ws/build…'> gmake[5]: Leaving directory '/usr<https://ci.centos.org/job/libvirt-check/systems=libvirt-freebsd-11/ws/build…'> Making all in tests gmake[5]: Entering directory '/usr<https://ci.centos.org/job/libvirt-check/systems=libvirt-freebsd-11/ws/build…'> gmake[5]: Nothing to be done for 'all'. gmake[5]: Leaving directory '/usr<https://ci.centos.org/job/libvirt-check/systems=libvirt-freebsd-11/ws/build…'> Making all in po gmake[5]: Entering directory '/usr<https://ci.centos.org/job/libvirt-check/systems=libvirt-freebsd-11/ws/build…'> cat: POTFILES: No such file or directory gmake[5]: Nothing to be done for 'all'. gmake[5]: Leaving directory '/usr<https://ci.centos.org/job/libvirt-check/systems=libvirt-freebsd-11/ws/build…'> Making all in examples gmake[5]: Entering directory '/usr<https://ci.centos.org/job/libvirt-check/systems=libvirt-freebsd-11/ws/build…'> gmake[5]: Nothing to be done for 'all'. gmake[5]: Leaving directory '/usr<https://ci.centos.org/job/libvirt-check/systems=libvirt-freebsd-11/ws/build…'> gmake[4]: Leaving directory '/usr<https://ci.centos.org/job/libvirt-check/systems=libvirt-freebsd-11/ws/build'> gmake[3]: Leaving directory '/usr<https://ci.centos.org/job/libvirt-check/systems=libvirt-freebsd-11/ws/build'> gmake[2]: Leaving directory '/usr<https://ci.centos.org/job/libvirt-check/systems=libvirt-freebsd-11/ws/build'> Making check in include/libvirt gmake[2]: Entering directory '/usr<https://ci.centos.org/job/libvirt-check/systems=libvirt-freebsd-11/ws/build…'> gmake[2]: Nothing to be done for 'check'. gmake[2]: Leaving directory '/usr<https://ci.centos.org/job/libvirt-check/systems=libvirt-freebsd-11/ws/build…'> Making check in src gmake[2]: Entering directory '/usr<https://ci.centos.org/job/libvirt-check/systems=libvirt-freebsd-11/ws/build…'> /usr/local/bin/gmake check-am gmake[3]: Entering directory '/usr<https://ci.centos.org/job/libvirt-check/systems=libvirt-freebsd-11/ws/build…'> /usr/local/bin/gmake check-local gmake[4]: Entering directory '/usr<https://ci.centos.org/job/libvirt-check/systems=libvirt-freebsd-11/ws/build…'> GEN ../../src/remote_protocol-struct GEN ../../src/lxc_protocol-struct GEN ../../src/qemu_protocol-struct WARNING: skipping pdwtags test with Clang GEN ../../src/virnetprotocol-struct WARNING: skipping pdwtags test with Clang WARNING: skipping pdwtags test with Clang GEN ../../src/virkeepaliveprotocol-struct GEN ../../src/lock_protocol-struct WARNING: skipping pdwtags test with Clang GEN ../../src/admin_protocol-struct WARNING: skipping pdwtags test with Clang GEN check-symsorting WARNING: skipping pdwtags test with Clang GEN check-drivername WARNING: skipping pdwtags test with Clang GEN check-driverimpls GEN check-aclrules GEN check-aclperms GEN check-admin-symsorting GEN check-admin-drivername GEN check-augeas gmake[4]: Leaving directory '/usr<https://ci.centos.org/job/libvirt-check/systems=libvirt-freebsd-11/ws/build…'> gmake[3]: Leaving directory '/usr<https://ci.centos.org/job/libvirt-check/systems=libvirt-freebsd-11/ws/build…'> gmake[2]: Leaving directory '/usr<https://ci.centos.org/job/libvirt-check/systems=libvirt-freebsd-11/ws/build…'> Making check in tools gmake[2]: Entering directory '/usr<https://ci.centos.org/job/libvirt-check/systems=libvirt-freebsd-11/ws/build…'> /usr/local/bin/gmake check-am gmake[3]: Entering directory '/usr<https://ci.centos.org/job/libvirt-check/systems=libvirt-freebsd-11/ws/build…'> gmake[3]: Nothing to be done for 'check-am'. gmake[3]: Leaving directory '/usr<https://ci.centos.org/job/libvirt-check/systems=libvirt-freebsd-11/ws/build…'> gmake[2]: Leaving directory '/usr<https://ci.centos.org/job/libvirt-check/systems=libvirt-freebsd-11/ws/build…'> Making check in docs gmake[2]: Entering directory '/usr<https://ci.centos.org/job/libvirt-check/systems=libvirt-freebsd-11/ws/build…'> /usr/local/bin/gmake check-local gmake[3]: Entering directory '/usr<https://ci.centos.org/job/libvirt-check/systems=libvirt-freebsd-11/ws/build…'> /usr/local/bin/xmllint --nonet --noout html/*.html gmake[3]: Leaving directory '/usr<https://ci.centos.org/job/libvirt-check/systems=libvirt-freebsd-11/ws/build…'> gmake[2]: Leaving directory '/usr<https://ci.centos.org/job/libvirt-check/systems=libvirt-freebsd-11/ws/build…'> Making check in tests gmake[2]: Entering directory '/usr<https://ci.centos.org/job/libvirt-check/systems=libvirt-freebsd-11/ws/build…'> /usr/local/bin/gmake gmake[3]: Entering directory '/usr<https://ci.centos.org/job/libvirt-check/systems=libvirt-freebsd-11/ws/build…'> gmake[3]: Nothing to be done for 'all'. gmake[3]: Leaving directory '/usr<https://ci.centos.org/job/libvirt-check/systems=libvirt-freebsd-11/ws/build…'> /usr/local/bin/gmake check-TESTS gmake[3]: Entering directory '/usr<https://ci.centos.org/job/libvirt-check/systems=libvirt-freebsd-11/ws/build…'> gmake[4]: Entering directory '/usr<https://ci.centos.org/job/libvirt-check/systems=libvirt-freebsd-11/ws/build…'> SKIP: virhostcputest PASS: sockettest PASS: virbuftest PASS: seclabeltest PASS: virhashtest PASS: virconftest PASS: utiltest SKIP: shunloadtest PASS: virtimetest PASS: viruritest PASS: viralloctest PASS: virauthconfigtest PASS: virbitmaptest SKIP: vircgrouptest PASS: commandtest PASS: vircryptotest PASS: virendiantest SKIP: virpcitest PASS: virfiletest PASS: virfilecachetest PASS: viriscsitest SKIP: virfirewalltest PASS: virkeycodetest PASS: virlockspacetest PASS: virlogtest PASS: virrotatingfiletest PASS: virstringtest SKIP: virportallocatortest PASS: sysinfotest SKIP: virkmodtest PASS: vircapstest PASS: domaincapstest PASS: domainconftest SKIP: virhostdevtest SKIP: virnetdevtest PASS: virtypedparamtest PASS: vshtabletest PASS: virerrortest PASS: virnetmessagetest PASS: virnetsockettest PASS: virnetdaemontest PASS: virnetserverclienttest SKIP: virnettlscontexttest SKIP: virnettlssessiontest PASS: fdstreamtest PASS: virdbustest SKIP: virsystemdtest PASS: virpolkittest PASS: virshtest PASS: qemuxml2xmltest PASS: qemudomaincheckpointxml2xmltest PASS: qemudomainsnapshotxml2xmltest PASS: virschematest PASS: qemumonitorjsontest PASS: qemuagenttest PASS: qemucapabilitiestest Segmentation fault (core dumped) FAIL: qemuhotplugtest PASS: qemucaps2xmltest PASS: qemuxml2argvtest PASS: qemucommandutiltest PASS: qemumemlocktest PASS: qemumigparamstest PASS: qemufirmwaretest PASS: qemuvhostusertest PASS: esxutilstest PASS: vboxsnapshotxmltest PASS: qemublocktest PASS: vmx2xmltest PASS: vmwarevertest PASS: qemusecuritytest PASS: xml2vmxtest PASS: bhyvexml2argvtest PASS: virjsontest PASS: bhyvexml2xmltest PASS: bhyveargv2xmltest PASS: virnetworkportxml2xmltest PASS: networkxml2xmlupdatetest PASS: networkxml2xmltest SKIP: networkxml2firewalltest PASS: virnwfilterbindingxml2xmltest PASS: networkxml2conftest PASS: storagepoolxml2argvtest PASS: nwfilterxml2xmltest PASS: storagevolxml2argvtest PASS: storagepoolxml2xmltest PASS: virstorageutiltest PASS: storagepoolcapstest PASS: storagevolxml2xmltest PASS: nsstest PASS: nssguesttest PASS: interfacexml2xmltest PASS: nodedevxml2xmltest PASS: metadatatest PASS: secretxml2xmltest PASS: eventtest PASS: virdrivermoduletest PASS: genericxml2xmltest PASS: virdriverconnvalidatetest PASS: objecteventtest PASS: virnetdevopenvswitchtest PASS: virmacmaptest PASS: libvirtd-fail PASS: libvirtd-pool PASS: virsh-auth PASS: virsh-cpuset PASS: virsh-define-dev-segfault SKIP: virsh-optparse PASS: virsh-int-overflow PASS: virsh-read-bufsiz PASS: virsh-read-non-seekable PASS: virsh-schedinfo PASS: virsh-self-test PASS: virt-admin-self-test PASS: virsh-checkpoint PASS: virsh-start PASS: virsh-snapshot PASS: virsh-undefine PASS: virsh-uriprecedence PASS: virsh-vcpupin PASS: cputest ============================================================================ Testsuite summary for libvirt 6.4.0 ============================================================================ # TOTAL: 120 # PASS: 105 # SKIP: 14 # XFAIL: 0 # FAIL: 1 # XPASS: 0 # ERROR: 0 ============================================================================ See tests/test-suite.log Please report to libvir-list(a)redhat.com ============================================================================ gmake[4]: *** [Makefile:4840: test-suite.log] Error 1 gmake[4]: Leaving directory '/usr<https://ci.centos.org/job/libvirt-check/systems=libvirt-freebsd-11/ws/build…'> gmake[3]: *** [Makefile:4948: check-TESTS] Error 2 gmake[3]: Leaving directory '/usr<https://ci.centos.org/job/libvirt-check/systems=libvirt-freebsd-11/ws/build…'> gmake[2]: *** [Makefile:6002: check-am] Error 2 gmake[2]: Leaving directory '/usr<https://ci.centos.org/job/libvirt-check/systems=libvirt-freebsd-11/ws/build…'> gmake[1]: *** [Makefile:777: check-recursive] Error 1 gmake[1]: Leaving directory '/usr<https://ci.centos.org/job/libvirt-check/systems=libvirt-freebsd-11/ws/build'> gmake: *** [Makefile:1072: check] Error 2 + find -name test-suite.log + xargs cat find: illegal option -- n usage: find [-H | -L | -P] [-EXdsx] [-f path] path ... [expression] find [-H | -L | -P] [-EXdsx] -f path [path ...] [expression] + exit 1 Build step 'Execute shell' marked build as failure
1 1
0 0
libvirt-go-xml | Pipeline #151922638 has failed for master | 289147be
by GitLab 02 Jun '20

02 Jun '20
Your pipeline has failed. Project: libvirt-go-xml ( https://gitlab.com/libvirt/libvirt-go-xml ) Branch: master ( https://gitlab.com/libvirt/libvirt-go-xml/-/commits/master ) Commit: 289147be ( https://gitlab.com/libvirt/libvirt-go-xml/-/commit/289147bec310e348058c356f… ) Commit Message: gitlab: add CONTRIBUTING.rst file to indicate u... Commit Author: Daniel Berrange ( https://gitlab.com/berrange ) Pipeline #151922638 ( https://gitlab.com/libvirt/libvirt-go-xml/pipelines/151922638 ) triggered by Daniel Berrange ( https://gitlab.com/berrange ) had 5 failed builds. Job #576992236 ( https://gitlab.com/libvirt/libvirt-go-xml/-/jobs/576992236/raw ) Stage: build Name: go_1_14 Trace: Skipping Git submodules setup section_end:1591093183:get_sources section_start:1591093183:restore_cache Restoring cache section_end:1591093185:restore_cache section_start:1591093185:download_artifacts Downloading artifacts section_end:1591093186:download_artifacts section_start:1591093186:build_script Running before_script and script $ go test -timeout 10m -tags xmlroundtrip -v === RUN TestDomainSnapshot --- PASS: TestDomainSnapshot (0.00s) === RUN TestDomain --- PASS: TestDomain (0.01s) === RUN TestNetwork --- PASS: TestNetwork (0.00s) === RUN TestNodeDevice --- PASS: TestNodeDevice (0.00s) === RUN TestSecret --- PASS: TestSecret (0.00s) === RUN TestStoragePool --- PASS: TestStoragePool (0.00s) === RUN TestStorageVolume --- PASS: TestStorageVolume (0.00s) === RUN TestRoundTrip TestRoundTrip: xml_test.go:374: testdata/libvirt/tests/qemuxml2argvdata/downscript.xml: /domain[0]/devices[0]/interface[0]/downscript[0]: element in expected XML missing in actual XML --- FAIL: TestRoundTrip (35.77s) FAIL exit status 1 FAIL _/builds/libvirt/libvirt-go-xml 35.785s section_end:1591093228:build_script section_start:1591093228:after_script Running after_script section_end:1591093230:after_script section_start:1591093230:upload_artifacts_on_failure Uploading artifacts for failed job section_end:1591093231:upload_artifacts_on_failure ERROR: Job failed: exit code 1  Job #576992230 ( https://gitlab.com/libvirt/libvirt-go-xml/-/jobs/576992230/raw ) Stage: build Name: go_1_10 Trace: Skipping Git submodules setup section_end:1591093184:get_sources section_start:1591093184:restore_cache Restoring cache section_end:1591093186:restore_cache section_start:1591093186:download_artifacts Downloading artifacts section_end:1591093187:download_artifacts section_start:1591093187:build_script Running before_script and script $ go test -timeout 10m -tags xmlroundtrip -v === RUN TestDomainSnapshot --- PASS: TestDomainSnapshot (0.00s) === RUN TestDomain --- PASS: TestDomain (0.01s) === RUN TestNetwork --- PASS: TestNetwork (0.00s) === RUN TestNodeDevice --- PASS: TestNodeDevice (0.00s) === RUN TestSecret --- PASS: TestSecret (0.00s) === RUN TestStoragePool --- PASS: TestStoragePool (0.00s) === RUN TestStorageVolume --- PASS: TestStorageVolume (0.00s) === RUN TestRoundTrip --- FAIL: TestRoundTrip (36.04s) xml_test.go:374: testdata/libvirt/tests/qemuxml2argvdata/downscript.xml: /domain[0]/devices[0]/interface[0]/downscript[0]: element in expected XML missing in actual XML FAIL exit status 1 FAIL _/builds/libvirt/libvirt-go-xml 36.054s section_end:1591093228:build_script section_start:1591093228:after_script Running after_script section_end:1591093229:after_script section_start:1591093229:upload_artifacts_on_failure Uploading artifacts for failed job section_end:1591093230:upload_artifacts_on_failure ERROR: Job failed: exit code 1  Job #576992234 ( https://gitlab.com/libvirt/libvirt-go-xml/-/jobs/576992234/raw ) Stage: build Name: go_1_12 Trace: Skipping Git submodules setup section_end:1591093178:get_sources section_start:1591093178:restore_cache Restoring cache section_end:1591093180:restore_cache section_start:1591093180:download_artifacts Downloading artifacts section_end:1591093181:download_artifacts section_start:1591093181:build_script Running before_script and script $ go test -timeout 10m -tags xmlroundtrip -v === RUN TestDomainSnapshot --- PASS: TestDomainSnapshot (0.00s) === RUN TestDomain --- PASS: TestDomain (0.01s) === RUN TestNetwork --- PASS: TestNetwork (0.00s) === RUN TestNodeDevice --- PASS: TestNodeDevice (0.00s) === RUN TestSecret --- PASS: TestSecret (0.00s) === RUN TestStoragePool --- PASS: TestStoragePool (0.00s) === RUN TestStorageVolume --- PASS: TestStorageVolume (0.00s) === RUN TestRoundTrip --- FAIL: TestRoundTrip (38.94s) xml_test.go:374: testdata/libvirt/tests/qemuxml2argvdata/downscript.xml: /domain[0]/devices[0]/interface[0]/downscript[0]: element in expected XML missing in actual XML FAIL exit status 1 FAIL _/builds/libvirt/libvirt-go-xml 38.955s section_end:1591093227:build_script section_start:1591093227:after_script Running after_script section_end:1591093228:after_script section_start:1591093228:upload_artifacts_on_failure Uploading artifacts for failed job section_end:1591093230:upload_artifacts_on_failure ERROR: Job failed: exit code 1  Job #576992232 ( https://gitlab.com/libvirt/libvirt-go-xml/-/jobs/576992232/raw ) Stage: build Name: go_1_11 Trace: Skipping Git submodules setup section_end:1591093177:get_sources section_start:1591093177:restore_cache Restoring cache section_end:1591093179:restore_cache section_start:1591093179:download_artifacts Downloading artifacts section_end:1591093180:download_artifacts section_start:1591093180:build_script Running before_script and script $ go test -timeout 10m -tags xmlroundtrip -v === RUN TestDomainSnapshot --- PASS: TestDomainSnapshot (0.00s) === RUN TestDomain --- PASS: TestDomain (0.01s) === RUN TestNetwork --- PASS: TestNetwork (0.00s) === RUN TestNodeDevice --- PASS: TestNodeDevice (0.00s) === RUN TestSecret --- PASS: TestSecret (0.00s) === RUN TestStoragePool --- PASS: TestStoragePool (0.00s) === RUN TestStorageVolume --- PASS: TestStorageVolume (0.00s) === RUN TestRoundTrip --- FAIL: TestRoundTrip (38.05s) xml_test.go:374: testdata/libvirt/tests/qemuxml2argvdata/downscript.xml: /domain[0]/devices[0]/interface[0]/downscript[0]: element in expected XML missing in actual XML FAIL exit status 1 FAIL _/builds/libvirt/libvirt-go-xml 38.070s section_end:1591093225:build_script section_start:1591093225:after_script Running after_script section_end:1591093226:after_script section_start:1591093226:upload_artifacts_on_failure Uploading artifacts for failed job section_end:1591093228:upload_artifacts_on_failure ERROR: Job failed: exit code 1  Job #576992235 ( https://gitlab.com/libvirt/libvirt-go-xml/-/jobs/576992235/raw ) Stage: build Name: go_1_13 Trace: Skipping Git submodules setup section_end:1591093178:get_sources section_start:1591093178:restore_cache Restoring cache section_end:1591093179:restore_cache section_start:1591093179:download_artifacts Downloading artifacts section_end:1591093181:download_artifacts section_start:1591093181:build_script Running before_script and script $ go test -timeout 10m -tags xmlroundtrip -v === RUN TestDomainSnapshot --- PASS: TestDomainSnapshot (0.00s) === RUN TestDomain --- PASS: TestDomain (0.01s) === RUN TestNetwork --- PASS: TestNetwork (0.00s) === RUN TestNodeDevice --- PASS: TestNodeDevice (0.00s) === RUN TestSecret --- PASS: TestSecret (0.00s) === RUN TestStoragePool --- PASS: TestStoragePool (0.00s) === RUN TestStorageVolume --- PASS: TestStorageVolume (0.00s) === RUN TestRoundTrip --- FAIL: TestRoundTrip (37.35s) xml_test.go:374: testdata/libvirt/tests/qemuxml2argvdata/downscript.xml: /domain[0]/devices[0]/interface[0]/downscript[0]: element in expected XML missing in actual XML FAIL exit status 1 FAIL _/builds/libvirt/libvirt-go-xml 37.365s section_end:1591093225:build_script section_start:1591093225:after_script Running after_script section_end:1591093226:after_script section_start:1591093226:upload_artifacts_on_failure Uploading artifacts for failed job section_end:1591093228:upload_artifacts_on_failure ERROR: Job failed: exit code 1  -- You're receiving this email because of your account on gitlab.com.
1 0
0 0
Build failed in Jenkins: osinfo-db-tools-check » libvirt-freebsd-11 #72
by ci@centos.org 02 Jun '20

02 Jun '20
See <https://ci.centos.org/job/osinfo-db-tools-check/systems=libvirt-freebsd-11/…> ------------------------------------------ [...truncated 3.69 KB...] 23.00 bindtextdomain 22.00 cast_of_argument_to_free 22.00 cast_of_x_alloc_return_value 23.00 error_message_period 23.00 copyright_format 23.00 const_long_option 23.00 preprocessor_indentation 23.00 po_check 23.00 error_message_warn_fatal 23.00 prohibit_S_IS_definition 23.00 prohibit_HAVE_MBRTOWC 24.00 prohibit_atoi_atof 23.00 prohibit_argmatch_without_use 24.00 prohibit_assert_without_use 24.00 prohibit_backup_files 24.00 prohibit_c_ctype_without_use 24.00 prohibit_canonicalize_without_use 24.00 prohibit_close_stream_without_use 23.00 prohibit_defined_have_decl_tests 24.00 prohibit_cloexec_without_use 24.00 prohibit_double_semicolon 25.00 prohibit_dirent_without_use 24.00 prohibit_doubled_word 24.00 prohibit_empty_lines_at_EOF 24.00 prohibit_error_without_use 24.00 prohibit_hash_pjw_without_use 24.00 prohibit_getopt_without_use 24.00 prohibit_hash_without_use 25.00 prohibit_inttostr_without_use 25.00 prohibit_ignore_value_without_use 24.00 prohibit_magic_number_exit 25.00 prohibit_openat_without_use 25.00 prohibit_long_options_without_use 25.00 prohibit_path_max_allocation 24.00 prohibit_quote_without_use 24.00 prohibit_posixver_without_use 25.00 prohibit_quotearg_without_use 25.00 prohibit_reversed_compare_failure 24.00 prohibit_root_dev_ino_without_use 25.00 prohibit_safe_read_without_use 25.00 prohibit_same_without_use 24.00 prohibit_signal_without_use 24.00 prohibit_stddef_without_use 24.00 prohibit_stat_st_blocks 24.00 prohibit_stdio--_without_use 24.00 prohibit_stdio-safer_without_use 24.00 prohibit_strcmp 25.00 prohibit_strncpy 25.00 prohibit_strings_without_use 25.00 prohibit_test_double_equal 25.00 prohibit_undesirable_word_seq 25.00 prohibit_xalloc_without_use 25.00 prohibit_test_minus_ao 24.00 redundant_const ------- Full log written to /usr<https://ci.centos.org/job/osinfo-db-tools-check/systems=libvirt-freebsd-11/…> FAILED: meson-test /usr/local/bin/meson test --no-rebuild --print-errorlogs ninja: build stopped: subcommand failed. + cat meson-logs/testlog.txt Log of Meson test suite run on 2020-05-29T14:32:38.612598 Inherited environment: JOB_NAME='osinfo-db-tools-check/systems=libvirt-freebsd-11' HUDSON_SERVER_COOKIE='f4d3a7a925dabf8a' BUILD_NUMBER='72' MAKE='/usr/local/bin/gmake' XDG_DATA_DIRS='/home/jenkins/build/libvirt/share:/usr/share:/usr/local/share' GI_TYPELIB_PATH='/home/jenkins/build/libvirt/lib/girepository-1.0' JOB_DISPLAY_URL='https://ci.centos.org/job/osinfo-db-tools-check/systems=libvirt-freebsd-11/…' C_INCLUDE_PATH='/home/jenkins/build/libvirt/include' MAIL='/var/mail/jenkins' RUN_CHANGES_DISPLAY_URL='https://ci.centos.org/job/osinfo-db-tools-check/systems=libvirt-freebsd-11/…' JENKINS_URL='https://ci.centos.org/' OSINFO_SYSTEM_DIR='/home/jenkins/build/libvirt/share/osinfo' JENKINS_HOME='/var/lib/jenkins' MAKEFLAGS='-j3' PATH='/usr/libexec/ccache-wrappers:/home/jenkins/build/libvirt/bin:/sbin:/bin:/usr/sbin:/usr/bin:/usr/local/sbin:/usr/local/bin:/home/jenkins/bin' LD_LIBRARY_PATH='/home/jenkins/build/libvirt/lib' JOB_BASE_NAME='systems=libvirt-freebsd-11' CCACHE_WRAPPERSDIR='/usr/libexec/ccache-wrappers' CCACHE_MAXSIZE='2G' HUDSON_HOME='/var/lib/jenkins' PYTHONPATH='/home/jenkins/build/libvirt/lib/python3.7/site-packages' BUILD_ID='72' PERL5LIB='/home/jenkins/build/libvirt/lib/perl5/amd64-freebsd-thread-multi' OLDPWD='/usr<https://ci.centos.org/job/osinfo-db-tools-check/systems=libvirt-freebsd-11/…'> JENKINS_SERVER_COOKIE='f4d3a7a925dabf8a' ROOT_BUILD_CAUSE='SCMTRIGGER' PWD='/usr<https://ci.centos.org/job/osinfo-db-tools-check/systems=libvirt-freebsd-11/…'> NINJA='/usr/local/bin/ninja' _='/usr/local/bin/java' BUILD_TAG='jenkins-osinfo-db-tools-check-systems=libvirt-freebsd-11-72' NODE_LABELS='libvirt libvirt-freebsd-11' BUILD_CAUSE='UPSTREAMTRIGGER' BUILD_DISPLAY_NAME='#72' RUN_DISPLAY_URL='https://ci.centos.org/job/osinfo-db-tools-check/systems=libvirt-freebsd-11/…' USER='jenkins' HOME='/home/jenkins' BUILD_URL='https://ci.centos.org/job/osinfo-db-tools-check/systems=libvirt-freebsd-11/…' ROOT_BUILD_CAUSE_SCMTRIGGER='true' JOB_URL='https://ci.centos.org/job/osinfo-db-tools-check/systems=libvirt-freebsd-11/' BASH_ENV='/home/jenkins/.bashrc' PS1='[\u@\h \w]$ ' SHELL='/usr/local/bin/bash' HUDSON_URL='https://ci.centos.org/' HUDSON_COOKIE='bf737242-1249-4664-98da-be5a55d251ff' WORKSPACE='<https://ci.centos.org/job/osinfo-db-tools-check/systems=libvirt-freebsd-11/…'> BUILD_CAUSE_UPSTREAMTRIGGER='true' PYTHON='/usr/local/bin/python3' NODE_NAME='libvirt-freebsd-11' systems='libvirt-freebsd-11' VIRT_PREFIX='/home/jenkins/build/libvirt' PKG_CONFIG_PATH='/home/jenkins/build/libvirt/lib/pkgconfig' BLOCKSIZE='K' EXECUTOR_NUMBER='3' SHLVL='0' 1/4 osinfo-db-tools:style / syntax-check TIMEOUT 30.10 s --- command --- 14:32:38 MESON_SOURCE_ROOT='/usr<https://ci.centos.org/job/osinfo-db-tools-check/systems=libvirt-freebsd-11/…'> /usr<https://ci.centos.org/job/osinfo-db-tools-check/systems=libvirt-freebsd-11/…> --- stdout --- TAB_in_indentation Wundef_boolean avoid_attribute_unused_in_header avoid_if_before_free bindtextdomain bracket_spacing_check cast_of_x_alloc_return_value cast_of_argument_to_free const_long_option copyright_format error_message_period error_message_warn_fatal po_check preprocessor_indentation prohibit_HAVE_MBRTOWC prohibit_S_IS_definition prohibit_argmatch_without_use prohibit_assert_without_use prohibit_atoi_atof prohibit_backup_files prohibit_c_ctype_without_use prohibit_canonicalize_without_use prohibit_cloexec_without_use prohibit_close_stream_without_use prohibit_dirent_without_use prohibit_defined_have_decl_tests prohibit_doubled_word prohibit_empty_lines_at_EOF prohibit_double_semicolon prohibit_error_without_use prohibit_hash_pjw_without_use prohibit_getopt_without_use prohibit_hash_without_use prohibit_ignore_value_without_use prohibit_inttostr_without_use prohibit_long_options_without_use prohibit_openat_without_use prohibit_path_max_allocation prohibit_magic_number_exit prohibit_posixver_without_use prohibit_quote_without_use prohibit_quotearg_without_use prohibit_reversed_compare_failure prohibit_root_dev_ino_without_use prohibit_safe_read_without_use prohibit_same_without_use prohibit_stat_st_blocks prohibit_signal_without_use prohibit_stddef_without_use prohibit_stdio--_without_use prohibit_stdio-safer_without_use prohibit_strcmp prohibit_strings_without_use prohibit_test_double_equal prohibit_strncpy prohibit_test_minus_ao prohibit_undesirable_word_seq prohibit_xalloc_without_use redundant_const prohibit_xfreopen_without_use trailing_blank space_tab unmarked_diagnostics useless_cpp_parens 22.00 TAB_in_indentation 23.00 Wundef_boolean 23.00 avoid_attribute_unused_in_header 23.00 avoid_if_before_free 22.00 bracket_spacing_check 23.00 bindtextdomain 22.00 cast_of_argument_to_free 22.00 cast_of_x_alloc_return_value 23.00 error_message_period 23.00 copyright_format 23.00 const_long_option 23.00 preprocessor_indentation 23.00 po_check 23.00 error_message_warn_fatal 23.00 prohibit_S_IS_definition 23.00 prohibit_HAVE_MBRTOWC 24.00 prohibit_atoi_atof 23.00 prohibit_argmatch_without_use 24.00 prohibit_assert_without_use 24.00 prohibit_backup_files 24.00 prohibit_c_ctype_without_use 24.00 prohibit_canonicalize_without_use 24.00 prohibit_close_stream_without_use 23.00 prohibit_defined_have_decl_tests 24.00 prohibit_cloexec_without_use 24.00 prohibit_double_semicolon 25.00 prohibit_dirent_without_use 24.00 prohibit_doubled_word 24.00 prohibit_empty_lines_at_EOF 24.00 prohibit_error_without_use 24.00 prohibit_hash_pjw_without_use 24.00 prohibit_getopt_without_use 24.00 prohibit_hash_without_use 25.00 prohibit_inttostr_without_use 25.00 prohibit_ignore_value_without_use 24.00 prohibit_magic_number_exit 25.00 prohibit_openat_without_use 25.00 prohibit_long_options_without_use 25.00 prohibit_path_max_allocation 24.00 prohibit_quote_without_use 24.00 prohibit_posixver_without_use 25.00 prohibit_quotearg_without_use 25.00 prohibit_reversed_compare_failure 24.00 prohibit_root_dev_ino_without_use 25.00 prohibit_safe_read_without_use 25.00 prohibit_same_without_use 24.00 prohibit_signal_without_use 24.00 prohibit_stddef_without_use 24.00 prohibit_stat_st_blocks 24.00 prohibit_stdio--_without_use 24.00 prohibit_stdio-safer_without_use 24.00 prohibit_strcmp 25.00 prohibit_strncpy 25.00 prohibit_strings_without_use 25.00 prohibit_test_double_equal 25.00 prohibit_undesirable_word_seq 25.00 prohibit_xalloc_without_use 25.00 prohibit_test_minus_ao 24.00 redundant_const ------- 2/4 osinfo-db-tools:unit / export-import OK 22.96 s --- command --- 14:32:38 sysconfdir='/home/jenkins/build/libvirt/etc' abs_top_builddir='/usr<https://ci.centos.org/job/osinfo-db-tools-check/systems=libvirt-freebsd-11/…'> abs_top_srcdir='/usr<https://ci.centos.org/job/osinfo-db-tools-check/systems=libvirt-freebsd-11/…'> datadir='/home/jenkins/build/libvirt/share' /usr<https://ci.centos.org/job/osinfo-db-tools-check/systems=libvirt-freebsd-11/…> --- stdout --- ============================= test session starts ============================== platform freebsd11 -- Python 3.7.7, pytest-4.5.0, py-1.8.1, pluggy-0.12.0 rootdir: /usr<https://ci.centos.org/job/osinfo-db-tools-check/systems=libvirt-freebsd-11/…> collected 10 items ../tests/test_osinfo_db_export_import.py ........ss [100%] ===================== 8 passed, 2 skipped in 11.09 seconds ===================== ------- 3/4 osinfo-db-tools:unit / path OK 8.84 s --- command --- 14:33:01 sysconfdir='/home/jenkins/build/libvirt/etc' abs_top_builddir='/usr<https://ci.centos.org/job/osinfo-db-tools-check/systems=libvirt-freebsd-11/…'> abs_top_srcdir='/usr<https://ci.centos.org/job/osinfo-db-tools-check/systems=libvirt-freebsd-11/…'> datadir='/home/jenkins/build/libvirt/share' /usr<https://ci.centos.org/job/osinfo-db-tools-check/systems=libvirt-freebsd-11/…> --- stdout --- ============================= test session starts ============================== platform freebsd11 -- Python 3.7.7, pytest-4.5.0, py-1.8.1, pluggy-0.12.0 rootdir: /usr<https://ci.centos.org/job/osinfo-db-tools-check/systems=libvirt-freebsd-11/…> collected 5 items ../tests/test_osinfo_db_path.py ..... [100%] =========================== 5 passed in 1.96 seconds =========================== ------- 4/4 osinfo-db-tools:unit / validate OK 7.79 s --- command --- 14:33:08 sysconfdir='/home/jenkins/build/libvirt/etc' abs_top_builddir='/usr<https://ci.centos.org/job/osinfo-db-tools-check/systems=libvirt-freebsd-11/…'> abs_top_srcdir='/usr<https://ci.centos.org/job/osinfo-db-tools-check/systems=libvirt-freebsd-11/…'> datadir='/home/jenkins/build/libvirt/share' /usr<https://ci.centos.org/job/osinfo-db-tools-check/systems=libvirt-freebsd-11/…> --- stdout --- ============================= test session starts ============================== platform freebsd11 -- Python 3.7.7, pytest-4.5.0, py-1.8.1, pluggy-0.12.0 rootdir: /usr<https://ci.centos.org/job/osinfo-db-tools-check/systems=libvirt-freebsd-11/…> collected 6 items ../tests/test_osinfo_db_validate.py ...... [100%] =========================== 6 passed in 2.53 seconds =========================== ------- Ok: 3 Expected Fail: 0 Fail: 0 Unexpected Pass: 0 Skipped: 0 Timeout: 1 + exit 1 Build step 'Execute shell' marked build as failure
1 1
0 0
Build failed in Jenkins: osinfo-db-tools-check » libvirt-freebsd-12 #72
by ci@centos.org 02 Jun '20

02 Jun '20
See <https://ci.centos.org/job/osinfo-db-tools-check/systems=libvirt-freebsd-12/…> ------------------------------------------ [...truncated 3.57 KB...] prohibit_test_minus_ao prohibit_undesirable_word_seq prohibit_xalloc_without_use redundant_const space_tab trailing_blank unmarked_diagnostics useless_cpp_parens prohibit_xfreopen_without_use 23.00 TAB_in_indentation 23.00 avoid_attribute_unused_in_header 23.00 Wundef_boolean 23.00 avoid_if_before_free 24.00 bindtextdomain 24.00 bracket_spacing_check 24.00 cast_of_argument_to_free 23.00 cast_of_x_alloc_return_value 23.00 const_long_option 23.00 error_message_period 23.00 copyright_format 23.00 error_message_warn_fatal 23.00 preprocessor_indentation 24.00 po_check 24.00 prohibit_S_IS_definition 24.00 prohibit_HAVE_MBRTOWC 24.00 prohibit_argmatch_without_use 23.00 prohibit_assert_without_use 23.00 prohibit_atoi_atof 23.00 prohibit_backup_files 23.00 prohibit_c_ctype_without_use 23.00 prohibit_canonicalize_without_use 24.00 prohibit_cloexec_without_use 24.00 prohibit_close_stream_without_use 24.00 prohibit_defined_have_decl_tests 23.00 prohibit_double_semicolon 23.00 prohibit_doubled_word 23.00 prohibit_empty_lines_at_EOF 23.00 prohibit_dirent_without_use 23.00 prohibit_getopt_without_use 23.00 prohibit_hash_pjw_without_use 23.00 prohibit_ignore_value_without_use 23.00 prohibit_hash_without_use 23.00 prohibit_error_without_use 24.00 prohibit_magic_number_exit 24.00 prohibit_long_options_without_use 23.00 prohibit_inttostr_without_use 24.00 prohibit_openat_without_use 24.00 prohibit_path_max_allocation 23.00 prohibit_quotearg_without_use 23.00 prohibit_quote_without_use 23.00 prohibit_posixver_without_use 24.00 prohibit_reversed_compare_failure 24.00 prohibit_safe_read_without_use 24.00 prohibit_same_without_use 24.00 prohibit_root_dev_ino_without_use 24.00 prohibit_signal_without_use 24.00 prohibit_stat_st_blocks 24.00 prohibit_stddef_without_use 24.00 prohibit_stdio-safer_without_use 24.00 prohibit_stdio--_without_use 24.00 prohibit_strcmp ------- Full log written to /usr<https://ci.centos.org/job/osinfo-db-tools-check/systems=libvirt-freebsd-12/…> FAILED: meson-test /usr/local/bin/meson test --no-rebuild --print-errorlogs ninja: build stopped: subcommand failed. + cat meson-logs/testlog.txt Log of Meson test suite run on 2020-05-29T14:32:38.824250 Inherited environment: LC_CTYPE='C.UTF-8' JOB_NAME='osinfo-db-tools-check/systems=libvirt-freebsd-12' HUDSON_SERVER_COOKIE='f4d3a7a925dabf8a' BUILD_NUMBER='72' MAKE='/usr/local/bin/gmake' XDG_DATA_DIRS='/home/jenkins/build/libvirt/share:/usr/share:/usr/local/share' GI_TYPELIB_PATH='/home/jenkins/build/libvirt/lib/girepository-1.0' JOB_DISPLAY_URL='https://ci.centos.org/job/osinfo-db-tools-check/systems=libvirt-freebsd-12/…' C_INCLUDE_PATH='/home/jenkins/build/libvirt/include' MAIL='/var/mail/jenkins' RUN_CHANGES_DISPLAY_URL='https://ci.centos.org/job/osinfo-db-tools-check/systems=libvirt-freebsd-12/…' JENKINS_URL='https://ci.centos.org/' OSINFO_SYSTEM_DIR='/home/jenkins/build/libvirt/share/osinfo' JENKINS_HOME='/var/lib/jenkins' MAKEFLAGS='-j3' PATH='/usr/libexec/ccache-wrappers:/home/jenkins/build/libvirt/bin:/sbin:/bin:/usr/sbin:/usr/bin:/usr/local/sbin:/usr/local/bin:/home/jenkins/bin' LD_LIBRARY_PATH='/home/jenkins/build/libvirt/lib' JOB_BASE_NAME='systems=libvirt-freebsd-12' CCACHE_WRAPPERSDIR='/usr/libexec/ccache-wrappers' CCACHE_MAXSIZE='2G' HUDSON_HOME='/var/lib/jenkins' PYTHONPATH='/home/jenkins/build/libvirt/lib/python3.7/site-packages' BUILD_ID='72' PERL5LIB='/home/jenkins/build/libvirt/lib/perl5/amd64-freebsd-thread-multi' OLDPWD='/usr<https://ci.centos.org/job/osinfo-db-tools-check/systems=libvirt-freebsd-12/…'> JENKINS_SERVER_COOKIE='f4d3a7a925dabf8a' ROOT_BUILD_CAUSE='SCMTRIGGER' PWD='/usr<https://ci.centos.org/job/osinfo-db-tools-check/systems=libvirt-freebsd-12/…'> NINJA='/usr/local/bin/ninja' _='/usr/local/bin/java' BUILD_TAG='jenkins-osinfo-db-tools-check-systems=libvirt-freebsd-12-72' NODE_LABELS='libvirt libvirt-freebsd-12' BUILD_CAUSE='UPSTREAMTRIGGER' BUILD_DISPLAY_NAME='#72' RUN_DISPLAY_URL='https://ci.centos.org/job/osinfo-db-tools-check/systems=libvirt-freebsd-12/…' USER='jenkins' HOME='/home/jenkins' BUILD_URL='https://ci.centos.org/job/osinfo-db-tools-check/systems=libvirt-freebsd-12/…' ROOT_BUILD_CAUSE_SCMTRIGGER='true' JOB_URL='https://ci.centos.org/job/osinfo-db-tools-check/systems=libvirt-freebsd-12/' BASH_ENV='/home/jenkins/.bashrc' PS1='[\u@\h \w]$ ' SHELL='/usr/local/bin/bash' HUDSON_URL='https://ci.centos.org/' HUDSON_COOKIE='3ad54af9-3492-43d7-8d2d-474bd141e957' WORKSPACE='<https://ci.centos.org/job/osinfo-db-tools-check/systems=libvirt-freebsd-12/…'> BUILD_CAUSE_UPSTREAMTRIGGER='true' PYTHON='/usr/local/bin/python3' NODE_NAME='libvirt-freebsd-12' systems='libvirt-freebsd-12' VIRT_PREFIX='/home/jenkins/build/libvirt' PKG_CONFIG_PATH='/home/jenkins/build/libvirt/lib/pkgconfig' BLOCKSIZE='K' EXECUTOR_NUMBER='3' SHLVL='0' 1/4 osinfo-db-tools:style / syntax-check TIMEOUT 30.06 s --- command --- 14:32:38 MESON_SOURCE_ROOT='/usr<https://ci.centos.org/job/osinfo-db-tools-check/systems=libvirt-freebsd-12/…'> /usr<https://ci.centos.org/job/osinfo-db-tools-check/systems=libvirt-freebsd-12/…> --- stdout --- TAB_in_indentation Wundef_boolean avoid_attribute_unused_in_header bindtextdomain avoid_if_before_free bracket_spacing_check cast_of_argument_to_free cast_of_x_alloc_return_value const_long_option copyright_format error_message_period error_message_warn_fatal po_check prohibit_HAVE_MBRTOWC prohibit_S_IS_definition preprocessor_indentation prohibit_argmatch_without_use prohibit_assert_without_use prohibit_backup_files prohibit_atoi_atof prohibit_c_ctype_without_use prohibit_canonicalize_without_use prohibit_cloexec_without_use prohibit_close_stream_without_use prohibit_defined_have_decl_tests prohibit_dirent_without_use prohibit_double_semicolon prohibit_doubled_word prohibit_empty_lines_at_EOF prohibit_error_without_use prohibit_getopt_without_use prohibit_hash_pjw_without_use prohibit_hash_without_use prohibit_ignore_value_without_use prohibit_inttostr_without_use prohibit_long_options_without_use prohibit_magic_number_exit prohibit_openat_without_use prohibit_path_max_allocation prohibit_posixver_without_use prohibit_quote_without_use prohibit_reversed_compare_failure prohibit_quotearg_without_use prohibit_root_dev_ino_without_use prohibit_safe_read_without_use prohibit_same_without_use prohibit_signal_without_use prohibit_stat_st_blocks prohibit_stddef_without_use prohibit_stdio--_without_use prohibit_stdio-safer_without_use prohibit_strcmp prohibit_strings_without_use prohibit_test_double_equal prohibit_strncpy prohibit_test_minus_ao prohibit_undesirable_word_seq prohibit_xalloc_without_use redundant_const space_tab trailing_blank unmarked_diagnostics useless_cpp_parens prohibit_xfreopen_without_use 23.00 TAB_in_indentation 23.00 avoid_attribute_unused_in_header 23.00 Wundef_boolean 23.00 avoid_if_before_free 24.00 bindtextdomain 24.00 bracket_spacing_check 24.00 cast_of_argument_to_free 23.00 cast_of_x_alloc_return_value 23.00 const_long_option 23.00 error_message_period 23.00 copyright_format 23.00 error_message_warn_fatal 23.00 preprocessor_indentation 24.00 po_check 24.00 prohibit_S_IS_definition 24.00 prohibit_HAVE_MBRTOWC 24.00 prohibit_argmatch_without_use 23.00 prohibit_assert_without_use 23.00 prohibit_atoi_atof 23.00 prohibit_backup_files 23.00 prohibit_c_ctype_without_use 23.00 prohibit_canonicalize_without_use 24.00 prohibit_cloexec_without_use 24.00 prohibit_close_stream_without_use 24.00 prohibit_defined_have_decl_tests 23.00 prohibit_double_semicolon 23.00 prohibit_doubled_word 23.00 prohibit_empty_lines_at_EOF 23.00 prohibit_dirent_without_use 23.00 prohibit_getopt_without_use 23.00 prohibit_hash_pjw_without_use 23.00 prohibit_ignore_value_without_use 23.00 prohibit_hash_without_use 23.00 prohibit_error_without_use 24.00 prohibit_magic_number_exit 24.00 prohibit_long_options_without_use 23.00 prohibit_inttostr_without_use 24.00 prohibit_openat_without_use 24.00 prohibit_path_max_allocation 23.00 prohibit_quotearg_without_use 23.00 prohibit_quote_without_use 23.00 prohibit_posixver_without_use 24.00 prohibit_reversed_compare_failure 24.00 prohibit_safe_read_without_use 24.00 prohibit_same_without_use 24.00 prohibit_root_dev_ino_without_use 24.00 prohibit_signal_without_use 24.00 prohibit_stat_st_blocks 24.00 prohibit_stddef_without_use 24.00 prohibit_stdio-safer_without_use 24.00 prohibit_stdio--_without_use 24.00 prohibit_strcmp ------- 2/4 osinfo-db-tools:unit / export-import OK 26.09 s --- command --- 14:32:38 abs_top_srcdir='/usr<https://ci.centos.org/job/osinfo-db-tools-check/systems=libvirt-freebsd-12/…'> datadir='/home/jenkins/build/libvirt/share' abs_top_builddir='/usr<https://ci.centos.org/job/osinfo-db-tools-check/systems=libvirt-freebsd-12/…'> sysconfdir='/home/jenkins/build/libvirt/etc' /usr<https://ci.centos.org/job/osinfo-db-tools-check/systems=libvirt-freebsd-12/…> --- stdout --- ============================= test session starts ============================== platform freebsd12 -- Python 3.7.7, pytest-4.5.0, py-1.8.1, pluggy-0.12.0 rootdir: /usr<https://ci.centos.org/job/osinfo-db-tools-check/systems=libvirt-freebsd-12/…> collected 10 items ../tests/test_osinfo_db_export_import.py ........ss [100%] ===================== 8 passed, 2 skipped in 13.35 seconds ===================== ------- 3/4 osinfo-db-tools:unit / path OK 9.06 s --- command --- 14:33:04 abs_top_srcdir='/usr<https://ci.centos.org/job/osinfo-db-tools-check/systems=libvirt-freebsd-12/…'> datadir='/home/jenkins/build/libvirt/share' abs_top_builddir='/usr<https://ci.centos.org/job/osinfo-db-tools-check/systems=libvirt-freebsd-12/…'> sysconfdir='/home/jenkins/build/libvirt/etc' /usr<https://ci.centos.org/job/osinfo-db-tools-check/systems=libvirt-freebsd-12/…> --- stdout --- ============================= test session starts ============================== platform freebsd12 -- Python 3.7.7, pytest-4.5.0, py-1.8.1, pluggy-0.12.0 rootdir: /usr<https://ci.centos.org/job/osinfo-db-tools-check/systems=libvirt-freebsd-12/…> collected 5 items ../tests/test_osinfo_db_path.py ..... [100%] =========================== 5 passed in 1.43 seconds =========================== ------- 4/4 osinfo-db-tools:unit / validate OK 8.99 s --- command --- 14:33:08 abs_top_srcdir='/usr<https://ci.centos.org/job/osinfo-db-tools-check/systems=libvirt-freebsd-12/…'> datadir='/home/jenkins/build/libvirt/share' abs_top_builddir='/usr<https://ci.centos.org/job/osinfo-db-tools-check/systems=libvirt-freebsd-12/…'> sysconfdir='/home/jenkins/build/libvirt/etc' /usr<https://ci.centos.org/job/osinfo-db-tools-check/systems=libvirt-freebsd-12/…> --- stdout --- ============================= test session starts ============================== platform freebsd12 -- Python 3.7.7, pytest-4.5.0, py-1.8.1, pluggy-0.12.0 rootdir: /usr<https://ci.centos.org/job/osinfo-db-tools-check/systems=libvirt-freebsd-12/…> collected 6 items ../tests/test_osinfo_db_validate.py ...... [100%] =========================== 6 passed in 2.33 seconds =========================== ------- Ok: 3 Expected Fail: 0 Fail: 0 Unexpected Pass: 0 Skipped: 0 Timeout: 1 + exit 1 Build step 'Execute shell' marked build as failure
1 1
0 0
  • ← Newer
  • 1
  • 2
  • 3
  • 4
  • 5
  • 6
  • 7
  • 8
  • Older →

HyperKitty Powered by HyperKitty version 1.3.12.