libvirt List Archives
Sign In Sign Up
Manage this list Sign In Sign Up

Keyboard Shortcuts

Thread View

  • j: Next unread message
  • k: Previous unread message
  • j a: Jump to all threads
  • j l: Jump to MailingList overview

CI

Thread Start a new thread
Download
Threads by month
  • ----- 2025 -----
  • August
  • July
  • June
  • May
  • April
  • March
  • February
  • January
  • ----- 2024 -----
  • December
  • November
  • October
  • September
  • August
  • July
  • June
  • May
  • April
  • March
  • February
  • January
  • ----- 2023 -----
  • December
  • November
  • October
  • September
  • August
  • July
  • June
  • May
  • April
  • March
  • February
  • January
  • ----- 2022 -----
  • December
  • November
  • October
  • September
  • August
  • July
  • June
  • May
  • April
  • March
  • February
  • January
  • ----- 2021 -----
  • December
  • November
  • October
  • September
  • August
  • July
  • June
  • May
  • April
  • March
  • February
  • January
  • ----- 2020 -----
  • December
  • November
  • October
  • September
  • August
  • July
  • June
  • May
  • April
  • March
  • February
  • January
  • ----- 2019 -----
  • December
  • November
  • October
  • September
  • August
  • July
  • June
  • May
  • April
  • March
  • February
  • January
  • ----- 2018 -----
  • December
  • November
  • October
  • September
  • August
  • July
  • June
  • May
  • April
  • March
  • February
  • January
  • ----- 2017 -----
  • December
  • November
  • October
  • September
  • August
  • July
  • June
  • May
  • April
  • March
  • February
  • January
  • ----- 2016 -----
  • December
  • November
  • October
  • September
  • August
  • July
ci@lists.libvirt.org

June 2020

  • 3 participants
  • 74 discussions
libvirt | Pipeline #156327240 has failed for master | e57323ec
by GitLab 15 Jun '20

15 Jun '20
Your pipeline has failed. Project: libvirt ( https://gitlab.com/libvirt/libvirt ) Branch: master ( https://gitlab.com/libvirt/libvirt/-/commits/master ) Commit: e57323ec ( https://gitlab.com/libvirt/libvirt/-/commit/e57323ece1da2409421f9e80b5778e9… ) Commit Message: docs: Remove libvirt-dockerfiles from CI dashbo... Commit Author: Andrea Bolognani ( https://gitlab.com/abologna ) Pipeline #156327240 ( https://gitlab.com/libvirt/libvirt/-/pipelines/156327240 ) triggered by Andrea Bolognani ( https://gitlab.com/abologna ) had 2 failed builds. Job #595461234 ( https://gitlab.com/libvirt/libvirt/-/jobs/595461234/raw ) Stage: builds Name: x64-freebsd-12-build Trace: * [new branch] master -> origin/master * [new tag] v6.4.0 -> v6.4.0 * [new tag] v6.4.0-rc1 -> v6.4.0-rc1 Checking out e57323ec as master... Skipping Git submodules setup section_end:1592225071:get_sources section_start:1592225071:restore_cache Restoring cache section_end:1592225073:restore_cache section_start:1592225073:download_artifacts Downloading artifacts section_end:1592225074:download_artifacts section_start:1592225074:build_script Running before_script and script Authenticating with credentials from job payload (GitLab Registry) $ cirrus-run ci/cirrus/$NAME.yml.j2 Build created: https://cirrus-ci.com/build/6507299491545088 ............................................................ ............................................................ ............................................................ ............................................................ ............................................................ ............................................................ ............................................................ ............................................................ ............................................................ ............................................................ ............................................................ ............................................................ ....................................................... Build failed: https://cirrus-ci.com/build/6507299491545088 section_end:1592225851:build_script section_start:1592225851:after_script Running after_script section_end:1592225852:after_script section_start:1592225852:upload_artifacts_on_failure Uploading artifacts for failed job section_end:1592225854:upload_artifacts_on_failure ERROR: Job failed: exit code 1  Job #595461199 ( https://gitlab.com/libvirt/libvirt/-/jobs/595461199/raw ) Stage: containers Name: mips-debian-sid-container Trace: E: Unable to locate package libiscsi-dev:mips E: Unable to locate package libncurses-dev:mips E: Unable to locate package libnl-3-dev:mips E: Unable to locate package libnl-route-3-dev:mips E: Unable to locate package libnuma-dev:mips E: Unable to locate package libparted-dev:mips E: Unable to locate package libpcap0.8-dev:mips E: Couldn't find any package by glob 'libpcap0.8-dev' E: Couldn't find any package by regex 'libpcap0.8-dev' E: Unable to locate package libpciaccess-dev:mips E: Unable to locate package librbd-dev:mips E: Unable to locate package libreadline-dev:mips E: Unable to locate package libsanlock-dev:mips E: Unable to locate package libsasl2-dev:mips E: Unable to locate package libselinux1-dev:mips E: Unable to locate package libssh-gcrypt-dev:mips E: Unable to locate package libssh2-1-dev:mips E: Unable to locate package libtirpc-dev:mips E: Unable to locate package libudev-dev:mips E: Unable to locate package libxml2-dev:mips E: Unable to locate package libyajl-dev:mips E: Unable to locate package xfslibs-dev:mips The command '/bin/sh -c export DEBIAN_FRONTEND=noninteractive && dpkg --add-architecture mips && apt-get update && apt-get dist-upgrade -y && apt-get install --no-install-recommends -y dpkg-dev && apt-get install --no-install-recommends -y gcc-mips-linux-gnu libacl1-dev:mips libapparmor-dev:mips libattr1-dev:mips libaudit-dev:mips libavahi-client-dev:mips libblkid-dev:mips libc6-dev:mips libcap-ng-dev:mips libcurl4-gnutls-dev:mips libdbus-1-dev:mips libdevmapper-dev:mips libfuse-dev:mips libglib2.0-dev:mips libglusterfs-dev:mips libgnutls28-dev:mips libiscsi-dev:mips libncurses-dev:mips libnl-3-dev:mips libnl-route-3-dev:mips libnuma-dev:mips libparted-dev:mips libpcap0.8-dev:mips libpciaccess-dev:mips librbd-dev:mips libreadline-dev:mips libsanlock-dev:mips libsasl2-dev:mips libselinux1-dev:mips libssh-gcrypt-dev:mips libssh2-1-dev:mips libtirpc-dev:mips libudev-dev:mips libxml2-dev:mips libyajl-dev:mips xfslibs-dev:mips && apt-get autoremove -y && apt-get autoclean -y' returned a non-zero code: 100 section_end:1592225028:build_script section_start:1592225028:after_script Running after_script Running after script... $ docker logout Not logged in to https://index.docker.io/v1/ section_end:1592225029:after_script section_start:1592225029:upload_artifacts_on_failure Uploading artifacts for failed job section_end:1592225031:upload_artifacts_on_failure ERROR: Job failed: exit code 100  -- You're receiving this email because of your account on gitlab.com.
1 0
0 0
libvirt-go-xml | Pipeline #156145101 has failed for master | dd07f98a
by GitLab 15 Jun '20

15 Jun '20
Your pipeline has failed. Project: libvirt-go-xml ( https://gitlab.com/libvirt/libvirt-go-xml ) Branch: master ( https://gitlab.com/libvirt/libvirt-go-xml/-/commits/master ) Commit: dd07f98a ( https://gitlab.com/libvirt/libvirt-go-xml/-/commit/dd07f98a02788c19568e799e… ) Commit Message: Add 'downscript' for domain interfaces Signed... Commit Author: Daniel Berrange ( https://gitlab.com/berrange ) Pipeline #156145101 ( https://gitlab.com/libvirt/libvirt-go-xml/-/pipelines/156145101 ) triggered by Daniel Berrange ( https://gitlab.com/berrange ) had 5 failed builds. Job #594681895 ( https://gitlab.com/libvirt/libvirt-go-xml/-/jobs/594681895/raw ) Stage: build Name: go_1_10 Trace: Skipping Git submodules setup section_end:1592190374:get_sources section_start:1592190374:restore_cache Restoring cache section_end:1592190375:restore_cache section_start:1592190375:download_artifacts Downloading artifacts section_end:1592190377:download_artifacts section_start:1592190377:build_script Running before_script and script $ go test -timeout 10m -tags xmlroundtrip -v === RUN TestDomainSnapshot --- PASS: TestDomainSnapshot (0.00s) === RUN TestDomain --- PASS: TestDomain (0.01s) === RUN TestNetwork --- PASS: TestNetwork (0.00s) === RUN TestNodeDevice --- PASS: TestNodeDevice (0.00s) === RUN TestSecret --- PASS: TestSecret (0.00s) === RUN TestStoragePool --- PASS: TestStoragePool (0.00s) === RUN TestStorageVolume --- PASS: TestStorageVolume (0.00s) === RUN TestRoundTrip --- FAIL: TestRoundTrip (63.46s) xml_test.go:374: testdata/libvirt/tests/domaincapsdata/qemu_1.5.3-q35.x86_64.xml: /domainCapabilities[0]/cpu[0]/mode[0]/enum[0]: element in expected XML missing in actual XML FAIL exit status 1 FAIL _/builds/libvirt/libvirt-go-xml 63.479s section_end:1592190445:build_script section_start:1592190445:after_script Running after_script section_end:1592190447:after_script section_start:1592190447:upload_artifacts_on_failure Uploading artifacts for failed job section_end:1592190448:upload_artifacts_on_failure ERROR: Job failed: exit code 1  Job #594681935 ( https://gitlab.com/libvirt/libvirt-go-xml/-/jobs/594681935/raw ) Stage: build Name: go_1_14 Trace: Skipping Git submodules setup section_end:1592190372:get_sources section_start:1592190372:restore_cache Restoring cache section_end:1592190374:restore_cache section_start:1592190374:download_artifacts Downloading artifacts section_end:1592190375:download_artifacts section_start:1592190375:build_script Running before_script and script $ go test -timeout 10m -tags xmlroundtrip -v === RUN TestDomainSnapshot --- PASS: TestDomainSnapshot (0.00s) === RUN TestDomain --- PASS: TestDomain (0.01s) === RUN TestNetwork --- PASS: TestNetwork (0.00s) === RUN TestNodeDevice --- PASS: TestNodeDevice (0.00s) === RUN TestSecret --- PASS: TestSecret (0.00s) === RUN TestStoragePool --- PASS: TestStoragePool (0.00s) === RUN TestStorageVolume --- PASS: TestStorageVolume (0.00s) === RUN TestRoundTrip TestRoundTrip: xml_test.go:374: testdata/libvirt/tests/domaincapsdata/qemu_1.5.3-q35.x86_64.xml: /domainCapabilities[0]/cpu[0]/mode[0]/enum[0]: element in expected XML missing in actual XML --- FAIL: TestRoundTrip (62.46s) FAIL exit status 1 FAIL _/builds/libvirt/libvirt-go-xml 62.471s section_end:1592190445:build_script section_start:1592190445:after_script Running after_script section_end:1592190446:after_script section_start:1592190446:upload_artifacts_on_failure Uploading artifacts for failed job section_end:1592190448:upload_artifacts_on_failure ERROR: Job failed: exit code 1  Job #594681928 ( https://gitlab.com/libvirt/libvirt-go-xml/-/jobs/594681928/raw ) Stage: build Name: go_1_13 Trace: Skipping Git submodules setup section_end:1592190373:get_sources section_start:1592190373:restore_cache Restoring cache section_end:1592190375:restore_cache section_start:1592190375:download_artifacts Downloading artifacts section_end:1592190376:download_artifacts section_start:1592190376:build_script Running before_script and script $ go test -timeout 10m -tags xmlroundtrip -v === RUN TestDomainSnapshot --- PASS: TestDomainSnapshot (0.00s) === RUN TestDomain --- PASS: TestDomain (0.01s) === RUN TestNetwork --- PASS: TestNetwork (0.00s) === RUN TestNodeDevice --- PASS: TestNodeDevice (0.00s) === RUN TestSecret --- PASS: TestSecret (0.00s) === RUN TestStoragePool --- PASS: TestStoragePool (0.00s) === RUN TestStorageVolume --- PASS: TestStorageVolume (0.00s) === RUN TestRoundTrip --- FAIL: TestRoundTrip (58.81s) xml_test.go:374: testdata/libvirt/tests/domaincapsdata/qemu_1.5.3-q35.x86_64.xml: /domainCapabilities[0]/cpu[0]/mode[0]/enum[0]: element in expected XML missing in actual XML FAIL exit status 1 FAIL _/builds/libvirt/libvirt-go-xml 58.826s section_end:1592190443:build_script section_start:1592190443:after_script Running after_script section_end:1592190445:after_script section_start:1592190445:upload_artifacts_on_failure Uploading artifacts for failed job section_end:1592190446:upload_artifacts_on_failure ERROR: Job failed: exit code 1  Job #594681921 ( https://gitlab.com/libvirt/libvirt-go-xml/-/jobs/594681921/raw ) Stage: build Name: go_1_12 Trace: Skipping Git submodules setup section_end:1592190372:get_sources section_start:1592190372:restore_cache Restoring cache section_end:1592190373:restore_cache section_start:1592190373:download_artifacts Downloading artifacts section_end:1592190375:download_artifacts section_start:1592190375:build_script Running before_script and script $ go test -timeout 10m -tags xmlroundtrip -v === RUN TestDomainSnapshot --- PASS: TestDomainSnapshot (0.00s) === RUN TestDomain --- PASS: TestDomain (0.01s) === RUN TestNetwork --- PASS: TestNetwork (0.00s) === RUN TestNodeDevice --- PASS: TestNodeDevice (0.00s) === RUN TestSecret --- PASS: TestSecret (0.00s) === RUN TestStoragePool --- PASS: TestStoragePool (0.00s) === RUN TestStorageVolume --- PASS: TestStorageVolume (0.00s) === RUN TestRoundTrip --- FAIL: TestRoundTrip (60.75s) xml_test.go:374: testdata/libvirt/tests/domaincapsdata/qemu_1.5.3-q35.x86_64.xml: /domainCapabilities[0]/cpu[0]/mode[0]/enum[0]: element in expected XML missing in actual XML FAIL exit status 1 FAIL _/builds/libvirt/libvirt-go-xml 60.771s section_end:1592190442:build_script section_start:1592190442:after_script Running after_script section_end:1592190444:after_script section_start:1592190444:upload_artifacts_on_failure Uploading artifacts for failed job section_end:1592190445:upload_artifacts_on_failure ERROR: Job failed: exit code 1  Job #594681913 ( https://gitlab.com/libvirt/libvirt-go-xml/-/jobs/594681913/raw ) Stage: build Name: go_1_11 Trace: Skipping Git submodules setup section_end:1592190370:get_sources section_start:1592190370:restore_cache Restoring cache section_end:1592190371:restore_cache section_start:1592190371:download_artifacts Downloading artifacts section_end:1592190373:download_artifacts section_start:1592190373:build_script Running before_script and script $ go test -timeout 10m -tags xmlroundtrip -v === RUN TestDomainSnapshot --- PASS: TestDomainSnapshot (0.00s) === RUN TestDomain --- PASS: TestDomain (0.01s) === RUN TestNetwork --- PASS: TestNetwork (0.00s) === RUN TestNodeDevice --- PASS: TestNodeDevice (0.00s) === RUN TestSecret --- PASS: TestSecret (0.00s) === RUN TestStoragePool --- PASS: TestStoragePool (0.00s) === RUN TestStorageVolume --- PASS: TestStorageVolume (0.00s) === RUN TestRoundTrip --- FAIL: TestRoundTrip (60.30s) xml_test.go:374: testdata/libvirt/tests/domaincapsdata/qemu_1.5.3-q35.x86_64.xml: /domainCapabilities[0]/cpu[0]/mode[0]/enum[0]: element in expected XML missing in actual XML FAIL exit status 1 FAIL _/builds/libvirt/libvirt-go-xml 60.314s section_end:1592190440:build_script section_start:1592190440:after_script Running after_script section_end:1592190441:after_script section_start:1592190441:upload_artifacts_on_failure Uploading artifacts for failed job section_end:1592190442:upload_artifacts_on_failure ERROR: Job failed: exit code 1  -- You're receiving this email because of your account on gitlab.com.
1 0
0 0
libvirt-go-xml | Pipeline #155975950 has failed for master | dd07f98a
by GitLab 14 Jun '20

14 Jun '20
Your pipeline has failed. Project: libvirt-go-xml ( https://gitlab.com/libvirt/libvirt-go-xml ) Branch: master ( https://gitlab.com/libvirt/libvirt-go-xml/-/commits/master ) Commit: dd07f98a ( https://gitlab.com/libvirt/libvirt-go-xml/-/commit/dd07f98a02788c19568e799e… ) Commit Message: Add 'downscript' for domain interfaces Signed... Commit Author: Daniel Berrange ( https://gitlab.com/berrange ) Pipeline #155975950 ( https://gitlab.com/libvirt/libvirt-go-xml/-/pipelines/155975950 ) triggered by Daniel Berrange ( https://gitlab.com/berrange ) had 5 failed builds. Job #594146349 ( https://gitlab.com/libvirt/libvirt-go-xml/-/jobs/594146349/raw ) Stage: build Name: go_1_11 Trace: Skipping Git submodules setup section_end:1592104007:get_sources section_start:1592104007:restore_cache Restoring cache section_end:1592104008:restore_cache section_start:1592104008:download_artifacts Downloading artifacts section_end:1592104010:download_artifacts section_start:1592104010:build_script Running before_script and script $ go test -timeout 10m -tags xmlroundtrip -v === RUN TestDomainSnapshot --- PASS: TestDomainSnapshot (0.00s) === RUN TestDomain --- PASS: TestDomain (0.01s) === RUN TestNetwork --- PASS: TestNetwork (0.00s) === RUN TestNodeDevice --- PASS: TestNodeDevice (0.00s) === RUN TestSecret --- PASS: TestSecret (0.00s) === RUN TestStoragePool --- PASS: TestStoragePool (0.00s) === RUN TestStorageVolume --- PASS: TestStorageVolume (0.00s) === RUN TestRoundTrip --- FAIL: TestRoundTrip (54.76s) xml_test.go:374: testdata/libvirt/tests/domaincapsdata/qemu_1.5.3-q35.x86_64.xml: /domainCapabilities[0]/cpu[0]/mode[0]/enum[0]: element in expected XML missing in actual XML FAIL exit status 1 FAIL _/builds/libvirt/libvirt-go-xml 54.774s section_end:1592104072:build_script section_start:1592104072:after_script Running after_script section_end:1592104073:after_script section_start:1592104073:upload_artifacts_on_failure Uploading artifacts for failed job section_end:1592104075:upload_artifacts_on_failure ERROR: Job failed: exit code 1  Job #594146354 ( https://gitlab.com/libvirt/libvirt-go-xml/-/jobs/594146354/raw ) Stage: build Name: go_1_12 Trace: Skipping Git submodules setup section_end:1592104006:get_sources section_start:1592104006:restore_cache Restoring cache section_end:1592104007:restore_cache section_start:1592104007:download_artifacts Downloading artifacts section_end:1592104009:download_artifacts section_start:1592104009:build_script Running before_script and script $ go test -timeout 10m -tags xmlroundtrip -v === RUN TestDomainSnapshot --- PASS: TestDomainSnapshot (0.00s) === RUN TestDomain --- PASS: TestDomain (0.01s) === RUN TestNetwork --- PASS: TestNetwork (0.00s) === RUN TestNodeDevice --- PASS: TestNodeDevice (0.00s) === RUN TestSecret --- PASS: TestSecret (0.00s) === RUN TestStoragePool --- PASS: TestStoragePool (0.00s) === RUN TestStorageVolume --- PASS: TestStorageVolume (0.00s) === RUN TestRoundTrip --- FAIL: TestRoundTrip (55.56s) xml_test.go:374: testdata/libvirt/tests/domaincapsdata/qemu_1.5.3-q35.x86_64.xml: /domainCapabilities[0]/cpu[0]/mode[0]/enum[0]: element in expected XML missing in actual XML FAIL exit status 1 FAIL _/builds/libvirt/libvirt-go-xml 55.572s section_end:1592104071:build_script section_start:1592104071:after_script Running after_script section_end:1592104073:after_script section_start:1592104073:upload_artifacts_on_failure Uploading artifacts for failed job section_end:1592104074:upload_artifacts_on_failure ERROR: Job failed: exit code 1  Job #594146364 ( https://gitlab.com/libvirt/libvirt-go-xml/-/jobs/594146364/raw ) Stage: build Name: go_1_13 Trace: Skipping Git submodules setup section_end:1592104001:get_sources section_start:1592104001:restore_cache Restoring cache section_end:1592104003:restore_cache section_start:1592104003:download_artifacts Downloading artifacts section_end:1592104004:download_artifacts section_start:1592104004:build_script Running before_script and script $ go test -timeout 10m -tags xmlroundtrip -v === RUN TestDomainSnapshot --- PASS: TestDomainSnapshot (0.00s) === RUN TestDomain --- PASS: TestDomain (0.01s) === RUN TestNetwork --- PASS: TestNetwork (0.00s) === RUN TestNodeDevice --- PASS: TestNodeDevice (0.00s) === RUN TestSecret --- PASS: TestSecret (0.00s) === RUN TestStoragePool --- PASS: TestStoragePool (0.00s) === RUN TestStorageVolume --- PASS: TestStorageVolume (0.00s) === RUN TestRoundTrip --- FAIL: TestRoundTrip (58.52s) xml_test.go:374: testdata/libvirt/tests/domaincapsdata/qemu_1.5.3-q35.x86_64.xml: /domainCapabilities[0]/cpu[0]/mode[0]/enum[0]: element in expected XML missing in actual XML FAIL exit status 1 FAIL _/builds/libvirt/libvirt-go-xml 58.539s section_end:1592104070:build_script section_start:1592104070:after_script Running after_script section_end:1592104072:after_script section_start:1592104072:upload_artifacts_on_failure Uploading artifacts for failed job section_end:1592104073:upload_artifacts_on_failure ERROR: Job failed: exit code 1  Job #594146368 ( https://gitlab.com/libvirt/libvirt-go-xml/-/jobs/594146368/raw ) Stage: build Name: go_1_14 Trace: Skipping Git submodules setup section_end:1592103999:get_sources section_start:1592103999:restore_cache Restoring cache section_end:1592104000:restore_cache section_start:1592104000:download_artifacts Downloading artifacts section_end:1592104002:download_artifacts section_start:1592104002:build_script Running before_script and script $ go test -timeout 10m -tags xmlroundtrip -v === RUN TestDomainSnapshot --- PASS: TestDomainSnapshot (0.00s) === RUN TestDomain --- PASS: TestDomain (0.01s) === RUN TestNetwork --- PASS: TestNetwork (0.00s) === RUN TestNodeDevice --- PASS: TestNodeDevice (0.00s) === RUN TestSecret --- PASS: TestSecret (0.00s) === RUN TestStoragePool --- PASS: TestStoragePool (0.00s) === RUN TestStorageVolume --- PASS: TestStorageVolume (0.00s) === RUN TestRoundTrip TestRoundTrip: xml_test.go:374: testdata/libvirt/tests/domaincapsdata/qemu_1.5.3-q35.x86_64.xml: /domainCapabilities[0]/cpu[0]/mode[0]/enum[0]: element in expected XML missing in actual XML --- FAIL: TestRoundTrip (59.45s) FAIL exit status 1 FAIL _/builds/libvirt/libvirt-go-xml 59.463s section_end:1592104068:build_script section_start:1592104068:after_script Running after_script section_end:1592104070:after_script section_start:1592104070:upload_artifacts_on_failure Uploading artifacts for failed job section_end:1592104071:upload_artifacts_on_failure ERROR: Job failed: exit code 1  Job #594146339 ( https://gitlab.com/libvirt/libvirt-go-xml/-/jobs/594146339/raw ) Stage: build Name: go_1_10 Trace: Skipping Git submodules setup section_end:1592104000:get_sources section_start:1592104000:restore_cache Restoring cache section_end:1592104002:restore_cache section_start:1592104002:download_artifacts Downloading artifacts section_end:1592104003:download_artifacts section_start:1592104003:build_script Running before_script and script $ go test -timeout 10m -tags xmlroundtrip -v === RUN TestDomainSnapshot --- PASS: TestDomainSnapshot (0.00s) === RUN TestDomain --- PASS: TestDomain (0.01s) === RUN TestNetwork --- PASS: TestNetwork (0.00s) === RUN TestNodeDevice --- PASS: TestNodeDevice (0.00s) === RUN TestSecret --- PASS: TestSecret (0.00s) === RUN TestStoragePool --- PASS: TestStoragePool (0.00s) === RUN TestStorageVolume --- PASS: TestStorageVolume (0.00s) === RUN TestRoundTrip --- FAIL: TestRoundTrip (59.33s) xml_test.go:374: testdata/libvirt/tests/domaincapsdata/qemu_1.5.3-q35.x86_64.xml: /domainCapabilities[0]/cpu[0]/mode[0]/enum[0]: element in expected XML missing in actual XML FAIL exit status 1 FAIL _/builds/libvirt/libvirt-go-xml 59.344s section_end:1592104067:build_script section_start:1592104067:after_script Running after_script section_end:1592104069:after_script section_start:1592104069:upload_artifacts_on_failure Uploading artifacts for failed job section_end:1592104070:upload_artifacts_on_failure ERROR: Job failed: exit code 1  -- You're receiving this email because of your account on gitlab.com.
1 0
0 0
libvirt-go-xml | Pipeline #155822601 has failed for master | dd07f98a
by GitLab 13 Jun '20

13 Jun '20
Your pipeline has failed. Project: libvirt-go-xml ( https://gitlab.com/libvirt/libvirt-go-xml ) Branch: master ( https://gitlab.com/libvirt/libvirt-go-xml/-/commits/master ) Commit: dd07f98a ( https://gitlab.com/libvirt/libvirt-go-xml/-/commit/dd07f98a02788c19568e799e… ) Commit Message: Add 'downscript' for domain interfaces Signed... Commit Author: Daniel Berrange ( https://gitlab.com/berrange ) Pipeline #155822601 ( https://gitlab.com/libvirt/libvirt-go-xml/-/pipelines/155822601 ) triggered by Daniel Berrange ( https://gitlab.com/berrange ) had 5 failed builds. Job #593697220 ( https://gitlab.com/libvirt/libvirt-go-xml/-/jobs/593697220/raw ) Stage: build Name: go_1_12 Trace: Skipping Git submodules setup section_end:1592017605:get_sources section_start:1592017605:restore_cache Restoring cache section_end:1592017607:restore_cache section_start:1592017607:download_artifacts Downloading artifacts section_end:1592017608:download_artifacts section_start:1592017608:build_script Running before_script and script $ go test -timeout 10m -tags xmlroundtrip -v === RUN TestDomainSnapshot --- PASS: TestDomainSnapshot (0.00s) === RUN TestDomain --- PASS: TestDomain (0.01s) === RUN TestNetwork --- PASS: TestNetwork (0.00s) === RUN TestNodeDevice --- PASS: TestNodeDevice (0.00s) === RUN TestSecret --- PASS: TestSecret (0.00s) === RUN TestStoragePool --- PASS: TestStoragePool (0.00s) === RUN TestStorageVolume --- PASS: TestStorageVolume (0.00s) === RUN TestRoundTrip --- FAIL: TestRoundTrip (55.59s) xml_test.go:374: testdata/libvirt/tests/domaincapsdata/qemu_1.5.3-q35.x86_64.xml: /domainCapabilities[0]/cpu[0]/mode[0]/enum[0]: element in expected XML missing in actual XML FAIL exit status 1 FAIL _/builds/libvirt/libvirt-go-xml 55.605s section_end:1592017671:build_script section_start:1592017671:after_script Running after_script section_end:1592017672:after_script section_start:1592017672:upload_artifacts_on_failure Uploading artifacts for failed job section_end:1592017674:upload_artifacts_on_failure ERROR: Job failed: exit code 1  Job #593697212 ( https://gitlab.com/libvirt/libvirt-go-xml/-/jobs/593697212/raw ) Stage: build Name: go_1_11 Trace: Skipping Git submodules setup section_end:1592017603:get_sources section_start:1592017603:restore_cache Restoring cache section_end:1592017605:restore_cache section_start:1592017605:download_artifacts Downloading artifacts section_end:1592017606:download_artifacts section_start:1592017606:build_script Running before_script and script $ go test -timeout 10m -tags xmlroundtrip -v === RUN TestDomainSnapshot --- PASS: TestDomainSnapshot (0.00s) === RUN TestDomain --- PASS: TestDomain (0.01s) === RUN TestNetwork --- PASS: TestNetwork (0.00s) === RUN TestNodeDevice --- PASS: TestNodeDevice (0.00s) === RUN TestSecret --- PASS: TestSecret (0.00s) === RUN TestStoragePool --- PASS: TestStoragePool (0.00s) === RUN TestStorageVolume --- PASS: TestStorageVolume (0.00s) === RUN TestRoundTrip --- FAIL: TestRoundTrip (56.40s) xml_test.go:374: testdata/libvirt/tests/domaincapsdata/qemu_1.5.3-q35.x86_64.xml: /domainCapabilities[0]/cpu[0]/mode[0]/enum[0]: element in expected XML missing in actual XML FAIL exit status 1 FAIL _/builds/libvirt/libvirt-go-xml 56.415s section_end:1592017669:build_script section_start:1592017669:after_script Running after_script section_end:1592017671:after_script section_start:1592017671:upload_artifacts_on_failure Uploading artifacts for failed job section_end:1592017672:upload_artifacts_on_failure ERROR: Job failed: exit code 1  Job #593697222 ( https://gitlab.com/libvirt/libvirt-go-xml/-/jobs/593697222/raw ) Stage: build Name: go_1_14 Trace: Skipping Git submodules setup section_end:1592017603:get_sources section_start:1592017603:restore_cache Restoring cache section_end:1592017604:restore_cache section_start:1592017604:download_artifacts Downloading artifacts section_end:1592017606:download_artifacts section_start:1592017606:build_script Running before_script and script $ go test -timeout 10m -tags xmlroundtrip -v === RUN TestDomainSnapshot --- PASS: TestDomainSnapshot (0.00s) === RUN TestDomain --- PASS: TestDomain (0.01s) === RUN TestNetwork --- PASS: TestNetwork (0.00s) === RUN TestNodeDevice --- PASS: TestNodeDevice (0.00s) === RUN TestSecret --- PASS: TestSecret (0.00s) === RUN TestStoragePool --- PASS: TestStoragePool (0.00s) === RUN TestStorageVolume --- PASS: TestStorageVolume (0.00s) === RUN TestRoundTrip TestRoundTrip: xml_test.go:374: testdata/libvirt/tests/domaincapsdata/qemu_1.5.3-q35.x86_64.xml: /domainCapabilities[0]/cpu[0]/mode[0]/enum[0]: element in expected XML missing in actual XML --- FAIL: TestRoundTrip (55.72s) FAIL exit status 1 FAIL _/builds/libvirt/libvirt-go-xml 55.735s section_end:1592017669:build_script section_start:1592017669:after_script Running after_script section_end:1592017670:after_script section_start:1592017670:upload_artifacts_on_failure Uploading artifacts for failed job section_end:1592017672:upload_artifacts_on_failure ERROR: Job failed: exit code 1  Job #593697208 ( https://gitlab.com/libvirt/libvirt-go-xml/-/jobs/593697208/raw ) Stage: build Name: go_1_10 Trace: Skipping Git submodules setup section_end:1592017602:get_sources section_start:1592017602:restore_cache Restoring cache section_end:1592017604:restore_cache section_start:1592017604:download_artifacts Downloading artifacts section_end:1592017605:download_artifacts section_start:1592017605:build_script Running before_script and script $ go test -timeout 10m -tags xmlroundtrip -v === RUN TestDomainSnapshot --- PASS: TestDomainSnapshot (0.00s) === RUN TestDomain --- PASS: TestDomain (0.01s) === RUN TestNetwork --- PASS: TestNetwork (0.00s) === RUN TestNodeDevice --- PASS: TestNodeDevice (0.00s) === RUN TestSecret --- PASS: TestSecret (0.00s) === RUN TestStoragePool --- PASS: TestStoragePool (0.00s) === RUN TestStorageVolume --- PASS: TestStorageVolume (0.00s) === RUN TestRoundTrip --- FAIL: TestRoundTrip (56.04s) xml_test.go:374: testdata/libvirt/tests/domaincapsdata/qemu_1.5.3-q35.x86_64.xml: /domainCapabilities[0]/cpu[0]/mode[0]/enum[0]: element in expected XML missing in actual XML FAIL exit status 1 FAIL _/builds/libvirt/libvirt-go-xml 56.056s section_end:1592017666:build_script section_start:1592017666:after_script Running after_script section_end:1592017668:after_script section_start:1592017668:upload_artifacts_on_failure Uploading artifacts for failed job section_end:1592017669:upload_artifacts_on_failure ERROR: Job failed: exit code 1  Job #593697221 ( https://gitlab.com/libvirt/libvirt-go-xml/-/jobs/593697221/raw ) Stage: build Name: go_1_13 Trace: Skipping Git submodules setup section_end:1592017596:get_sources section_start:1592017596:restore_cache Restoring cache section_end:1592017598:restore_cache section_start:1592017598:download_artifacts Downloading artifacts section_end:1592017599:download_artifacts section_start:1592017599:build_script Running before_script and script $ go test -timeout 10m -tags xmlroundtrip -v === RUN TestDomainSnapshot --- PASS: TestDomainSnapshot (0.00s) === RUN TestDomain --- PASS: TestDomain (0.01s) === RUN TestNetwork --- PASS: TestNetwork (0.00s) === RUN TestNodeDevice --- PASS: TestNodeDevice (0.00s) === RUN TestSecret --- PASS: TestSecret (0.00s) === RUN TestStoragePool --- PASS: TestStoragePool (0.00s) === RUN TestStorageVolume --- PASS: TestStorageVolume (0.00s) === RUN TestRoundTrip --- FAIL: TestRoundTrip (55.61s) xml_test.go:374: testdata/libvirt/tests/domaincapsdata/qemu_1.5.3-q35.x86_64.xml: /domainCapabilities[0]/cpu[0]/mode[0]/enum[0]: element in expected XML missing in actual XML FAIL exit status 1 FAIL _/builds/libvirt/libvirt-go-xml 55.629s section_end:1592017662:build_script section_start:1592017662:after_script Running after_script section_end:1592017663:after_script section_start:1592017663:upload_artifacts_on_failure Uploading artifacts for failed job section_end:1592017665:upload_artifacts_on_failure ERROR: Job failed: exit code 1  -- You're receiving this email because of your account on gitlab.com.
1 0
0 0
libvirt-go-xml | Pipeline #155474787 has failed for master | dd07f98a
by GitLab 12 Jun '20

12 Jun '20
Your pipeline has failed. Project: libvirt-go-xml ( https://gitlab.com/libvirt/libvirt-go-xml ) Branch: master ( https://gitlab.com/libvirt/libvirt-go-xml/-/commits/master ) Commit: dd07f98a ( https://gitlab.com/libvirt/libvirt-go-xml/-/commit/dd07f98a02788c19568e799e… ) Commit Message: Add 'downscript' for domain interfaces Signed... Commit Author: Daniel Berrange ( https://gitlab.com/berrange ) Pipeline #155474787 ( https://gitlab.com/libvirt/libvirt-go-xml/-/pipelines/155474787 ) triggered by Daniel Berrange ( https://gitlab.com/berrange ) had 5 failed builds. Job #592314738 ( https://gitlab.com/libvirt/libvirt-go-xml/-/jobs/592314738/raw ) Stage: build Name: go_1_13 Trace: Skipping Git submodules setup section_end:1591931178:get_sources section_start:1591931178:restore_cache Restoring cache section_end:1591931180:restore_cache section_start:1591931180:download_artifacts Downloading artifacts section_end:1591931181:download_artifacts section_start:1591931181:build_script Running before_script and script $ go test -timeout 10m -tags xmlroundtrip -v === RUN TestDomainSnapshot --- PASS: TestDomainSnapshot (0.00s) === RUN TestDomain --- PASS: TestDomain (0.01s) === RUN TestNetwork --- PASS: TestNetwork (0.00s) === RUN TestNodeDevice --- PASS: TestNodeDevice (0.00s) === RUN TestSecret --- PASS: TestSecret (0.00s) === RUN TestStoragePool --- PASS: TestStoragePool (0.00s) === RUN TestStorageVolume --- PASS: TestStorageVolume (0.00s) === RUN TestRoundTrip --- FAIL: TestRoundTrip (53.94s) xml_test.go:374: testdata/libvirt/tests/domaincapsdata/qemu_1.5.3-q35.x86_64.xml: /domainCapabilities[0]/cpu[0]/mode[0]/enum[0]: element in expected XML missing in actual XML FAIL exit status 1 FAIL _/builds/libvirt/libvirt-go-xml 53.954s section_end:1591931243:build_script section_start:1591931243:after_script Running after_script section_end:1591931244:after_script section_start:1591931244:upload_artifacts_on_failure Uploading artifacts for failed job section_end:1591931246:upload_artifacts_on_failure ERROR: Job failed: exit code 1  Job #592314701 ( https://gitlab.com/libvirt/libvirt-go-xml/-/jobs/592314701/raw ) Stage: build Name: go_1_11 Trace: Skipping Git submodules setup section_end:1591931176:get_sources section_start:1591931176:restore_cache Restoring cache section_end:1591931177:restore_cache section_start:1591931177:download_artifacts Downloading artifacts section_end:1591931179:download_artifacts section_start:1591931179:build_script Running before_script and script $ go test -timeout 10m -tags xmlroundtrip -v === RUN TestDomainSnapshot --- PASS: TestDomainSnapshot (0.00s) === RUN TestDomain --- PASS: TestDomain (0.01s) === RUN TestNetwork --- PASS: TestNetwork (0.00s) === RUN TestNodeDevice --- PASS: TestNodeDevice (0.00s) === RUN TestSecret --- PASS: TestSecret (0.00s) === RUN TestStoragePool --- PASS: TestStoragePool (0.00s) === RUN TestStorageVolume --- PASS: TestStorageVolume (0.00s) === RUN TestRoundTrip --- FAIL: TestRoundTrip (56.73s) xml_test.go:374: testdata/libvirt/tests/domaincapsdata/qemu_1.5.3-q35.x86_64.xml: /domainCapabilities[0]/cpu[0]/mode[0]/enum[0]: element in expected XML missing in actual XML FAIL exit status 1 FAIL _/builds/libvirt/libvirt-go-xml 56.748s section_end:1591931242:build_script section_start:1591931242:after_script Running after_script section_end:1591931244:after_script section_start:1591931244:upload_artifacts_on_failure Uploading artifacts for failed job section_end:1591931245:upload_artifacts_on_failure ERROR: Job failed: exit code 1  Job #592314717 ( https://gitlab.com/libvirt/libvirt-go-xml/-/jobs/592314717/raw ) Stage: build Name: go_1_12 Trace: Skipping Git submodules setup section_end:1591931171:get_sources section_start:1591931171:restore_cache Restoring cache section_end:1591931172:restore_cache section_start:1591931172:download_artifacts Downloading artifacts section_end:1591931174:download_artifacts section_start:1591931174:build_script Running before_script and script $ go test -timeout 10m -tags xmlroundtrip -v === RUN TestDomainSnapshot --- PASS: TestDomainSnapshot (0.00s) === RUN TestDomain --- PASS: TestDomain (0.01s) === RUN TestNetwork --- PASS: TestNetwork (0.00s) === RUN TestNodeDevice --- PASS: TestNodeDevice (0.00s) === RUN TestSecret --- PASS: TestSecret (0.00s) === RUN TestStoragePool --- PASS: TestStoragePool (0.00s) === RUN TestStorageVolume --- PASS: TestStorageVolume (0.00s) === RUN TestRoundTrip --- FAIL: TestRoundTrip (58.17s) xml_test.go:374: testdata/libvirt/tests/domaincapsdata/qemu_1.5.3-q35.x86_64.xml: /domainCapabilities[0]/cpu[0]/mode[0]/enum[0]: element in expected XML missing in actual XML FAIL exit status 1 FAIL _/builds/libvirt/libvirt-go-xml 58.187s section_end:1591931239:build_script section_start:1591931239:after_script Running after_script section_end:1591931240:after_script section_start:1591931240:upload_artifacts_on_failure Uploading artifacts for failed job section_end:1591931242:upload_artifacts_on_failure ERROR: Job failed: exit code 1  Job #592314757 ( https://gitlab.com/libvirt/libvirt-go-xml/-/jobs/592314757/raw ) Stage: build Name: go_1_14 Trace: Skipping Git submodules setup section_end:1591931171:get_sources section_start:1591931171:restore_cache Restoring cache section_end:1591931173:restore_cache section_start:1591931173:download_artifacts Downloading artifacts section_end:1591931174:download_artifacts section_start:1591931174:build_script Running before_script and script $ go test -timeout 10m -tags xmlroundtrip -v === RUN TestDomainSnapshot --- PASS: TestDomainSnapshot (0.00s) === RUN TestDomain --- PASS: TestDomain (0.01s) === RUN TestNetwork --- PASS: TestNetwork (0.00s) === RUN TestNodeDevice --- PASS: TestNodeDevice (0.00s) === RUN TestSecret --- PASS: TestSecret (0.00s) === RUN TestStoragePool --- PASS: TestStoragePool (0.00s) === RUN TestStorageVolume --- PASS: TestStorageVolume (0.00s) === RUN TestRoundTrip TestRoundTrip: xml_test.go:374: testdata/libvirt/tests/domaincapsdata/qemu_1.5.3-q35.x86_64.xml: /domainCapabilities[0]/cpu[0]/mode[0]/enum[0]: element in expected XML missing in actual XML --- FAIL: TestRoundTrip (58.20s) FAIL exit status 1 FAIL _/builds/libvirt/libvirt-go-xml 58.217s section_end:1591931239:build_script section_start:1591931239:after_script Running after_script section_end:1591931240:after_script section_start:1591931240:upload_artifacts_on_failure Uploading artifacts for failed job section_end:1591931242:upload_artifacts_on_failure ERROR: Job failed: exit code 1  Job #592314688 ( https://gitlab.com/libvirt/libvirt-go-xml/-/jobs/592314688/raw ) Stage: build Name: go_1_10 Trace: Skipping Git submodules setup section_end:1591931167:get_sources section_start:1591931167:restore_cache Restoring cache section_end:1591931169:restore_cache section_start:1591931169:download_artifacts Downloading artifacts section_end:1591931170:download_artifacts section_start:1591931170:build_script Running before_script and script $ go test -timeout 10m -tags xmlroundtrip -v === RUN TestDomainSnapshot --- PASS: TestDomainSnapshot (0.00s) === RUN TestDomain --- PASS: TestDomain (0.01s) === RUN TestNetwork --- PASS: TestNetwork (0.00s) === RUN TestNodeDevice --- PASS: TestNodeDevice (0.00s) === RUN TestSecret --- PASS: TestSecret (0.00s) === RUN TestStoragePool --- PASS: TestStoragePool (0.00s) === RUN TestStorageVolume --- PASS: TestStorageVolume (0.00s) === RUN TestRoundTrip --- FAIL: TestRoundTrip (54.98s) xml_test.go:374: testdata/libvirt/tests/domaincapsdata/qemu_1.5.3-q35.x86_64.xml: /domainCapabilities[0]/cpu[0]/mode[0]/enum[0]: element in expected XML missing in actual XML FAIL exit status 1 FAIL _/builds/libvirt/libvirt-go-xml 54.998s section_end:1591931230:build_script section_start:1591931230:after_script Running after_script section_end:1591931231:after_script section_start:1591931231:upload_artifacts_on_failure Uploading artifacts for failed job section_end:1591931233:upload_artifacts_on_failure ERROR: Job failed: exit code 1  -- You're receiving this email because of your account on gitlab.com.
1 0
0 0
libvirt | Pipeline #155346486 has failed for master | 2250a0b5
by GitLab 11 Jun '20

11 Jun '20
Your pipeline has failed. Project: libvirt ( https://gitlab.com/libvirt/libvirt ) Branch: master ( https://gitlab.com/libvirt/libvirt/-/commits/master ) Commit: 2250a0b5 ( https://gitlab.com/libvirt/libvirt/-/commit/2250a0b56f12e30d67210fd49d21230… ) Commit Message: ci: Update build system integration The ci-* t... Commit Author: Andrea Bolognani ( https://gitlab.com/abologna ) Pipeline #155346486 ( https://gitlab.com/libvirt/libvirt/-/pipelines/155346486 ) triggered by Andrea Bolognani ( https://gitlab.com/abologna ) had 3 failed builds. Job #591755175 ( https://gitlab.com/libvirt/libvirt/-/jobs/591755175/raw ) Stage: containers Name: mipsel-debian-sid-container Trace: Unpacking dpkg-dev (1.19.7) ... Setting up bzip2 (1.0.8-3) ... Setting up dpkg-dev (1.19.7) ... Reading package lists... Building dependency tree... Reading state information... Some packages could not be installed. This may mean that you have requested an impossible situation or if you are using the unstable distribution that some required packages have not yet been created or been moved out of Incoming. The following information may help to resolve the situation: The following packages have unmet dependencies: libc6-dev:mipsel : Depends: linux-libc-dev:mipsel but it is not going to be installed libcurl3-gnutls:mipsel : Depends: libgnutls30:mipsel (>= 3.6.12) but it is not going to be installed libgnutls-dane0:mipsel : Depends: libgnutls30:mipsel (= 3.6.14-1) but it is not going to be installed libgnutls-openssl27:mipsel : Depends: libgnutls30:mipsel (= 3.6.14-1) but it is not going to be installed libgnutls28-dev:mipsel : Depends: libgnutls30:mipsel (= 3.6.14-1) but it is not going to be installed libgnutlsxx28:mipsel : Depends: libgnutls30:mipsel (= 3.6.14-1) but it is not going to be installed libldap-2.4-2:mipsel : Depends: libgnutls30:mipsel (>= 3.6.12) but it is not going to be installed librtmp1:mipsel : Depends: libgnutls30:mipsel (>= 3.6.6) but it is not going to be installed E: Unable to correct problems, you have held broken packages. The command '/bin/sh -c export DEBIAN_FRONTEND=noninteractive && dpkg --add-architecture mipsel && apt-get update && apt-get dist-upgrade -y && apt-get install --no-install-recommends -y dpkg-dev && apt-get install --no-install-recommends -y gcc-mipsel-linux-gnu libacl1-dev:mipsel libapparmor-dev:mipsel libattr1-dev:mipsel libaudit-dev:mipsel libavahi-client-dev:mipsel libblkid-dev:mipsel libc6-dev:mipsel libcap-ng-dev:mipsel libcurl4-gnutls-dev:mipsel libdbus-1-dev:mipsel libdevmapper-dev:mipsel libfuse-dev:mipsel libglib2.0-dev:mipsel libglusterfs-dev:mipsel libgnutls28-dev:mipsel libiscsi-dev:mipsel libncurses-dev:mipsel libnl-3-dev:mipsel libnl-route-3-dev:mipsel libnuma-dev:mipsel libparted-dev:mipsel libpcap0.8-dev:mipsel libpciaccess-dev:mipsel libreadline-dev:mipsel libsanlock-dev:mipsel libsasl2-dev:mipsel libselinux1-dev:mipsel libssh-gcrypt-dev:mipsel libssh2-1-dev:mipsel libtirpc-dev:mipsel libudev-dev:mipsel libxml2-dev:mipsel libyajl-dev:mipsel xfslibs-dev:mipsel && apt-get autoremove -y && apt-get autoclean -y' returned a non-zero code: 100 section_end:1591895428:build_script section_start:1591895428:after_script Running after_script Running after script... $ docker logout Not logged in to https://index.docker.io/v1/ section_end:1591895430:after_script section_start:1591895430:upload_artifacts_on_failure Uploading artifacts for failed job section_end:1591895431:upload_artifacts_on_failure ERROR: Job failed: exit code 100  Job #591755173 ( https://gitlab.com/libvirt/libvirt/-/jobs/591755173/raw ) Stage: containers Name: mips64el-debian-sid-container Trace: Unpacking dpkg-dev (1.19.7) ... Setting up bzip2 (1.0.8-3) ... Setting up dpkg-dev (1.19.7) ... Reading package lists... Building dependency tree... Reading state information... Some packages could not be installed. This may mean that you have requested an impossible situation or if you are using the unstable distribution that some required packages have not yet been created or been moved out of Incoming. The following information may help to resolve the situation: The following packages have unmet dependencies: libc6-dev:mips64el : Depends: linux-libc-dev:mips64el but it is not going to be installed libcurl3-gnutls:mips64el : Depends: libgnutls30:mips64el (>= 3.6.12) but it is not going to be installed libgnutls-dane0:mips64el : Depends: libgnutls30:mips64el (= 3.6.14-1) but it is not going to be installed libgnutls-openssl27:mips64el : Depends: libgnutls30:mips64el (= 3.6.14-1) but it is not going to be installed libgnutls28-dev:mips64el : Depends: libgnutls30:mips64el (= 3.6.14-1) but it is not going to be installed libgnutlsxx28:mips64el : Depends: libgnutls30:mips64el (= 3.6.14-1) but it is not going to be installed libldap-2.4-2:mips64el : Depends: libgnutls30:mips64el (>= 3.6.12) but it is not going to be installed librtmp1:mips64el : Depends: libgnutls30:mips64el (>= 3.6.6) but it is not going to be installed E: Unable to correct problems, you have held broken packages. The command '/bin/sh -c export DEBIAN_FRONTEND=noninteractive && dpkg --add-architecture mips64el && apt-get update && apt-get dist-upgrade -y && apt-get install --no-install-recommends -y dpkg-dev && apt-get install --no-install-recommends -y gcc-mips64el-linux-gnuabi64 libacl1-dev:mips64el libapparmor-dev:mips64el libattr1-dev:mips64el libaudit-dev:mips64el libavahi-client-dev:mips64el libblkid-dev:mips64el libc6-dev:mips64el libcap-ng-dev:mips64el libcurl4-gnutls-dev:mips64el libdbus-1-dev:mips64el libdevmapper-dev:mips64el libfuse-dev:mips64el libglib2.0-dev:mips64el libglusterfs-dev:mips64el libgnutls28-dev:mips64el libiscsi-dev:mips64el libncurses-dev:mips64el libnl-3-dev:mips64el libnl-route-3-dev:mips64el libnuma-dev:mips64el libparted-dev:mips64el libpcap0.8-dev:mips64el libpciaccess-dev:mips64el librbd-dev:mips64el libreadline-dev:mips64el libsanlock-dev:mips64el libsasl2-dev:mips64el libselinux1-dev:mips64el libssh-gcrypt-dev:mips64el libssh2-1-dev:mips64el libtirpc-dev:mips64el libudev-dev:mips64el libxml2-dev:mips64el libyajl-dev:mips64el xfslibs-dev:mips64el && apt-get autoremove -y && apt-get autoclean -y' returned a non-zero code: 100 section_end:1591895410:build_script section_start:1591895410:after_script Running after_script Running after script... $ docker logout Not logged in to https://index.docker.io/v1/ section_end:1591895411:after_script section_start:1591895411:upload_artifacts_on_failure Uploading artifacts for failed job section_end:1591895413:upload_artifacts_on_failure ERROR: Job failed: exit code 100  Job #591755171 ( https://gitlab.com/libvirt/libvirt/-/jobs/591755171/raw ) Stage: containers Name: mips-debian-sid-container Trace: E: Unable to locate package libiscsi-dev:mips E: Unable to locate package libncurses-dev:mips E: Unable to locate package libnl-3-dev:mips E: Unable to locate package libnl-route-3-dev:mips E: Unable to locate package libnuma-dev:mips E: Unable to locate package libparted-dev:mips E: Unable to locate package libpcap0.8-dev:mips E: Couldn't find any package by glob 'libpcap0.8-dev' E: Couldn't find any package by regex 'libpcap0.8-dev' E: Unable to locate package libpciaccess-dev:mips E: Unable to locate package librbd-dev:mips E: Unable to locate package libreadline-dev:mips E: Unable to locate package libsanlock-dev:mips E: Unable to locate package libsasl2-dev:mips E: Unable to locate package libselinux1-dev:mips E: Unable to locate package libssh-gcrypt-dev:mips E: Unable to locate package libssh2-1-dev:mips E: Unable to locate package libtirpc-dev:mips E: Unable to locate package libudev-dev:mips E: Unable to locate package libxml2-dev:mips E: Unable to locate package libyajl-dev:mips E: Unable to locate package xfslibs-dev:mips The command '/bin/sh -c export DEBIAN_FRONTEND=noninteractive && dpkg --add-architecture mips && apt-get update && apt-get dist-upgrade -y && apt-get install --no-install-recommends -y dpkg-dev && apt-get install --no-install-recommends -y gcc-mips-linux-gnu libacl1-dev:mips libapparmor-dev:mips libattr1-dev:mips libaudit-dev:mips libavahi-client-dev:mips libblkid-dev:mips libc6-dev:mips libcap-ng-dev:mips libcurl4-gnutls-dev:mips libdbus-1-dev:mips libdevmapper-dev:mips libfuse-dev:mips libglib2.0-dev:mips libglusterfs-dev:mips libgnutls28-dev:mips libiscsi-dev:mips libncurses-dev:mips libnl-3-dev:mips libnl-route-3-dev:mips libnuma-dev:mips libparted-dev:mips libpcap0.8-dev:mips libpciaccess-dev:mips librbd-dev:mips libreadline-dev:mips libsanlock-dev:mips libsasl2-dev:mips libselinux1-dev:mips libssh-gcrypt-dev:mips libssh2-1-dev:mips libtirpc-dev:mips libudev-dev:mips libxml2-dev:mips libyajl-dev:mips xfslibs-dev:mips && apt-get autoremove -y && apt-get autoclean -y' returned a non-zero code: 100 section_end:1591895404:build_script section_start:1591895404:after_script Running after_script Running after script... $ docker logout Not logged in to https://index.docker.io/v1/ section_end:1591895405:after_script section_start:1591895405:upload_artifacts_on_failure Uploading artifacts for failed job section_end:1591895407:upload_artifacts_on_failure ERROR: Job failed: exit code 100  -- You're receiving this email because of your account on gitlab.com.
1 0
0 0
Build failed in Jenkins: libvirt-go-xml-check » libvirt-fedora-rawhide #1292
by ci@centos.org 11 Jun '20

11 Jun '20
See <https://ci.centos.org/job/libvirt-go-xml-check/systems=libvirt-fedora-rawhi…> ------------------------------------------ Started by upstream project "libvirt-go-xml-check" build number 1292 originally caused by: Started by upstream project "libvirt-go-xml-build" build number 1296 originally caused by: Started by upstream project "libvirt-build" build number 1484 originally caused by: Started by an SCM change Running as SYSTEM [EnvInject] - Loading node environment variables. Building remotely on libvirt-fedora-rawhide (libvirt) in workspace <https://ci.centos.org/job/libvirt-go-xml-check/systems=libvirt-fedora-rawhi…> [libvirt-go-xml] $ /bin/sh -xe /tmp/jenkins7564867580602974053.sh + export 'TEST_ARGS=-tags xmlroundtrip' + TEST_ARGS='-tags xmlroundtrip' + go test -tags xmlroundtrip --- FAIL: TestRoundTrip (36.22s) xml_test.go:374: testdata/libvirt/tests/domaincapsdata/qemu_1.5.3-q35.x86_64.xml: /domainCapabilities[0]/cpu[0]/mode[0]/enum[0]: element in expected XML missing in actual XML FAIL exit status 1 FAIL _<https://ci.centos.org/job/libvirt-go-xml-check/systems=libvirt-fedora-rawhi…> 36.357s Build step 'Execute shell' marked build as failure
1 5
0 0
Build failed in Jenkins: libvirt-go-xml-check » libvirt-debian-9 #1292
by ci@centos.org 11 Jun '20

11 Jun '20
See <https://ci.centos.org/job/libvirt-go-xml-check/systems=libvirt-debian-9/129…> ------------------------------------------ Started by upstream project "libvirt-go-xml-check" build number 1292 originally caused by: Started by upstream project "libvirt-go-xml-build" build number 1296 originally caused by: Started by upstream project "libvirt-build" build number 1484 originally caused by: Started by an SCM change Running as SYSTEM [EnvInject] - Loading node environment variables. Building remotely on libvirt-debian-9 (libvirt) in workspace <https://ci.centos.org/job/libvirt-go-xml-check/systems=libvirt-debian-9/ws/> [libvirt-go-xml] $ /bin/sh -xe /tmp/jenkins2001615791759301941.sh + export TEST_ARGS=-tags xmlroundtrip + go test -tags xmlroundtrip --- FAIL: TestRoundTrip (54.46s) xml_test.go:374: testdata/libvirt/tests/domaincapsdata/qemu_1.5.3-q35.x86_64.xml: /domainCapabilities[0]/cpu[0]/mode[0]/enum[0]: element in expected XML missing in actual XML FAIL exit status 1 FAIL _<https://ci.centos.org/job/libvirt-go-xml-check/systems=libvirt-debian-9/ws/> 54.580s Build step 'Execute shell' marked build as failure
1 5
0 0
Build failed in Jenkins: libvirt-go-xml-check » libvirt-centos-7 #1292
by ci@centos.org 11 Jun '20

11 Jun '20
See <https://ci.centos.org/job/libvirt-go-xml-check/systems=libvirt-centos-7/129…> ------------------------------------------ Started by upstream project "libvirt-go-xml-check" build number 1292 originally caused by: Started by upstream project "libvirt-go-xml-build" build number 1296 originally caused by: Started by upstream project "libvirt-build" build number 1484 originally caused by: Started by an SCM change Running as SYSTEM [EnvInject] - Loading node environment variables. Building remotely on libvirt-centos-7 (libvirt) in workspace <https://ci.centos.org/job/libvirt-go-xml-check/systems=libvirt-centos-7/ws/> [libvirt-go-xml] $ /bin/sh -xe /tmp/jenkins698594083737447000.sh + export 'TEST_ARGS=-tags xmlroundtrip' + TEST_ARGS='-tags xmlroundtrip' + go test -tags xmlroundtrip --- FAIL: TestRoundTrip (29.46s) xml_test.go:374: testdata/libvirt/tests/domaincapsdata/qemu_1.5.3-q35.x86_64.xml: /domainCapabilities[0]/cpu[0]/mode[0]/enum[0]: element in expected XML missing in actual XML FAIL exit status 1 FAIL _<https://ci.centos.org/job/libvirt-go-xml-check/systems=libvirt-centos-7/ws/> 29.558s Build step 'Execute shell' marked build as failure
1 5
0 0
Build failed in Jenkins: libvirt-go-xml-check » libvirt-fedora-32 #1292
by ci@centos.org 11 Jun '20

11 Jun '20
See <https://ci.centos.org/job/libvirt-go-xml-check/systems=libvirt-fedora-32/12…> ------------------------------------------ Started by upstream project "libvirt-go-xml-check" build number 1292 originally caused by: Started by upstream project "libvirt-go-xml-build" build number 1296 originally caused by: Started by upstream project "libvirt-build" build number 1484 originally caused by: Started by an SCM change Running as SYSTEM [EnvInject] - Loading node environment variables. Building remotely on libvirt-fedora-32 (libvirt) in workspace <https://ci.centos.org/job/libvirt-go-xml-check/systems=libvirt-fedora-32/ws/> [libvirt-go-xml] $ /bin/sh -xe /tmp/jenkins4552122666944392347.sh + export 'TEST_ARGS=-tags xmlroundtrip' + TEST_ARGS='-tags xmlroundtrip' + go test -tags xmlroundtrip --- FAIL: TestRoundTrip (16.22s) xml_test.go:374: testdata/libvirt/tests/domaincapsdata/qemu_1.5.3-q35.x86_64.xml: /domainCapabilities[0]/cpu[0]/mode[0]/enum[0]: element in expected XML missing in actual XML FAIL exit status 1 FAIL _<https://ci.centos.org/job/libvirt-go-xml-check/systems=libvirt-fedora-32/ws/> 16.350s Build step 'Execute shell' marked build as failure
1 5
0 0
  • ← Newer
  • 1
  • 2
  • 3
  • 4
  • 5
  • 6
  • 7
  • 8
  • Older →

HyperKitty Powered by HyperKitty version 1.3.12.