libvirt List Archives
Sign In Sign Up
Manage this list Sign In Sign Up

Keyboard Shortcuts

Thread View

  • j: Next unread message
  • k: Previous unread message
  • j a: Jump to all threads
  • j l: Jump to MailingList overview

CI

Thread Start a new thread
Download
Threads by month
  • ----- 2025 -----
  • August
  • July
  • June
  • May
  • April
  • March
  • February
  • January
  • ----- 2024 -----
  • December
  • November
  • October
  • September
  • August
  • July
  • June
  • May
  • April
  • March
  • February
  • January
  • ----- 2023 -----
  • December
  • November
  • October
  • September
  • August
  • July
  • June
  • May
  • April
  • March
  • February
  • January
  • ----- 2022 -----
  • December
  • November
  • October
  • September
  • August
  • July
  • June
  • May
  • April
  • March
  • February
  • January
  • ----- 2021 -----
  • December
  • November
  • October
  • September
  • August
  • July
  • June
  • May
  • April
  • March
  • February
  • January
  • ----- 2020 -----
  • December
  • November
  • October
  • September
  • August
  • July
  • June
  • May
  • April
  • March
  • February
  • January
  • ----- 2019 -----
  • December
  • November
  • October
  • September
  • August
  • July
  • June
  • May
  • April
  • March
  • February
  • January
  • ----- 2018 -----
  • December
  • November
  • October
  • September
  • August
  • July
  • June
  • May
  • April
  • March
  • February
  • January
  • ----- 2017 -----
  • December
  • November
  • October
  • September
  • August
  • July
  • June
  • May
  • April
  • March
  • February
  • January
  • ----- 2016 -----
  • December
  • November
  • October
  • September
  • August
  • July
ci@lists.libvirt.org

May 2020

  • 3 participants
  • 80 discussions
Build failed in Jenkins: libvirt-check » libvirt-freebsd-11 #1170
by ci@centos.org 19 May '20

19 May '20
See <https://ci.centos.org/job/libvirt-check/systems=libvirt-freebsd-11/1170/dis…> ------------------------------------------ Started by upstream project "libvirt-check" build number 1170 originally caused by: Started by upstream project "libvirt-syntax-check" build number 1189 originally caused by: Started by upstream project "libvirt-build" build number 1436 originally caused by: Started by an SCM change Running as SYSTEM [EnvInject] - Loading node environment variables. Building remotely on libvirt-freebsd-11 (libvirt) in workspace <https://ci.centos.org/job/libvirt-check/systems=libvirt-freebsd-11/ws/> [libvirt] $ /bin/sh -xe /tmp/jenkins15962956751955162275.sh + uname + [ FreeBSD '!=' FreeBSD ] + export 'VIR_TEST_DEBUG=2' + cd build + /usr/local/bin/gmake check /usr/local/bin/gmake check-recursive gmake[1]: Entering directory '/usr<https://ci.centos.org/job/libvirt-check/systems=libvirt-freebsd-11/ws/build'> Making check in . gmake[2]: Entering directory '/usr<https://ci.centos.org/job/libvirt-check/systems=libvirt-freebsd-11/ws/build'> /usr/local/bin/gmake check-local gmake[3]: Entering directory '/usr<https://ci.centos.org/job/libvirt-check/systems=libvirt-freebsd-11/ws/build'> /usr/local/bin/gmake all-recursive gmake[4]: Entering directory '/usr<https://ci.centos.org/job/libvirt-check/systems=libvirt-freebsd-11/ws/build'> Making all in . gmake[5]: Entering directory '/usr<https://ci.centos.org/job/libvirt-check/systems=libvirt-freebsd-11/ws/build'> gmake[5]: Leaving directory '/usr<https://ci.centos.org/job/libvirt-check/systems=libvirt-freebsd-11/ws/build'> Making all in include/libvirt gmake[5]: Entering directory '/usr<https://ci.centos.org/job/libvirt-check/systems=libvirt-freebsd-11/ws/build…'> gmake[5]: Nothing to be done for 'all'. gmake[5]: Leaving directory '/usr<https://ci.centos.org/job/libvirt-check/systems=libvirt-freebsd-11/ws/build…'> Making all in src gmake[5]: Entering directory '/usr<https://ci.centos.org/job/libvirt-check/systems=libvirt-freebsd-11/ws/build…'> /usr/local/bin/gmake all-am gmake[6]: Entering directory '/usr<https://ci.centos.org/job/libvirt-check/systems=libvirt-freebsd-11/ws/build…'> gmake[6]: Nothing to be done for 'all-am'. gmake[6]: Leaving directory '/usr<https://ci.centos.org/job/libvirt-check/systems=libvirt-freebsd-11/ws/build…'> gmake[5]: Leaving directory '/usr<https://ci.centos.org/job/libvirt-check/systems=libvirt-freebsd-11/ws/build…'> Making all in tools gmake[5]: Entering directory '/usr<https://ci.centos.org/job/libvirt-check/systems=libvirt-freebsd-11/ws/build…'> /usr/local/bin/gmake all-am gmake[6]: Entering directory '/usr<https://ci.centos.org/job/libvirt-check/systems=libvirt-freebsd-11/ws/build…'> gmake[6]: Nothing to be done for 'all-am'. gmake[6]: Leaving directory '/usr<https://ci.centos.org/job/libvirt-check/systems=libvirt-freebsd-11/ws/build…'> gmake[5]: Leaving directory '/usr<https://ci.centos.org/job/libvirt-check/systems=libvirt-freebsd-11/ws/build…'> Making all in docs gmake[5]: Entering directory '/usr<https://ci.centos.org/job/libvirt-check/systems=libvirt-freebsd-11/ws/build…'> gmake[5]: Leaving directory '/usr<https://ci.centos.org/job/libvirt-check/systems=libvirt-freebsd-11/ws/build…'> Making all in tests gmake[5]: Entering directory '/usr<https://ci.centos.org/job/libvirt-check/systems=libvirt-freebsd-11/ws/build…'> gmake[5]: Nothing to be done for 'all'. gmake[5]: Leaving directory '/usr<https://ci.centos.org/job/libvirt-check/systems=libvirt-freebsd-11/ws/build…'> Making all in po gmake[5]: Entering directory '/usr<https://ci.centos.org/job/libvirt-check/systems=libvirt-freebsd-11/ws/build…'> cat: POTFILES: No such file or directory gmake[5]: Nothing to be done for 'all'. gmake[5]: Leaving directory '/usr<https://ci.centos.org/job/libvirt-check/systems=libvirt-freebsd-11/ws/build…'> Making all in examples gmake[5]: Entering directory '/usr<https://ci.centos.org/job/libvirt-check/systems=libvirt-freebsd-11/ws/build…'> gmake[5]: Nothing to be done for 'all'. gmake[5]: Leaving directory '/usr<https://ci.centos.org/job/libvirt-check/systems=libvirt-freebsd-11/ws/build…'> gmake[4]: Leaving directory '/usr<https://ci.centos.org/job/libvirt-check/systems=libvirt-freebsd-11/ws/build'> gmake[3]: Leaving directory '/usr<https://ci.centos.org/job/libvirt-check/systems=libvirt-freebsd-11/ws/build'> gmake[2]: Leaving directory '/usr<https://ci.centos.org/job/libvirt-check/systems=libvirt-freebsd-11/ws/build'> Making check in include/libvirt gmake[2]: Entering directory '/usr<https://ci.centos.org/job/libvirt-check/systems=libvirt-freebsd-11/ws/build…'> gmake[2]: Nothing to be done for 'check'. gmake[2]: Leaving directory '/usr<https://ci.centos.org/job/libvirt-check/systems=libvirt-freebsd-11/ws/build…'> Making check in src gmake[2]: Entering directory '/usr<https://ci.centos.org/job/libvirt-check/systems=libvirt-freebsd-11/ws/build…'> /usr/local/bin/gmake check-am gmake[3]: Entering directory '/usr<https://ci.centos.org/job/libvirt-check/systems=libvirt-freebsd-11/ws/build…'> /usr/local/bin/gmake check-local gmake[4]: Entering directory '/usr<https://ci.centos.org/job/libvirt-check/systems=libvirt-freebsd-11/ws/build…'> GEN ../../src/remote_protocol-struct GEN ../../src/lxc_protocol-struct GEN ../../src/qemu_protocol-struct WARNING: skipping pdwtags test with Clang GEN ../../src/virnetprotocol-struct WARNING: skipping pdwtags test with Clang GEN ../../src/virkeepaliveprotocol-struct WARNING: skipping pdwtags test with Clang GEN ../../src/lock_protocol-struct WARNING: skipping pdwtags test with Clang GEN ../../src/admin_protocol-struct WARNING: skipping pdwtags test with Clang GEN check-symsorting WARNING: skipping pdwtags test with Clang WARNING: skipping pdwtags test with Clang GEN check-drivername GEN check-driverimpls GEN check-aclrules GEN check-aclperms GEN check-admin-symsorting GEN check-admin-drivername GEN check-augeas Syntax error in lens definition Failed to load qemu/test_libvirtd_qemu.aug qemu/test_libvirtd_qemu.aug:96.3-203.1:exception thrown in test qemu/test_libvirtd_qemu.aug:96.8-.34:exception: Iterated lens matched less than it should Lens: ../../src/qemu/libvirtd_qemu.aug:170.13-.43: Last match: ../../src/qemu/libvirtd_qemu.aug:18.52-.113: Not matching: ../../src/qemu/libvirtd_qemu.aug:12.19-.31: Error encountered at 48:27 (1615 characters into string) <\n "/dev/ptmx", "/dev/kvm"|=|,\n]\nsave_image_format = "raw> Tree generated so far: /default_tls_x509_cert_dir = "/etc/pki/qemu" /default_tls_x509_verify = "1" /default_tls_x509_secret_uuid = "00000000-0000-0000-0000-000000000000" /vnc_listen = "0.0.0.0" /vnc_auto_unix_socket = "1" /vnc_tls = "1" /vnc_tls_x509_cert_dir = "/etc/pki/libvirt-vnc" /vnc_tls_x509_secret_uuid = "00000000-0000-0000-0000-000000000000" /vnc_tls_x509_verify = "1" /vnc_password = "XYZ12345" /vnc_sasl = "1" /vnc_sasl_dir = "/some/directory/sasl2" /vnc_allow_host_audio = "0" /spice_listen = "0.0.0.0" /spice_tls = "1" /spice_tls_x509_cert_dir = "/etc/pki/libvirt-spice" /spice_auto_unix_socket = "1" /spice_password = "XYZ12345" /spice_sasl = "1" /spice_sasl_dir = "/some/directory/sasl2" /chardev_tls = "1" /chardev_tls_x509_cert_dir = "/etc/pki/libvirt-chardev" /chardev_tls_x509_verify = "1" /chardev_tls_x509_secret_uuid = "00000000-0000-0000-0000-000000000000" /vxhs_tls = "1" /vxhs_tls_x509_cert_dir = "/etc/pki/libvirt-vxhs" /nbd_tls = "1" /nbd_tls_x509_cert_dir = "/etc/pki/libvirt-nbd" /migrate_tls_x509_cert_dir = "/etc/pki/libvirt-migrate" /migrate_tls_x509_verify = "1" /migrate_tls_x509_secret_uuid = "00000000-0000-0000-0000-000000000000" /nographics_allow_host_audio = "1" /remote_display_port_min = "5900" /remote_display_port_max = "65535" /remote_websocket_port_min = "5700" /remote_websocket_port_max = "65535" /security_driver = "selinux" /security_default_confined = "1" /security_require_confined = "1" /user = "root" /group = "root" /dynamic_ownership = "1" /remember_owner = "1" /cgroup_controllers /cgroup_controllers/1 = "cpu" /cgroup_controllers/2 = "devices" /cgroup_controllers/3 = "memory" /cgroup_controllers/4 = "blkio" /cgroup_controllers/5 = "cpuset" /cgroup_controllers/6 = "cpuacct" gmake[4]: *** [Makefile:14849: check-augeas] Error 1 gmake[4]: *** Waiting for unfinished jobs.... gmake[4]: Leaving directory '/usr<https://ci.centos.org/job/libvirt-check/systems=libvirt-freebsd-11/ws/build…'> gmake[3]: *** [Makefile:12731: check-am] Error 2 gmake[3]: Leaving directory '/usr<https://ci.centos.org/job/libvirt-check/systems=libvirt-freebsd-11/ws/build…'> gmake[2]: *** [Makefile:12733: check] Error 2 gmake[2]: Leaving directory '/usr<https://ci.centos.org/job/libvirt-check/systems=libvirt-freebsd-11/ws/build…'> gmake[1]: *** [Makefile:777: check-recursive] Error 1 gmake[1]: Leaving directory '/usr<https://ci.centos.org/job/libvirt-check/systems=libvirt-freebsd-11/ws/build'> gmake: *** [Makefile:1072: check] Error 2 + find -name test-suite.log + xargs cat find: illegal option -- n usage: find [-H | -L | -P] [-EXdsx] [-f path] path ... [expression] find [-H | -L | -P] [-EXdsx] -f path [path ...] [expression] + exit 1 Build step 'Execute shell' marked build as failure
1 1
0 0
Build failed in Jenkins: libvirt-check » libvirt-debian-10 #1170
by ci@centos.org 19 May '20

19 May '20
See <https://ci.centos.org/job/libvirt-check/systems=libvirt-debian-10/1170/disp…> ------------------------------------------ Started by upstream project "libvirt-check" build number 1170 originally caused by: Started by upstream project "libvirt-syntax-check" build number 1189 originally caused by: Started by upstream project "libvirt-build" build number 1436 originally caused by: Started by an SCM change Running as SYSTEM [EnvInject] - Loading node environment variables. Building remotely on libvirt-debian-10 (libvirt) in workspace <https://ci.centos.org/job/libvirt-check/systems=libvirt-debian-10/ws/> [libvirt] $ /bin/sh -xe /tmp/jenkins1034816252886715408.sh + uname + [ Linux != FreeBSD ] + export VIR_TEST_EXPENSIVE=1 + export VIR_TEST_DEBUG=2 + cd build + /usr/bin/make check /usr/bin/make check-recursive make[1]: Entering directory '<https://ci.centos.org/job/libvirt-check/systems=libvirt-debian-10/ws/build'> Making check in . make[2]: Entering directory '<https://ci.centos.org/job/libvirt-check/systems=libvirt-debian-10/ws/build'> /usr/bin/make check-local make[3]: Entering directory '<https://ci.centos.org/job/libvirt-check/systems=libvirt-debian-10/ws/build'> /usr/bin/make all-recursive make[4]: Entering directory '<https://ci.centos.org/job/libvirt-check/systems=libvirt-debian-10/ws/build'> Making all in . make[5]: Entering directory '<https://ci.centos.org/job/libvirt-check/systems=libvirt-debian-10/ws/build'> make[5]: Nothing to be done for 'all-am'. make[5]: Leaving directory '<https://ci.centos.org/job/libvirt-check/systems=libvirt-debian-10/ws/build'> Making all in include/libvirt make[5]: Entering directory '<https://ci.centos.org/job/libvirt-check/systems=libvirt-debian-10/ws/build/…'> make[5]: Nothing to be done for 'all'. make[5]: Leaving directory '<https://ci.centos.org/job/libvirt-check/systems=libvirt-debian-10/ws/build/…'> Making all in src make[5]: Entering directory '<https://ci.centos.org/job/libvirt-check/systems=libvirt-debian-10/ws/build/…'> /usr/bin/make all-am make[6]: Entering directory '<https://ci.centos.org/job/libvirt-check/systems=libvirt-debian-10/ws/build/…'> make[6]: Nothing to be done for 'all-am'. make[6]: Leaving directory '<https://ci.centos.org/job/libvirt-check/systems=libvirt-debian-10/ws/build/…'> make[5]: Leaving directory '<https://ci.centos.org/job/libvirt-check/systems=libvirt-debian-10/ws/build/…'> Making all in tools make[5]: Entering directory '<https://ci.centos.org/job/libvirt-check/systems=libvirt-debian-10/ws/build/…'> /usr/bin/make all-am make[6]: Entering directory '<https://ci.centos.org/job/libvirt-check/systems=libvirt-debian-10/ws/build/…'> make[6]: Nothing to be done for 'all-am'. make[6]: Leaving directory '<https://ci.centos.org/job/libvirt-check/systems=libvirt-debian-10/ws/build/…'> make[5]: Leaving directory '<https://ci.centos.org/job/libvirt-check/systems=libvirt-debian-10/ws/build/…'> Making all in docs make[5]: Entering directory '<https://ci.centos.org/job/libvirt-check/systems=libvirt-debian-10/ws/build/…'> make[5]: Leaving directory '<https://ci.centos.org/job/libvirt-check/systems=libvirt-debian-10/ws/build/…'> Making all in tests make[5]: Entering directory '<https://ci.centos.org/job/libvirt-check/systems=libvirt-debian-10/ws/build/…'> make[5]: Nothing to be done for 'all'. make[5]: Leaving directory '<https://ci.centos.org/job/libvirt-check/systems=libvirt-debian-10/ws/build/…'> Making all in po make[5]: Entering directory '<https://ci.centos.org/job/libvirt-check/systems=libvirt-debian-10/ws/build/…'> make[5]: Nothing to be done for 'all'. make[5]: Leaving directory '<https://ci.centos.org/job/libvirt-check/systems=libvirt-debian-10/ws/build/…'> Making all in examples make[5]: Entering directory '<https://ci.centos.org/job/libvirt-check/systems=libvirt-debian-10/ws/build/…'> make[5]: Nothing to be done for 'all'. make[5]: Leaving directory '<https://ci.centos.org/job/libvirt-check/systems=libvirt-debian-10/ws/build/…'> make[4]: Leaving directory '<https://ci.centos.org/job/libvirt-check/systems=libvirt-debian-10/ws/build'> make[3]: Leaving directory '<https://ci.centos.org/job/libvirt-check/systems=libvirt-debian-10/ws/build'> make[2]: Leaving directory '<https://ci.centos.org/job/libvirt-check/systems=libvirt-debian-10/ws/build'> Making check in include/libvirt make[2]: Entering directory '<https://ci.centos.org/job/libvirt-check/systems=libvirt-debian-10/ws/build/…'> make[2]: Nothing to be done for 'check'. make[2]: Leaving directory '<https://ci.centos.org/job/libvirt-check/systems=libvirt-debian-10/ws/build/…'> Making check in src make[2]: Entering directory '<https://ci.centos.org/job/libvirt-check/systems=libvirt-debian-10/ws/build/…'> /usr/bin/make check-am make[3]: Entering directory '<https://ci.centos.org/job/libvirt-check/systems=libvirt-debian-10/ws/build/…'> /usr/bin/make check-local make[4]: Entering directory '<https://ci.centos.org/job/libvirt-check/systems=libvirt-debian-10/ws/build/…'> GEN ../../src/remote_protocol-struct GEN ../../src/lxc_protocol-struct GEN ../../src/qemu_protocol-struct WARNING: exit code -11, pdwtags appears broken: WARNING: WARNING: skipping the remote protocol test GEN ../../src/virnetprotocol-struct WARNING: exit code -11, pdwtags appears broken: WARNING: WARNING: skipping the remote protocol test GEN ../../src/virkeepaliveprotocol-struct WARNING: exit code -11, pdwtags appears broken: WARNING: WARNING: skipping the remote protocol test WARNING: exit code -11, pdwtags appears broken: WARNING: WARNING: skipping the remote protocol test WARNING: exit code -11, pdwtags appears broken: WARNING: WARNING: skipping the remote protocol test GEN ../../src/lxc_monitor_protocol-struct GEN ../../src/lock_protocol-struct GEN ../../src/admin_protocol-struct WARNING: exit code -11, pdwtags appears broken: WARNING: WARNING: skipping the remote protocol test WARNING: exit code -11, pdwtags appears broken: WARNING: WARNING: skipping the remote protocol test WARNING: exit code -11, pdwtags appears broken: WARNING: WARNING: skipping the remote protocol test GEN check-symfile GEN check-symsorting GEN check-drivername GEN check-driverimpls GEN check-aclrules GEN check-aclperms GEN check-admin-symfile GEN check-admin-symsorting GEN check-admin-drivername GEN check-augeas Syntax error in lens definition Failed to load qemu/test_libvirtd_qemu.aug qemu/test_libvirtd_qemu.aug:96.3-203.1:exception thrown in test qemu/test_libvirtd_qemu.aug:96.8-.34:exception: Iterated lens matched less than it should Lens: ../../src/qemu/libvirtd_qemu.aug:170.13-.43: Last match: ../../src/qemu/libvirtd_qemu.aug:18.52-.113: Not matching: ../../src/qemu/libvirtd_qemu.aug:12.19-.31: Error encountered at 48:27 (1615 characters into string) <\n "/dev/ptmx", "/dev/kvm"|=|,\n]\nsave_image_format = "raw> Tree generated so far: /default_tls_x509_cert_dir = "/etc/pki/qemu" /default_tls_x509_verify = "1" /default_tls_x509_secret_uuid = "00000000-0000-0000-0000-000000000000" /vnc_listen = "0.0.0.0" /vnc_auto_unix_socket = "1" /vnc_tls = "1" /vnc_tls_x509_cert_dir = "/etc/pki/libvirt-vnc" /vnc_tls_x509_secret_uuid = "00000000-0000-0000-0000-000000000000" /vnc_tls_x509_verify = "1" /vnc_password = "XYZ12345" /vnc_sasl = "1" /vnc_sasl_dir = "/some/directory/sasl2" /vnc_allow_host_audio = "0" /spice_listen = "0.0.0.0" /spice_tls = "1" /spice_tls_x509_cert_dir = "/etc/pki/libvirt-spice" /spice_auto_unix_socket = "1" /spice_password = "XYZ12345" /spice_sasl = "1" /spice_sasl_dir = "/some/directory/sasl2" /chardev_tls = "1" /chardev_tls_x509_cert_dir = "/etc/pki/libvirt-chardev" /chardev_tls_x509_verify = "1" /chardev_tls_x509_secret_uuid = "00000000-0000-0000-0000-000000000000" /vxhs_tls = "1" /vxhs_tls_x509_cert_dir = "/etc/pki/libvirt-vxhs" /nbd_tls = "1" /nbd_tls_x509_cert_dir = "/etc/pki/libvirt-nbd" /migrate_tls_x509_cert_dir = "/etc/pki/libvirt-migrate" /migrate_tls_x509_verify = "1" /migrate_tls_x509_secret_uuid = "00000000-0000-0000-0000-000000000000" /nographics_allow_host_audio = "1" /remote_display_port_min = "5900" /remote_display_port_max = "65535" /remote_websocket_port_min = "5700" /remote_websocket_port_max = "65535" /security_driver = "selinux" /security_default_confined = "1" /security_require_confined = "1" /user = "root" /group = "root" /dynamic_ownership = "1" /remember_owner = "1" /cgroup_controllers /cgroup_controllers/1 = "cpu" /cgroup_controllers/2 = "devices" /cgroup_controllers/3 = "memory" /cgroup_controllers/4 = "blkio" /cgroup_controllers/5 = "cpuset" /cgroup_controllers/6 = "cpuacct" make[4]: *** [Makefile:14849: check-augeas] Error 1 make[4]: *** Waiting for unfinished jobs.... make[4]: Leaving directory '<https://ci.centos.org/job/libvirt-check/systems=libvirt-debian-10/ws/build/…'> make[3]: *** [Makefile:12731: check-am] Error 2 make[3]: Leaving directory '<https://ci.centos.org/job/libvirt-check/systems=libvirt-debian-10/ws/build/…'> make[2]: *** [Makefile:12733: check] Error 2 make[2]: Leaving directory '<https://ci.centos.org/job/libvirt-check/systems=libvirt-debian-10/ws/build/…'> make[1]: *** [Makefile:777: check-recursive] Error 1 make[1]: Leaving directory '<https://ci.centos.org/job/libvirt-check/systems=libvirt-debian-10/ws/build'> make: *** [Makefile:1072: check] Error 2 + find -name test-suite.log + xargs cat + exit 1 Build step 'Execute shell' marked build as failure
1 1
0 0
libvirt | Pipeline #147469983 has failed for master | 6866a324
by GitLab 19 May '20

19 May '20
Your pipeline has failed. Project: libvirt ( https://gitlab.com/libvirt/libvirt ) Branch: master ( https://gitlab.com/libvirt/libvirt/-/commits/master ) Commit: 6866a324 ( https://gitlab.com/libvirt/libvirt/-/commit/6866a324abe2b27010f2085afd2353e… ) Commit Message: README.rst: Replace the installation instructio... Commit Author: Liao Pingfang Committed by: Michal Privoznik Pipeline #147469983 ( https://gitlab.com/libvirt/libvirt/pipelines/147469983 ) triggered by Michal Prívozník ( https://gitlab.com/MichalPrivoznik ) had 3 failed builds. Job #558594569 ( https://gitlab.com/libvirt/libvirt/-/jobs/558594569/raw ) Stage: prebuild Name: codestyle Trace: Running with gitlab-runner 13.0.0-rc2 (926834bc)  on docker-auto-scale 72989761 section_start:1589881829:prepare_executor Preparing the "docker+machine" executor Using Docker executor with image quay.io/libvirt/buildenv-libvirt-centos-8:latest ... Pulling docker image quay.io/libvirt/buildenv-libvirt-centos-8:latest ... ERROR: Preparation failed: Error response from daemon: received unexpected HTTP status: 502 Bad Gateway (docker.go:198:0s) Will be retried in 3s ... Using Docker executor with image quay.io/libvirt/buildenv-libvirt-centos-8:latest ... Pulling docker image quay.io/libvirt/buildenv-libvirt-centos-8:latest ... ERROR: Preparation failed: Error: No such image: quay.io/libvirt/buildenv-libvirt-centos-8:latest (docker.go:205:0s) Will be retried in 3s ... Using Docker executor with image quay.io/libvirt/buildenv-libvirt-centos-8:latest ... Pulling docker image quay.io/libvirt/buildenv-libvirt-centos-8:latest ... ERROR: Preparation failed: Error response from daemon: received unexpected HTTP status: 502 Bad Gateway (docker.go:198:0s) Will be retried in 3s ... section_end:1589881926:prepare_executor ERROR: Job failed (system failure): Error response from daemon: received unexpected HTTP status: 502 Bad Gateway (docker.go:198:0s)  Job #558594571 ( https://gitlab.com/libvirt/libvirt/-/jobs/558594571/raw ) Stage: prebuild Name: potfile Trace: Running with gitlab-runner 13.0.0-rc2 (926834bc)  on docker-auto-scale fa6cab46 section_start:1589881829:prepare_executor Preparing the "docker+machine" executor Using Docker executor with image quay.io/libvirt/buildenv-libvirt-centos-8:latest ... Pulling docker image quay.io/libvirt/buildenv-libvirt-centos-8:latest ... ERROR: Preparation failed: Error response from daemon: received unexpected HTTP status: 502 Bad Gateway (docker.go:198:1s) Will be retried in 3s ... Using Docker executor with image quay.io/libvirt/buildenv-libvirt-centos-8:latest ... Pulling docker image quay.io/libvirt/buildenv-libvirt-centos-8:latest ... ERROR: Preparation failed: Error response from daemon: received unexpected HTTP status: 502 Bad Gateway (docker.go:198:5s) Will be retried in 3s ... Using Docker executor with image quay.io/libvirt/buildenv-libvirt-centos-8:latest ... Pulling docker image quay.io/libvirt/buildenv-libvirt-centos-8:latest ... ERROR: Preparation failed: Error response from daemon: received unexpected HTTP status: 502 Bad Gateway (docker.go:198:0s) Will be retried in 3s ... section_end:1589881884:prepare_executor ERROR: Job failed (system failure): Error response from daemon: received unexpected HTTP status: 502 Bad Gateway (docker.go:198:0s)  Job #558594565 ( https://gitlab.com/libvirt/libvirt/-/jobs/558594565/raw ) Stage: prebuild Name: website Trace: Running with gitlab-runner 13.0.0-rc2 (926834bc)  on docker-auto-scale ed2dce3a section_start:1589881829:prepare_executor Preparing the "docker+machine" executor Using Docker executor with image quay.io/libvirt/buildenv-libvirt-centos-8:latest ... Pulling docker image quay.io/libvirt/buildenv-libvirt-centos-8:latest ... ERROR: Preparation failed: Error response from daemon: Get https://quay.io/v2/libvirt/buildenv-libvirt-centos-8/manifests/latest: received unexpected HTTP status: 502 Bad Gateway (docker.go:198:0s) Will be retried in 3s ... Using Docker executor with image quay.io/libvirt/buildenv-libvirt-centos-8:latest ... Pulling docker image quay.io/libvirt/buildenv-libvirt-centos-8:latest ... ERROR: Preparation failed: Error: No such image: quay.io/libvirt/buildenv-libvirt-centos-8:latest (docker.go:205:0s) Will be retried in 3s ... Using Docker executor with image quay.io/libvirt/buildenv-libvirt-centos-8:latest ... Pulling docker image quay.io/libvirt/buildenv-libvirt-centos-8:latest ... ERROR: Preparation failed: Error response from daemon: received unexpected HTTP status: 502 Bad Gateway (docker.go:198:0s) Will be retried in 3s ... section_end:1589881881:prepare_executor ERROR: Job failed (system failure): Error response from daemon: received unexpected HTTP status: 502 Bad Gateway (docker.go:198:0s)  -- You're receiving this email because of your account on gitlab.com.
1 0
0 0
libvirt | Pipeline #147447456 has failed for master | be611aa4
by GitLab 19 May '20

19 May '20
Your pipeline has failed. Project: libvirt ( https://gitlab.com/libvirt/libvirt ) Branch: master ( https://gitlab.com/libvirt/libvirt/-/commits/master ) Commit: be611aa4 ( https://gitlab.com/libvirt/libvirt/-/commit/be611aa4de66abaeec4c78e4b8658ba… ) Commit Message: qemu: conf: fix stray comma The qemu.conf chan... Commit Author: Jano Tomko ( https://gitlab.com/jano.tomko ) Pipeline #147447456 ( https://gitlab.com/libvirt/libvirt/pipelines/147447456 ) triggered by Jano Tomko ( https://gitlab.com/jano.tomko ) had 3 failed builds. Job #558483567 ( https://gitlab.com/libvirt/libvirt/-/jobs/558483567/raw ) Stage: prebuild Name: codestyle Trace: Running with gitlab-runner 13.0.0-rc2 (926834bc)  on docker-auto-scale ed2dce3a section_start:1589878822:prepare_executor Preparing the "docker+machine" executor Using Docker executor with image quay.io/libvirt/buildenv-libvirt-centos-8:latest ... Pulling docker image quay.io/libvirt/buildenv-libvirt-centos-8:latest ... ERROR: Preparation failed: Error response from daemon: received unexpected HTTP status: 502 Bad Gateway (docker.go:198:3s) Will be retried in 3s ... Using Docker executor with image quay.io/libvirt/buildenv-libvirt-centos-8:latest ... Pulling docker image quay.io/libvirt/buildenv-libvirt-centos-8:latest ... ERROR: Preparation failed: Error response from daemon: Get https://quay.io/v2/: EOF (docker.go:198:0s) Will be retried in 3s ... Using Docker executor with image quay.io/libvirt/buildenv-libvirt-centos-8:latest ... Pulling docker image quay.io/libvirt/buildenv-libvirt-centos-8:latest ... ERROR: Preparation failed: Error response from daemon: Get https://quay.io/v2/: EOF (docker.go:198:0s) Will be retried in 3s ... section_end:1589878921:prepare_executor ERROR: Job failed (system failure): Error response from daemon: Get https://quay.io/v2/: EOF (docker.go:198:0s)  Job #558483565 ( https://gitlab.com/libvirt/libvirt/-/jobs/558483565/raw ) Stage: prebuild Name: website Trace: Running with gitlab-runner 13.0.0-rc2 (926834bc)  on docker-auto-scale ed2dce3a section_start:1589878822:prepare_executor Preparing the "docker+machine" executor Using Docker executor with image quay.io/libvirt/buildenv-libvirt-centos-8:latest ... Pulling docker image quay.io/libvirt/buildenv-libvirt-centos-8:latest ... ERROR: Preparation failed: Error response from daemon: received unexpected HTTP status: 502 Bad Gateway (docker.go:198:3s) Will be retried in 3s ... Using Docker executor with image quay.io/libvirt/buildenv-libvirt-centos-8:latest ... Pulling docker image quay.io/libvirt/buildenv-libvirt-centos-8:latest ... ERROR: Preparation failed: Error response from daemon: Get https://quay.io/v2/: EOF (docker.go:198:0s) Will be retried in 3s ... Using Docker executor with image quay.io/libvirt/buildenv-libvirt-centos-8:latest ... Pulling docker image quay.io/libvirt/buildenv-libvirt-centos-8:latest ... ERROR: Preparation failed: Error response from daemon: Get https://quay.io/v2/: EOF (docker.go:198:0s) Will be retried in 3s ... section_end:1589878916:prepare_executor ERROR: Job failed (system failure): Error response from daemon: Get https://quay.io/v2/: EOF (docker.go:198:0s)  Job #558483569 ( https://gitlab.com/libvirt/libvirt/-/jobs/558483569/raw ) Stage: prebuild Name: potfile Trace: Running with gitlab-runner 13.0.0-rc2 (926834bc)  on docker-auto-scale fa6cab46 section_start:1589878822:prepare_executor Preparing the "docker+machine" executor Using Docker executor with image quay.io/libvirt/buildenv-libvirt-centos-8:latest ... Pulling docker image quay.io/libvirt/buildenv-libvirt-centos-8:latest ... ERROR: Preparation failed: Error response from daemon: Get https://quay.io/v2/: EOF (docker.go:198:0s) Will be retried in 3s ... Using Docker executor with image quay.io/libvirt/buildenv-libvirt-centos-8:latest ... Pulling docker image quay.io/libvirt/buildenv-libvirt-centos-8:latest ... ERROR: Preparation failed: Error response from daemon: Get https://quay.io/v2/: EOF (docker.go:198:0s) Will be retried in 3s ... Using Docker executor with image quay.io/libvirt/buildenv-libvirt-centos-8:latest ... Pulling docker image quay.io/libvirt/buildenv-libvirt-centos-8:latest ... ERROR: Preparation failed: Error response from daemon: Get https://quay.io/v2/: EOF (docker.go:198:0s) Will be retried in 3s ... section_end:1589878870:prepare_executor ERROR: Job failed (system failure): Error response from daemon: Get https://quay.io/v2/: EOF (docker.go:198:0s)  -- You're receiving this email because of your account on gitlab.com.
1 0
0 0
libvirt | Pipeline #147429730 has failed for master | ab5ba570
by GitLab 19 May '20

19 May '20
Your pipeline has failed. Project: libvirt ( https://gitlab.com/libvirt/libvirt ) Branch: master ( https://gitlab.com/libvirt/libvirt/-/commits/master ) Commit: ab5ba570 ( https://gitlab.com/libvirt/libvirt/-/commit/ab5ba57012e9e6ab4f55afdeecd1813… ) Commit Message: qemu: do not allow /dev/rtc or /dev/hpet access... Commit Author: Paolo Bonzini Committed by: Michal Privoznik Pipeline #147429730 ( https://gitlab.com/libvirt/libvirt/pipelines/147429730 ) triggered by Michal Prívozník ( https://gitlab.com/MichalPrivoznik ) had 3 failed builds. Job #558413588 ( https://gitlab.com/libvirt/libvirt/-/jobs/558413588/raw ) Stage: prebuild Name: codestyle Trace: Running with gitlab-runner 13.0.0-rc2 (926834bc)  on docker-auto-scale fa6cab46 section_start:1589876256:prepare_executor Preparing the "docker+machine" executor Using Docker executor with image quay.io/libvirt/buildenv-libvirt-centos-8:latest ... Pulling docker image quay.io/libvirt/buildenv-libvirt-centos-8:latest ... ERROR: Preparation failed: Error response from daemon: Get https://quay.io/v2/libvirt/buildenv-libvirt-centos-8/manifests/latest: received unexpected HTTP status: 500 Internal Server Error (docker.go:198:0s) Will be retried in 3s ... Using Docker executor with image quay.io/libvirt/buildenv-libvirt-centos-8:latest ... Pulling docker image quay.io/libvirt/buildenv-libvirt-centos-8:latest ... ERROR: Preparation failed: Error response from daemon: Get https://quay.io/v2/libvirt/buildenv-libvirt-centos-8/manifests/latest: received unexpected HTTP status: 500 Internal Server Error (docker.go:198:0s) Will be retried in 3s ... Using Docker executor with image quay.io/libvirt/buildenv-libvirt-centos-8:latest ... Pulling docker image quay.io/libvirt/buildenv-libvirt-centos-8:latest ... ERROR: Preparation failed: Error response from daemon: Get https://quay.io/v2/libvirt/buildenv-libvirt-centos-8/manifests/latest: received unexpected HTTP status: 500 Internal Server Error (docker.go:198:0s) Will be retried in 3s ... section_end:1589876296:prepare_executor ERROR: Job failed (system failure): Error response from daemon: Get https://quay.io/v2/libvirt/buildenv-libvirt-centos-8/manifests/latest: received unexpected HTTP status: 500 Internal Server Error (docker.go:198:0s)  Job #558402205 ( https://gitlab.com/libvirt/libvirt/-/jobs/558402205/raw ) Stage: prebuild Name: potfile Trace: Running with gitlab-runner 13.0.0-rc1 (f319718d)  on docker-auto-scale 0277ea0f section_start:1589875851:prepare_executor Preparing the "docker+machine" executor Using Docker executor with image quay.io/libvirt/buildenv-libvirt-centos-8:latest ... Pulling docker image quay.io/libvirt/buildenv-libvirt-centos-8:latest ... ERROR: Preparation failed: Error response from daemon: Get https://quay.io/v2/libvirt/buildenv-libvirt-centos-8/manifests/latest: received unexpected HTTP status: 500 Internal Server Error (docker.go:198:0s) Will be retried in 3s ... Using Docker executor with image quay.io/libvirt/buildenv-libvirt-centos-8:latest ... Pulling docker image quay.io/libvirt/buildenv-libvirt-centos-8:latest ... ERROR: Preparation failed: Error response from daemon: Get https://quay.io/v2/libvirt/buildenv-libvirt-centos-8/manifests/latest: received unexpected HTTP status: 500 Internal Server Error (docker.go:198:0s) Will be retried in 3s ... Using Docker executor with image quay.io/libvirt/buildenv-libvirt-centos-8:latest ... Pulling docker image quay.io/libvirt/buildenv-libvirt-centos-8:latest ... ERROR: Preparation failed: Error response from daemon: Get https://quay.io/v2/libvirt/buildenv-libvirt-centos-8/manifests/latest: received unexpected HTTP status: 500 Internal Server Error (docker.go:198:9s) Will be retried in 3s ... section_end:1589875911:prepare_executor ERROR: Job failed (system failure): Error response from daemon: Get https://quay.io/v2/libvirt/buildenv-libvirt-centos-8/manifests/latest: received unexpected HTTP status: 500 Internal Server Error (docker.go:198:9s)  Job #558402203 ( https://gitlab.com/libvirt/libvirt/-/jobs/558402203/raw ) Stage: prebuild Name: website Trace: Running with gitlab-runner 13.0.0-rc2 (926834bc)  on docker-auto-scale fa6cab46 section_start:1589875850:prepare_executor Preparing the "docker+machine" executor Using Docker executor with image quay.io/libvirt/buildenv-libvirt-centos-8:latest ... Pulling docker image quay.io/libvirt/buildenv-libvirt-centos-8:latest ... ERROR: Preparation failed: Error response from daemon: Get https://quay.io/v2/libvirt/buildenv-libvirt-centos-8/manifests/latest: Get https://quay.io/v2/auth?scope=repository%3Alibvirt%2Fbuildenv-libvirt-cento…: net/http: request canceled (Client.Timeout exceeded while awaiting headers) (docker.go:198:15s) Will be retried in 3s ... Using Docker executor with image quay.io/libvirt/buildenv-libvirt-centos-8:latest ... Pulling docker image quay.io/libvirt/buildenv-libvirt-centos-8:latest ... ERROR: Preparation failed: Error response from daemon: Get https://quay.io/v2/libvirt/buildenv-libvirt-centos-8/manifests/latest: received unexpected HTTP status: 500 Internal Server Error (docker.go:198:0s) Will be retried in 3s ... Using Docker executor with image quay.io/libvirt/buildenv-libvirt-centos-8:latest ... Pulling docker image quay.io/libvirt/buildenv-libvirt-centos-8:latest ... ERROR: Preparation failed: Error response from daemon: Get https://quay.io/v2/libvirt/buildenv-libvirt-centos-8/manifests/latest: received unexpected HTTP status: 500 Internal Server Error (docker.go:198:0s) Will be retried in 3s ... section_end:1589875903:prepare_executor ERROR: Job failed (system failure): Error response from daemon: Get https://quay.io/v2/libvirt/buildenv-libvirt-centos-8/manifests/latest: received unexpected HTTP status: 500 Internal Server Error (docker.go:198:0s)  -- You're receiving this email because of your account on gitlab.com.
1 0
0 0
libvirt | Pipeline #147429730 has failed for master | ab5ba570
by GitLab 19 May '20

19 May '20
Your pipeline has failed. Project: libvirt ( https://gitlab.com/libvirt/libvirt ) Branch: master ( https://gitlab.com/libvirt/libvirt/-/commits/master ) Commit: ab5ba570 ( https://gitlab.com/libvirt/libvirt/-/commit/ab5ba57012e9e6ab4f55afdeecd1813… ) Commit Message: qemu: do not allow /dev/rtc or /dev/hpet access... Commit Author: Paolo Bonzini Committed by: Michal Privoznik Pipeline #147429730 ( https://gitlab.com/libvirt/libvirt/pipelines/147429730 ) triggered by Michal Prívozník ( https://gitlab.com/MichalPrivoznik ) had 3 failed builds. Job #558402205 ( https://gitlab.com/libvirt/libvirt/-/jobs/558402205/raw ) Stage: prebuild Name: potfile Trace: Running with gitlab-runner 13.0.0-rc1 (f319718d)  on docker-auto-scale 0277ea0f section_start:1589875851:prepare_executor Preparing the "docker+machine" executor Using Docker executor with image quay.io/libvirt/buildenv-libvirt-centos-8:latest ... Pulling docker image quay.io/libvirt/buildenv-libvirt-centos-8:latest ... ERROR: Preparation failed: Error response from daemon: Get https://quay.io/v2/libvirt/buildenv-libvirt-centos-8/manifests/latest: received unexpected HTTP status: 500 Internal Server Error (docker.go:198:0s) Will be retried in 3s ... Using Docker executor with image quay.io/libvirt/buildenv-libvirt-centos-8:latest ... Pulling docker image quay.io/libvirt/buildenv-libvirt-centos-8:latest ... ERROR: Preparation failed: Error response from daemon: Get https://quay.io/v2/libvirt/buildenv-libvirt-centos-8/manifests/latest: received unexpected HTTP status: 500 Internal Server Error (docker.go:198:0s) Will be retried in 3s ... Using Docker executor with image quay.io/libvirt/buildenv-libvirt-centos-8:latest ... Pulling docker image quay.io/libvirt/buildenv-libvirt-centos-8:latest ... ERROR: Preparation failed: Error response from daemon: Get https://quay.io/v2/libvirt/buildenv-libvirt-centos-8/manifests/latest: received unexpected HTTP status: 500 Internal Server Error (docker.go:198:9s) Will be retried in 3s ... section_end:1589875911:prepare_executor ERROR: Job failed (system failure): Error response from daemon: Get https://quay.io/v2/libvirt/buildenv-libvirt-centos-8/manifests/latest: received unexpected HTTP status: 500 Internal Server Error (docker.go:198:9s)  Job #558402203 ( https://gitlab.com/libvirt/libvirt/-/jobs/558402203/raw ) Stage: prebuild Name: website Trace: Running with gitlab-runner 13.0.0-rc2 (926834bc)  on docker-auto-scale fa6cab46 section_start:1589875850:prepare_executor Preparing the "docker+machine" executor Using Docker executor with image quay.io/libvirt/buildenv-libvirt-centos-8:latest ... Pulling docker image quay.io/libvirt/buildenv-libvirt-centos-8:latest ... ERROR: Preparation failed: Error response from daemon: Get https://quay.io/v2/libvirt/buildenv-libvirt-centos-8/manifests/latest: Get https://quay.io/v2/auth?scope=repository%3Alibvirt%2Fbuildenv-libvirt-cento…: net/http: request canceled (Client.Timeout exceeded while awaiting headers) (docker.go:198:15s) Will be retried in 3s ... Using Docker executor with image quay.io/libvirt/buildenv-libvirt-centos-8:latest ... Pulling docker image quay.io/libvirt/buildenv-libvirt-centos-8:latest ... ERROR: Preparation failed: Error response from daemon: Get https://quay.io/v2/libvirt/buildenv-libvirt-centos-8/manifests/latest: received unexpected HTTP status: 500 Internal Server Error (docker.go:198:0s) Will be retried in 3s ... Using Docker executor with image quay.io/libvirt/buildenv-libvirt-centos-8:latest ... Pulling docker image quay.io/libvirt/buildenv-libvirt-centos-8:latest ... ERROR: Preparation failed: Error response from daemon: Get https://quay.io/v2/libvirt/buildenv-libvirt-centos-8/manifests/latest: received unexpected HTTP status: 500 Internal Server Error (docker.go:198:0s) Will be retried in 3s ... section_end:1589875903:prepare_executor ERROR: Job failed (system failure): Error response from daemon: Get https://quay.io/v2/libvirt/buildenv-libvirt-centos-8/manifests/latest: received unexpected HTTP status: 500 Internal Server Error (docker.go:198:0s)  Job #558402204 ( https://gitlab.com/libvirt/libvirt/-/jobs/558402204/raw ) Stage: prebuild Name: codestyle Trace: Running with gitlab-runner 13.0.0-rc2 (926834bc)  on docker-auto-scale 72989761 section_start:1589875850:prepare_executor Preparing the "docker+machine" executor Using Docker executor with image quay.io/libvirt/buildenv-libvirt-centos-8:latest ... Pulling docker image quay.io/libvirt/buildenv-libvirt-centos-8:latest ... ERROR: Preparation failed: Error response from daemon: Get https://quay.io/v2/libvirt/buildenv-libvirt-centos-8/manifests/latest: received unexpected HTTP status: 500 Internal Server Error (docker.go:198:0s) Will be retried in 3s ... Using Docker executor with image quay.io/libvirt/buildenv-libvirt-centos-8:latest ... Pulling docker image quay.io/libvirt/buildenv-libvirt-centos-8:latest ... ERROR: Preparation failed: Error response from daemon: Get https://quay.io/v2/libvirt/buildenv-libvirt-centos-8/manifests/latest: received unexpected HTTP status: 500 Internal Server Error (docker.go:198:0s) Will be retried in 3s ... Using Docker executor with image quay.io/libvirt/buildenv-libvirt-centos-8:latest ... Pulling docker image quay.io/libvirt/buildenv-libvirt-centos-8:latest ... ERROR: Preparation failed: Error response from daemon: Get https://quay.io/v2/libvirt/buildenv-libvirt-centos-8/manifests/latest: received unexpected HTTP status: 500 Internal Server Error (docker.go:198:0s) Will be retried in 3s ... section_end:1589875900:prepare_executor ERROR: Job failed (system failure): Error response from daemon: Get https://quay.io/v2/libvirt/buildenv-libvirt-centos-8/manifests/latest: received unexpected HTTP status: 500 Internal Server Error (docker.go:198:0s)  -- You're receiving this email because of your account on gitlab.com.
1 0
0 0
Build failed in Jenkins: libvirt-check » libvirt-debian-9 #1163
by ci@centos.org 15 May '20

15 May '20
See <https://ci.centos.org/job/libvirt-check/systems=libvirt-debian-9/1163/displ…> ------------------------------------------ [...truncated 6.14 KB...] WARNING: skipping the remote protocol test GEN ../../src/lock_protocol-struct GEN ../../src/admin_protocol-struct WARNING: no output, pdwtags appears broken: WARNING: die__process_unit: DW_TAG_restrict_type (0x37) @ <0x193> not handled! WARNING: skipping the remote protocol test WARNING: no output, pdwtags appears broken: WARNING: die__process_unit: DW_TAG_restrict_type (0x37) @ <0x193> not handled! WARNING: skipping the remote protocol test WARNING: no output, pdwtags appears broken: WARNING: die__process_unit: DW_TAG_restrict_type (0x37) @ <0x19e> not handled! WARNING: skipping the remote protocol test GEN check-symfile GEN check-symsorting GEN check-drivername GEN check-driverimpls GEN check-aclrules GEN check-aclperms GEN check-admin-symfile GEN check-admin-symsorting GEN check-admin-drivername GEN check-augeas make[4]: Leaving directory '<https://ci.centos.org/job/libvirt-check/systems=libvirt-debian-9/ws/build/s…'> make[3]: Leaving directory '<https://ci.centos.org/job/libvirt-check/systems=libvirt-debian-9/ws/build/s…'> make[2]: Leaving directory '<https://ci.centos.org/job/libvirt-check/systems=libvirt-debian-9/ws/build/s…'> Making check in tools make[2]: Entering directory '<https://ci.centos.org/job/libvirt-check/systems=libvirt-debian-9/ws/build/t…'> /usr/bin/make check-am make[3]: Entering directory '<https://ci.centos.org/job/libvirt-check/systems=libvirt-debian-9/ws/build/t…'> make[3]: Nothing to be done for 'check-am'. make[3]: Leaving directory '<https://ci.centos.org/job/libvirt-check/systems=libvirt-debian-9/ws/build/t…'> make[2]: Leaving directory '<https://ci.centos.org/job/libvirt-check/systems=libvirt-debian-9/ws/build/t…'> Making check in docs make[2]: Entering directory '<https://ci.centos.org/job/libvirt-check/systems=libvirt-debian-9/ws/build/d…'> /usr/bin/make check-local make[3]: Entering directory '<https://ci.centos.org/job/libvirt-check/systems=libvirt-debian-9/ws/build/d…'> /usr/bin/xmllint --nonet --noout html/*.html make[3]: Leaving directory '<https://ci.centos.org/job/libvirt-check/systems=libvirt-debian-9/ws/build/d…'> make[2]: Leaving directory '<https://ci.centos.org/job/libvirt-check/systems=libvirt-debian-9/ws/build/d…'> Making check in tests make[2]: Entering directory '<https://ci.centos.org/job/libvirt-check/systems=libvirt-debian-9/ws/build/t…'> /usr/bin/make make[3]: Entering directory '<https://ci.centos.org/job/libvirt-check/systems=libvirt-debian-9/ws/build/t…'> make[3]: Nothing to be done for 'all'. make[3]: Leaving directory '<https://ci.centos.org/job/libvirt-check/systems=libvirt-debian-9/ws/build/t…'> /usr/bin/make check-TESTS make[3]: Entering directory '<https://ci.centos.org/job/libvirt-check/systems=libvirt-debian-9/ws/build/t…'> make[4]: Entering directory '<https://ci.centos.org/job/libvirt-check/systems=libvirt-debian-9/ws/build/t…'> PASS: sockettest PASS: virbuftest PASS: virhostcputest PASS: seclabeltest PASS: virhashtest PASS: virconftest PASS: commandtest PASS: shunloadtest PASS: utiltest PASS: virtimetest PASS: viruritest PASS: viralloctest PASS: virauthconfigtest PASS: virbitmaptest PASS: vircgrouptest PASS: vircryptotest PASS: virendiantest PASS: virpcitest PASS: virfilecachetest PASS: virfirewalltest PASS: viriscsitest PASS: virkeycodetest PASS: virfiletest PASS: virlockspacetest PASS: virlogtest PASS: virrotatingfiletest PASS: virstringtest PASS: virportallocatortest PASS: sysinfotest PASS: virkmodtest PASS: vircapstest PASS: domaincapstest PASS: domainconftest PASS: virhostdevtest PASS: virnetdevtest PASS: virtypedparamtest PASS: vshtabletest PASS: virerrortest PASS: virnetmessagetest PASS: virnetsockettest PASS: virnetdaemontest PASS: virnetserverclienttest PASS: virnettlscontexttest PASS: virschematest PASS: fchosttest PASS: scsihosttest PASS: virshtest PASS: virresctrltest PASS: vircaps2xmltest PASS: fdstreamtest PASS: virdbustest PASS: virsystemdtest PASS: virpolkittest PASS: securityselinuxtest PASS: viridentitytest PASS: securityselinuxlabeltest PASS: xlconfigtest PASS: xmconfigtest PASS: libxlxml2domconfigtest PASS: virnettlssessiontest PASS: qemudomaincheckpointxml2xmltest PASS: qemudomainsnapshotxml2xmltest PASS: qemumonitorjsontest PASS: qemuhotplugtest PASS: qemuagenttest PASS: qemuxml2xmltest PASS: qemucaps2xmltest PASS: qemucapabilitiestest PASS: qemumemlocktest PASS: qemucommandutiltest PASS: qemumigparamstest PASS: qemublocktest PASS: qemufirmwaretest PASS: qemuvhostusertest PASS: lxcxml2xmltest PASS: lxcconf2xmltest PASS: openvzutilstest PASS: esxutilstest PASS: vboxsnapshotxmltest PASS: vmx2xmltest PASS: xml2vmxtest PASS: vmwarevertest PASS: virjsontest PASS: networkxml2xmlupdatetest PASS: virnetworkportxml2xmltest PASS: networkxml2xmltest PASS: networkxml2conftest PASS: networkxml2firewalltest PASS: storagebackendsheepdogtest PASS: nwfilterxml2xmltest PASS: virnwfilterbindingxml2xmltest PASS: qemusecuritytest PASS: nwfilterebiptablestest PASS: nwfilterxml2firewalltest PASS: storagevolxml2argvtest PASS: virstorageutiltest PASS: storagepoolxml2argvtest PASS: storagepoolcapstest PASS: storagepoolxml2xmltest PASS: virscsitest PASS: nsstest PASS: nssguesttest PASS: storagevolxml2xmltest PASS: virstoragetest PASS: interfacexml2xmltest PASS: nodedevxml2xmltest PASS: metadatatest PASS: secretxml2xmltest PASS: genericxml2xmltest PASS: virusbtest PASS: virnetdevbandwidthtest ../../build-aux/test-driver: line 107: 4341 Segmentation fault "$@" > $log_file 2>&1 FAIL: eventtest PASS: virdrivermoduletest PASS: virdriverconnvalidatetest PASS: objecteventtest PASS: virmacmaptest PASS: virnetdevopenvswitchtest PASS: libvirtd-fail PASS: cputest PASS: libvirtd-pool PASS: qemuxml2argvtest PASS: virsh-auth PASS: virsh-cpuset PASS: virsh-define-dev-segfault PASS: virsh-int-overflow PASS: virsh-read-non-seekable PASS: virsh-read-bufsiz PASS: virsh-schedinfo PASS: virsh-self-test PASS: virt-admin-self-test PASS: virsh-checkpoint PASS: virsh-start PASS: virsh-undefine PASS: virsh-snapshot PASS: virsh-uriprecedence PASS: virsh-vcpupin PASS: virsh-optparse PASS: virt-aa-helper-test ============================================================================ Testsuite summary for libvirt 6.4.0 ============================================================================ # TOTAL: 138 # PASS: 137 # SKIP: 0 # XFAIL: 0 # FAIL: 1 # XPASS: 0 # ERROR: 0 ============================================================================ See tests/test-suite.log Please report to libvir-list(a)redhat.com ============================================================================ Makefile:4703: recipe for target 'test-suite.log' failed make[4]: *** [test-suite.log] Error 1 make[4]: Leaving directory '<https://ci.centos.org/job/libvirt-check/systems=libvirt-debian-9/ws/build/t…'> Makefile:4809: recipe for target 'check-TESTS' failed make[3]: *** [check-TESTS] Error 2 make[3]: Leaving directory '<https://ci.centos.org/job/libvirt-check/systems=libvirt-debian-9/ws/build/t…'> Makefile:5862: recipe for target 'check-am' failed make[2]: *** [check-am] Error 2 make[2]: Leaving directory '<https://ci.centos.org/job/libvirt-check/systems=libvirt-debian-9/ws/build/t…'> Makefile:777: recipe for target 'check-recursive' failed make[1]: *** [check-recursive] Error 1 make[1]: Leaving directory '<https://ci.centos.org/job/libvirt-check/systems=libvirt-debian-9/ws/build'> Makefile:1069: recipe for target 'check' failed make: *** [check] Error 2 + find -name test-suite.log + xargs cat ========================================= libvirt 6.4.0: tests/test-suite.log ========================================= # TOTAL: 138 # PASS: 137 # SKIP: 0 # XFAIL: 0 # FAIL: 1 # XPASS: 0 # ERROR: 0 .. contents:: :depth: 2 FAIL: eventtest =============== TEST: eventtest 1) Simple write ... OK 2) Deleted before poll ... OK 3) Interrupted during poll ... OK 4) Deleted during dispatch ... OK 5) Deleted during dispatch ... OK 6) Firing a timer ... OK 7) Deleted before poll ... OK 8) Interrupted during poll ... OK 9) Deleted during dispatch ... OK 10) Deleted during dispatch ... OK FAIL eventtest (exit status: 139) + exit 1 Build step 'Execute shell' marked build as failure
1 1
0 0
Build failed in Jenkins: libvirt-build » libvirt-freebsd-11 #1427
by ci@centos.org 15 May '20

15 May '20
See <https://ci.centos.org/job/libvirt-build/systems=libvirt-freebsd-11/1427/dis…> Changes: [jdenemar] cpu: Introduce virCPUarmData and related struts [jdenemar] cpu: Add helper functions to parse vendor and model [jdenemar] cpu: Introduce getHost support for ARM CPU driver [jdenemar] cpu_map: Introduce ARM cpu models [mprivozn] docs: document proper enum for guest agent timeout ------------------------------------------ [...truncated 44.59 KB...] CC remote/virtproxyd-remote_daemon.o CC remote/virtproxyd-remote_daemon_config.o CC remote/virtproxyd-remote_daemon_dispatch.o CC remote/virtproxyd-remote_daemon_stream.o CC admin/libvirt_admin_la-libvirt-admin.lo CC libvirt_admin_la-datatypes.lo CC admin/libvirt_admin_la-admin_protocol.lo CC locking/lockd_la-lock_driver_lockd.lo CC locking/lockd_la-lock_protocol.lo CC qemu/libvirt_driver_qemu_impl_la-qemu_agent.lo CC qemu/libvirt_driver_qemu_impl_la-qemu_alias.lo CC qemu/libvirt_driver_qemu_impl_la-qemu_block.lo CC qemu/libvirt_driver_qemu_impl_la-qemu_blockjob.lo CC qemu/libvirt_driver_qemu_impl_la-qemu_capabilities.lo CC qemu/libvirt_driver_qemu_impl_la-qemu_command.lo CC qemu/libvirt_driver_qemu_impl_la-qemu_dbus.lo CC qemu/libvirt_driver_qemu_impl_la-qemu_domain.lo CC qemu/libvirt_driver_qemu_impl_la-qemu_domain_address.lo CC qemu/libvirt_driver_qemu_impl_la-qemu_cgroup.lo CC qemu/libvirt_driver_qemu_impl_la-qemu_extdevice.lo CC qemu/libvirt_driver_qemu_impl_la-qemu_firmware.lo CC qemu/libvirt_driver_qemu_impl_la-qemu_hostdev.lo CC qemu/libvirt_driver_qemu_impl_la-qemu_hotplug.lo CC qemu/libvirt_driver_qemu_impl_la-qemu_conf.lo CC qemu/libvirt_driver_qemu_impl_la-qemu_interop_config.lo CC qemu/libvirt_driver_qemu_impl_la-qemu_process.lo CC qemu/libvirt_driver_qemu_impl_la-qemu_migration.lo CC qemu/libvirt_driver_qemu_impl_la-qemu_migration_cookie.lo CC qemu/libvirt_driver_qemu_impl_la-qemu_migration_params.lo CC qemu/libvirt_driver_qemu_impl_la-qemu_monitor.lo CC qemu/libvirt_driver_qemu_impl_la-qemu_monitor_text.lo CC qemu/libvirt_driver_qemu_impl_la-qemu_monitor_json.lo CC qemu/libvirt_driver_qemu_impl_la-qemu_driver.lo CC qemu/libvirt_driver_qemu_impl_la-qemu_interface.lo CC qemu/libvirt_driver_qemu_impl_la-qemu_security.lo CC qemu/libvirt_driver_qemu_impl_la-qemu_qapi.lo CC qemu/libvirt_driver_qemu_impl_la-qemu_slirp.lo CC qemu/libvirt_driver_qemu_impl_la-qemu_tpm.lo CC qemu/libvirt_driver_qemu_impl_la-qemu_vhost_user.lo CC qemu/libvirt_driver_qemu_impl_la-qemu_vhost_user_gpu.lo CC qemu/libvirt_driver_qemu_impl_la-qemu_virtiofs.lo CC qemu/libvirt_driver_qemu_impl_la-qemu_checkpoint.lo CC qemu/libvirt_driver_qemu_impl_la-qemu_backup.lo CC qemu/libvirt_driver_qemu_impl_la-qemu_validate.lo CC network/libvirt_driver_network_impl_la-bridge_driver.lo CC network/libvirt_driver_network_impl_la-bridge_driver_platform.lo GEN vbox/virtvboxd.aug GEN qemu/virtqemud.aug GEN bhyve/virtbhyved.aug GEN network/virtnetworkd.aug GEN node_device/virtnodedevd.aug GEN secret/virtsecretd.aug GEN storage/virtstoraged.aug GEN remote/libvirtd.aug GEN remote/virtproxyd.aug GEN logging/test_virtlogd.aug GEN locking/test_libvirt_lockd.aug GEN locking/test_virtlockd.aug GEN vbox/test_virtvboxd.aug GEN qemu/test_virtqemud.aug GEN qemu/test_libvirtd_qemu.aug GEN bhyve/test_virtbhyved.aug GEN bhyve/test_libvirtd_bhyve.aug GEN network/test_virtnetworkd.aug GEN node_device/test_virtnodedevd.aug GEN secret/test_virtsecretd.aug GEN storage/test_virtstoraged.aug GEN remote/test_libvirtd.aug GEN remote/test_virtproxyd.aug CC qemu/qemu_shim.o CC util/libvirt_util_la-glibcompat.lo CC util/libvirt_util_la-viralloc.lo CC util/libvirt_util_la-virarch.lo CC util/libvirt_util_la-virarptable.lo CC util/libvirt_util_la-viraudit.lo CC util/libvirt_util_la-virauth.lo CC util/libvirt_util_la-virauthconfig.lo CC util/libvirt_util_la-virbitmap.lo CC util/libvirt_util_la-virbpf.lo CC util/libvirt_util_la-virbuffer.lo CC util/libvirt_util_la-virperf.lo CC util/libvirt_util_la-vircgroup.lo CC util/libvirt_util_la-vircgroupbackend.lo CC util/libvirt_util_la-vircgroupv1.lo CC util/libvirt_util_la-vircgroupv2.lo CC util/libvirt_util_la-vircgroupv2devices.lo CC util/libvirt_util_la-vircommand.lo CC util/libvirt_util_la-virconf.lo CC util/libvirt_util_la-vircrypto.lo CC util/libvirt_util_la-virdaemon.lo CC util/libvirt_util_la-virdbus.lo CC util/libvirt_util_la-virdevmapper.lo CC util/libvirt_util_la-virdnsmasq.lo CC util/libvirt_util_la-virebtables.lo CC util/libvirt_util_la-virenum.lo CC util/libvirt_util_la-virerror.lo CC util/libvirt_util_la-virevent.lo CC util/libvirt_util_la-vireventglib.lo CC util/libvirt_util_la-vireventglibwatch.lo CC util/libvirt_util_la-vireventthread.lo CC util/libvirt_util_la-virfcp.lo CC util/libvirt_util_la-virfdstream.lo CC util/libvirt_util_la-virfile.lo CC util/libvirt_util_la-virfirewall.lo CC util/libvirt_util_la-virfirewalld.lo CC util/libvirt_util_la-virfirmware.lo CC util/libvirt_util_la-virgettext.lo CC util/libvirt_util_la-virgic.lo CC util/libvirt_util_la-virhash.lo CC util/libvirt_util_la-virhashcode.lo CC util/libvirt_util_la-virhook.lo CC util/libvirt_util_la-virhostcpu.lo CC util/libvirt_util_la-virhostmem.lo CC util/libvirt_util_la-virhostuptime.lo CC util/libvirt_util_la-viridentity.lo CC util/libvirt_util_la-virinitctl.lo CC util/libvirt_util_la-viriptables.lo CC util/libvirt_util_la-viriscsi.lo CC util/libvirt_util_la-virjson.lo CC util/libvirt_util_la-virkeycode.lo CC util/libvirt_util_la-virlease.lo CC util/libvirt_util_la-virlockspace.lo CC util/libvirt_util_la-virlog.lo CC util/libvirt_util_la-virmacaddr.lo CC util/libvirt_util_la-virmacmap.lo CC util/libvirt_util_la-virmodule.lo CC util/libvirt_util_la-virnetdev.lo CC util/libvirt_util_la-virnetdevbandwidth.lo CC util/libvirt_util_la-virnetdevbridge.lo CC util/libvirt_util_la-virnetdevip.lo CC util/libvirt_util_la-virnetdevmacvlan.lo CC util/libvirt_util_la-virnetdevmidonet.lo CC util/libvirt_util_la-virnetdevopenvswitch.lo CC util/libvirt_util_la-virnetdevtap.lo CC util/libvirt_util_la-virnetdevveth.lo CC util/libvirt_util_la-virnetdevvlan.lo CC util/libvirt_util_la-virnetdevvportprofile.lo CC util/libvirt_util_la-virnetlink.lo CC util/libvirt_util_la-virnodesuspend.lo CC util/libvirt_util_la-virnvme.lo CC util/libvirt_util_la-virkmod.lo CC util/libvirt_util_la-virnuma.lo CC util/libvirt_util_la-virobject.lo CC util/libvirt_util_la-virpci.lo CC util/libvirt_util_la-virpidfile.lo CC util/libvirt_util_la-virpolkit.lo CC util/libvirt_util_la-virportallocator.lo CC util/libvirt_util_la-virprocess.lo CC util/libvirt_util_la-virqemu.lo CC util/libvirt_util_la-virrandom.lo CC util/libvirt_util_la-virresctrl.lo CC util/libvirt_util_la-virrotatingfile.lo CC util/libvirt_util_la-virscsi.lo CC util/libvirt_util_la-virscsihost.lo CC util/libvirt_util_la-virscsivhost.lo CC util/libvirt_util_la-virseclabel.lo CC util/libvirt_util_la-virsecret.lo CC util/libvirt_util_la-virsocket.lo CC util/libvirt_util_la-virsocketaddr.lo CC util/libvirt_util_la-virstorageencryption.lo CC util/libvirt_util_la-virstoragefile.lo CC util/libvirt_util_la-virstoragefilebackend.lo CC util/libvirt_util_la-virstring.lo CC util/libvirt_util_la-virsysinfo.lo CC util/libvirt_util_la-virsystemd.lo CC util/libvirt_util_la-virthread.lo CC util/libvirt_util_la-virthreadjob.lo CC util/libvirt_util_la-virthreadpool.lo CC util/libvirt_util_la-virtime.lo CC util/libvirt_util_la-virtpm.lo CC util/libvirt_util_la-virtypedparam-public.lo CC util/libvirt_util_la-virtypedparam.lo CC util/libvirt_util_la-virusb.lo CC util/libvirt_util_la-viruri.lo CC util/libvirt_util_la-virutil.lo CC util/libvirt_util_la-viruuid.lo CC util/libvirt_util_la-virvhba.lo CC util/libvirt_util_la-virvsock.lo CC util/libvirt_util_la-virxml.lo CC util/libvirt_util_la-virmdev.lo CC util/libvirt_util_la-virfilecache.lo CC conf/libvirt_conf_la-netdev_bandwidth_conf.lo CC conf/libvirt_conf_la-netdev_vport_profile_conf.lo CC conf/libvirt_conf_la-netdev_vlan_conf.lo CC conf/libvirt_conf_la-virnetworkportdef.lo CC conf/libvirt_conf_la-backup_conf.lo CC conf/libvirt_conf_la-capabilities.lo CC conf/libvirt_conf_la-checkpoint_conf.lo CC conf/libvirt_conf_la-domain_addr.lo CC conf/libvirt_conf_la-domain_capabilities.lo CC conf/libvirt_conf_la-domain_conf.lo CC conf/libvirt_conf_la-domain_audit.lo CC conf/libvirt_conf_la-domain_nwfilter.lo CC conf/libvirt_conf_la-virsavecookie.lo CC conf/libvirt_conf_la-moment_conf.lo CC conf/libvirt_conf_la-snapshot_conf.lo CC conf/libvirt_conf_la-numa_conf.lo CC conf/libvirt_conf_la-virdomaincheckpointobjlist.lo CC conf/libvirt_conf_la-virdomainobjlist.lo CC conf/libvirt_conf_la-virdomainmomentobjlist.lo CC conf/libvirt_conf_la-virdomainsnapshotobjlist.lo CC conf/libvirt_conf_la-object_event.lo CC conf/libvirt_conf_la-domain_event.lo CC conf/libvirt_conf_la-network_event.lo CC conf/libvirt_conf_la-storage_event.lo CC conf/libvirt_conf_la-node_device_event.lo CC conf/libvirt_conf_la-secret_event.lo CC conf/libvirt_conf_la-network_conf.lo CC conf/libvirt_conf_la-virnetworkobj.lo CC conf/libvirt_conf_la-networkcommon_conf.lo CC conf/libvirt_conf_la-nwfilter_params.lo CC conf/libvirt_conf_la-nwfilter_ipaddrmap.lo CC conf/libvirt_conf_la-nwfilter_conf.lo CC conf/libvirt_conf_la-virnwfilterobj.lo CC conf/libvirt_conf_la-virnwfilterbindingdef.lo CC conf/libvirt_conf_la-virnwfilterbindingobj.lo CC conf/libvirt_conf_la-virnwfilterbindingobjlist.lo CC conf/libvirt_conf_la-node_device_conf.lo CC conf/libvirt_conf_la-node_device_util.lo CC conf/libvirt_conf_la-virnodedeviceobj.lo CC conf/libvirt_conf_la-storage_adapter_conf.lo CC conf/libvirt_conf_la-storage_capabilities.lo CC conf/libvirt_conf_la-storage_conf.lo CC conf/libvirt_conf_la-virstorageobj.lo CC conf/libvirt_conf_la-interface_conf.lo CC conf/libvirt_conf_la-virinterfaceobj.lo CC conf/libvirt_conf_la-secret_conf.lo CC conf/libvirt_conf_la-virsecretobj.lo CC conf/libvirt_conf_la-cpu_conf.lo CC conf/libvirt_conf_la-virchrdev.lo CC cpu/libvirt_cpu_la-cpu.lo CC conf/libvirt_conf_la-device_conf.lo CC cpu/libvirt_cpu_la-cpu_x86.lo CC cpu/libvirt_cpu_la-cpu_s390.lo CC cpu/libvirt_cpu_la-cpu_arm.lo CC cpu/libvirt_cpu_la-cpu_ppc64.lo ../../src/cpu/cpu_arm.c:328:28: error: unused variable 'nodes' [-Werror,-Wunused-variable] g_autofree xmlNodePtr *nodes = NULL; ^ 1 error generated. gmake[3]: *** [Makefile:9202: cpu/libvirt_cpu_la-cpu_arm.lo] Error 1 gmake[3]: *** Waiting for unfinished jobs.... gmake[3]: Leaving directory '/usr<https://ci.centos.org/job/libvirt-build/systems=libvirt-freebsd-11/ws/build…'> gmake[2]: *** [Makefile:6442: all] Error 2 gmake[2]: Leaving directory '/usr<https://ci.centos.org/job/libvirt-build/systems=libvirt-freebsd-11/ws/build…'> gmake[1]: *** [Makefile:777: all-recursive] Error 1 gmake[1]: Leaving directory '/usr<https://ci.centos.org/job/libvirt-build/systems=libvirt-freebsd-11/ws/build'> gmake: *** [Makefile:670: all] Error 2 Build step 'Execute shell' marked build as failure
1 1
0 0
Build failed in Jenkins: libvirt-build » libvirt-freebsd-12 #1427
by ci@centos.org 15 May '20

15 May '20
See <https://ci.centos.org/job/libvirt-build/systems=libvirt-freebsd-12/1427/dis…> Changes: [jdenemar] cpu: Introduce virCPUarmData and related struts [jdenemar] cpu: Add helper functions to parse vendor and model [jdenemar] cpu: Introduce getHost support for ARM CPU driver [jdenemar] cpu_map: Introduce ARM cpu models [mprivozn] docs: document proper enum for guest agent timeout ------------------------------------------ [...truncated 44.53 KB...] CC remote/virtproxyd-remote_daemon.o CC remote/virtproxyd-remote_daemon_config.o CC remote/virtproxyd-remote_daemon_dispatch.o CC remote/virtproxyd-remote_daemon_stream.o CC admin/libvirt_admin_la-libvirt-admin.lo CC libvirt_admin_la-datatypes.lo CC admin/libvirt_admin_la-admin_protocol.lo CC locking/lockd_la-lock_driver_lockd.lo CC locking/lockd_la-lock_protocol.lo CC qemu/libvirt_driver_qemu_impl_la-qemu_agent.lo CC qemu/libvirt_driver_qemu_impl_la-qemu_alias.lo CC qemu/libvirt_driver_qemu_impl_la-qemu_block.lo CC qemu/libvirt_driver_qemu_impl_la-qemu_blockjob.lo CC qemu/libvirt_driver_qemu_impl_la-qemu_capabilities.lo CC qemu/libvirt_driver_qemu_impl_la-qemu_command.lo CC qemu/libvirt_driver_qemu_impl_la-qemu_dbus.lo CC qemu/libvirt_driver_qemu_impl_la-qemu_domain.lo CC qemu/libvirt_driver_qemu_impl_la-qemu_domain_address.lo CC qemu/libvirt_driver_qemu_impl_la-qemu_cgroup.lo CC qemu/libvirt_driver_qemu_impl_la-qemu_extdevice.lo CC qemu/libvirt_driver_qemu_impl_la-qemu_firmware.lo CC qemu/libvirt_driver_qemu_impl_la-qemu_hostdev.lo CC qemu/libvirt_driver_qemu_impl_la-qemu_hotplug.lo CC qemu/libvirt_driver_qemu_impl_la-qemu_conf.lo CC qemu/libvirt_driver_qemu_impl_la-qemu_interop_config.lo CC qemu/libvirt_driver_qemu_impl_la-qemu_process.lo CC qemu/libvirt_driver_qemu_impl_la-qemu_migration.lo CC qemu/libvirt_driver_qemu_impl_la-qemu_migration_cookie.lo CC qemu/libvirt_driver_qemu_impl_la-qemu_migration_params.lo CC qemu/libvirt_driver_qemu_impl_la-qemu_monitor.lo CC qemu/libvirt_driver_qemu_impl_la-qemu_monitor_text.lo CC qemu/libvirt_driver_qemu_impl_la-qemu_monitor_json.lo CC qemu/libvirt_driver_qemu_impl_la-qemu_driver.lo CC qemu/libvirt_driver_qemu_impl_la-qemu_interface.lo CC qemu/libvirt_driver_qemu_impl_la-qemu_security.lo CC qemu/libvirt_driver_qemu_impl_la-qemu_qapi.lo CC qemu/libvirt_driver_qemu_impl_la-qemu_slirp.lo CC qemu/libvirt_driver_qemu_impl_la-qemu_tpm.lo CC qemu/libvirt_driver_qemu_impl_la-qemu_vhost_user.lo CC qemu/libvirt_driver_qemu_impl_la-qemu_vhost_user_gpu.lo CC qemu/libvirt_driver_qemu_impl_la-qemu_virtiofs.lo CC qemu/libvirt_driver_qemu_impl_la-qemu_checkpoint.lo CC qemu/libvirt_driver_qemu_impl_la-qemu_backup.lo CC qemu/libvirt_driver_qemu_impl_la-qemu_validate.lo CC network/libvirt_driver_network_impl_la-bridge_driver.lo CC network/libvirt_driver_network_impl_la-bridge_driver_platform.lo GEN vbox/virtvboxd.aug GEN qemu/virtqemud.aug GEN bhyve/virtbhyved.aug GEN network/virtnetworkd.aug GEN node_device/virtnodedevd.aug GEN secret/virtsecretd.aug GEN storage/virtstoraged.aug GEN remote/libvirtd.aug GEN remote/virtproxyd.aug GEN logging/test_virtlogd.aug GEN locking/test_libvirt_lockd.aug GEN locking/test_virtlockd.aug GEN vbox/test_virtvboxd.aug GEN qemu/test_virtqemud.aug GEN qemu/test_libvirtd_qemu.aug GEN bhyve/test_virtbhyved.aug GEN bhyve/test_libvirtd_bhyve.aug GEN network/test_virtnetworkd.aug GEN node_device/test_virtnodedevd.aug GEN secret/test_virtsecretd.aug GEN storage/test_virtstoraged.aug GEN remote/test_libvirtd.aug GEN remote/test_virtproxyd.aug CC qemu/qemu_shim.o CC util/libvirt_util_la-glibcompat.lo CC util/libvirt_util_la-viralloc.lo CC util/libvirt_util_la-virarch.lo CC util/libvirt_util_la-virarptable.lo CC util/libvirt_util_la-viraudit.lo CC util/libvirt_util_la-virauth.lo CC util/libvirt_util_la-virauthconfig.lo CC util/libvirt_util_la-virbitmap.lo CC util/libvirt_util_la-virbpf.lo CC util/libvirt_util_la-virbuffer.lo CC util/libvirt_util_la-virperf.lo CC util/libvirt_util_la-vircgroup.lo CC util/libvirt_util_la-vircgroupbackend.lo CC util/libvirt_util_la-vircgroupv1.lo CC util/libvirt_util_la-vircgroupv2.lo CC util/libvirt_util_la-vircgroupv2devices.lo CC util/libvirt_util_la-vircommand.lo CC util/libvirt_util_la-virconf.lo CC util/libvirt_util_la-vircrypto.lo CC util/libvirt_util_la-virdaemon.lo CC util/libvirt_util_la-virdbus.lo CC util/libvirt_util_la-virdevmapper.lo CC util/libvirt_util_la-virdnsmasq.lo CC util/libvirt_util_la-virebtables.lo CC util/libvirt_util_la-virenum.lo CC util/libvirt_util_la-virerror.lo CC util/libvirt_util_la-virevent.lo CC util/libvirt_util_la-vireventglib.lo CC util/libvirt_util_la-vireventglibwatch.lo CC util/libvirt_util_la-vireventthread.lo CC util/libvirt_util_la-virfcp.lo CC util/libvirt_util_la-virfdstream.lo CC util/libvirt_util_la-virfile.lo CC util/libvirt_util_la-virfirewall.lo CC util/libvirt_util_la-virfirewalld.lo CC util/libvirt_util_la-virfirmware.lo CC util/libvirt_util_la-virgettext.lo CC util/libvirt_util_la-virgic.lo CC util/libvirt_util_la-virhash.lo CC util/libvirt_util_la-virhashcode.lo CC util/libvirt_util_la-virhook.lo CC util/libvirt_util_la-virhostcpu.lo CC util/libvirt_util_la-virhostmem.lo CC util/libvirt_util_la-virhostuptime.lo CC util/libvirt_util_la-viridentity.lo CC util/libvirt_util_la-virinitctl.lo CC util/libvirt_util_la-viriptables.lo CC util/libvirt_util_la-viriscsi.lo CC util/libvirt_util_la-virjson.lo CC util/libvirt_util_la-virkeycode.lo CC util/libvirt_util_la-virlockspace.lo CC util/libvirt_util_la-virlease.lo CC util/libvirt_util_la-virlog.lo CC util/libvirt_util_la-virmacaddr.lo CC util/libvirt_util_la-virmacmap.lo CC util/libvirt_util_la-virmodule.lo CC util/libvirt_util_la-virnetdev.lo CC util/libvirt_util_la-virnetdevbandwidth.lo CC util/libvirt_util_la-virnetdevbridge.lo CC util/libvirt_util_la-virnetdevip.lo CC util/libvirt_util_la-virnetdevmacvlan.lo CC util/libvirt_util_la-virnetdevmidonet.lo CC util/libvirt_util_la-virnetdevopenvswitch.lo CC util/libvirt_util_la-virnetdevtap.lo CC util/libvirt_util_la-virnetdevveth.lo CC util/libvirt_util_la-virnetdevvlan.lo CC util/libvirt_util_la-virnetdevvportprofile.lo CC util/libvirt_util_la-virnetlink.lo CC util/libvirt_util_la-virnodesuspend.lo CC util/libvirt_util_la-virnvme.lo CC util/libvirt_util_la-virkmod.lo CC util/libvirt_util_la-virnuma.lo CC util/libvirt_util_la-virobject.lo CC util/libvirt_util_la-virpci.lo CC util/libvirt_util_la-virpidfile.lo CC util/libvirt_util_la-virpolkit.lo CC util/libvirt_util_la-virportallocator.lo CC util/libvirt_util_la-virprocess.lo CC util/libvirt_util_la-virqemu.lo CC util/libvirt_util_la-virrandom.lo CC util/libvirt_util_la-virresctrl.lo CC util/libvirt_util_la-virrotatingfile.lo CC util/libvirt_util_la-virscsi.lo CC util/libvirt_util_la-virscsihost.lo CC util/libvirt_util_la-virscsivhost.lo CC util/libvirt_util_la-virseclabel.lo CC util/libvirt_util_la-virsecret.lo CC util/libvirt_util_la-virsocket.lo CC util/libvirt_util_la-virsocketaddr.lo CC util/libvirt_util_la-virstorageencryption.lo CC util/libvirt_util_la-virstoragefile.lo CC util/libvirt_util_la-virstoragefilebackend.lo CC util/libvirt_util_la-virstring.lo CC util/libvirt_util_la-virsysinfo.lo CC util/libvirt_util_la-virsystemd.lo CC util/libvirt_util_la-virthread.lo CC util/libvirt_util_la-virthreadjob.lo CC util/libvirt_util_la-virthreadpool.lo CC util/libvirt_util_la-virtime.lo CC util/libvirt_util_la-virtpm.lo CC util/libvirt_util_la-virtypedparam-public.lo CC util/libvirt_util_la-virtypedparam.lo CC util/libvirt_util_la-virusb.lo CC util/libvirt_util_la-viruri.lo CC util/libvirt_util_la-virutil.lo CC util/libvirt_util_la-viruuid.lo CC util/libvirt_util_la-virvhba.lo CC util/libvirt_util_la-virvsock.lo CC util/libvirt_util_la-virxml.lo CC util/libvirt_util_la-virmdev.lo CC util/libvirt_util_la-virfilecache.lo CC conf/libvirt_conf_la-netdev_bandwidth_conf.lo CC conf/libvirt_conf_la-netdev_vport_profile_conf.lo CC conf/libvirt_conf_la-netdev_vlan_conf.lo CC conf/libvirt_conf_la-virnetworkportdef.lo CC conf/libvirt_conf_la-backup_conf.lo CC conf/libvirt_conf_la-capabilities.lo CC conf/libvirt_conf_la-checkpoint_conf.lo CC conf/libvirt_conf_la-domain_addr.lo CC conf/libvirt_conf_la-domain_capabilities.lo CC conf/libvirt_conf_la-domain_conf.lo CC conf/libvirt_conf_la-domain_audit.lo CC conf/libvirt_conf_la-domain_nwfilter.lo CC conf/libvirt_conf_la-virsavecookie.lo CC conf/libvirt_conf_la-moment_conf.lo CC conf/libvirt_conf_la-snapshot_conf.lo CC conf/libvirt_conf_la-numa_conf.lo CC conf/libvirt_conf_la-virdomaincheckpointobjlist.lo CC conf/libvirt_conf_la-virdomainobjlist.lo CC conf/libvirt_conf_la-virdomainmomentobjlist.lo CC conf/libvirt_conf_la-virdomainsnapshotobjlist.lo CC conf/libvirt_conf_la-object_event.lo CC conf/libvirt_conf_la-domain_event.lo CC conf/libvirt_conf_la-network_event.lo CC conf/libvirt_conf_la-storage_event.lo CC conf/libvirt_conf_la-node_device_event.lo CC conf/libvirt_conf_la-secret_event.lo CC conf/libvirt_conf_la-network_conf.lo CC conf/libvirt_conf_la-virnetworkobj.lo CC conf/libvirt_conf_la-networkcommon_conf.lo CC conf/libvirt_conf_la-nwfilter_params.lo CC conf/libvirt_conf_la-nwfilter_ipaddrmap.lo CC conf/libvirt_conf_la-nwfilter_conf.lo CC conf/libvirt_conf_la-virnwfilterobj.lo CC conf/libvirt_conf_la-virnwfilterbindingdef.lo CC conf/libvirt_conf_la-virnwfilterbindingobj.lo CC conf/libvirt_conf_la-virnwfilterbindingobjlist.lo CC conf/libvirt_conf_la-node_device_conf.lo CC conf/libvirt_conf_la-node_device_util.lo CC conf/libvirt_conf_la-virnodedeviceobj.lo CC conf/libvirt_conf_la-storage_adapter_conf.lo CC conf/libvirt_conf_la-storage_capabilities.lo CC conf/libvirt_conf_la-storage_conf.lo CC conf/libvirt_conf_la-virstorageobj.lo CC conf/libvirt_conf_la-interface_conf.lo CC conf/libvirt_conf_la-virinterfaceobj.lo CC conf/libvirt_conf_la-secret_conf.lo CC conf/libvirt_conf_la-virsecretobj.lo CC conf/libvirt_conf_la-cpu_conf.lo CC conf/libvirt_conf_la-virchrdev.lo CC conf/libvirt_conf_la-device_conf.lo CC cpu/libvirt_cpu_la-cpu.lo CC cpu/libvirt_cpu_la-cpu_x86.lo CC cpu/libvirt_cpu_la-cpu_s390.lo CC cpu/libvirt_cpu_la-cpu_arm.lo CC cpu/libvirt_cpu_la-cpu_ppc64.lo ../../src/cpu/cpu_arm.c:328:28: error: unused variable 'nodes' [-Werror,-Wunused-variable] g_autofree xmlNodePtr *nodes = NULL; ^ 1 error generated. gmake[3]: *** [Makefile:9202: cpu/libvirt_cpu_la-cpu_arm.lo] Error 1 gmake[3]: *** Waiting for unfinished jobs.... gmake[3]: Leaving directory '/usr<https://ci.centos.org/job/libvirt-build/systems=libvirt-freebsd-12/ws/build…'> gmake[2]: *** [Makefile:6442: all] Error 2 gmake[2]: Leaving directory '/usr<https://ci.centos.org/job/libvirt-build/systems=libvirt-freebsd-12/ws/build…'> gmake[1]: *** [Makefile:777: all-recursive] Error 1 gmake[1]: Leaving directory '/usr<https://ci.centos.org/job/libvirt-build/systems=libvirt-freebsd-12/ws/build'> gmake: *** [Makefile:670: all] Error 2 Build step 'Execute shell' marked build as failure
1 1
0 0
Build failed in Jenkins: libosinfo-check » libvirt-freebsd-12 #360
by ci@centos.org 14 May '20

14 May '20
See <https://ci.centos.org/job/libosinfo-check/systems=libvirt-freebsd-12/360/di…> ------------------------------------------ [...truncated 4.42 KB...] make: "/usr<https://ci.centos.org/job/libosinfo-check/systems=libvirt-freebsd-12/ws/bui…"> line 223: Need an operator make: "/usr<https://ci.centos.org/job/libosinfo-check/systems=libvirt-freebsd-12/ws/bui…"> line 282: Need an operator make: "/usr<https://ci.centos.org/job/libosinfo-check/systems=libvirt-freebsd-12/ws/bui…"> line 376: Need an operator make: "/usr<https://ci.centos.org/job/libosinfo-check/systems=libvirt-freebsd-12/ws/bui…"> line 387: Need an operator make: Fatal errors encountered -- cannot continue ------- Full log written to /usr<https://ci.centos.org/job/libosinfo-check/systems=libvirt-freebsd-12/ws/bui…> FAILED: meson-test /usr/local/bin/meson test --no-rebuild --print-errorlogs ninja: build stopped: subcommand failed. + cat meson-logs/testlog.txt Log of Meson test suite run on 2020-05-13T15:08:59.604609 Inherited environment: LC_CTYPE='C.UTF-8' JOB_NAME='libosinfo-check/systems=libvirt-freebsd-12' HUDSON_SERVER_COOKIE='f4d3a7a925dabf8a' BUILD_NUMBER='360' MAKE='/usr/local/bin/gmake' XDG_DATA_DIRS='/home/jenkins/build/libvirt/share:/usr/share:/usr/local/share' GI_TYPELIB_PATH='/home/jenkins/build/libvirt/lib/girepository-1.0' JOB_DISPLAY_URL='https://ci.centos.org/job/libosinfo-check/systems=libvirt-freebsd-12/displa…' C_INCLUDE_PATH='/home/jenkins/build/libvirt/include' MAIL='/var/mail/jenkins' RUN_CHANGES_DISPLAY_URL='https://ci.centos.org/job/libosinfo-check/systems=libvirt-freebsd-12/360/di…' JENKINS_URL='https://ci.centos.org/' OSINFO_SYSTEM_DIR='/home/jenkins/build/libvirt/share/osinfo' JENKINS_HOME='/var/lib/jenkins' MAKEFLAGS='-j3' PATH='/usr/libexec/ccache-wrappers:/home/jenkins/build/libvirt/bin:/sbin:/bin:/usr/sbin:/usr/bin:/usr/local/sbin:/usr/local/bin:/home/jenkins/bin' LD_LIBRARY_PATH='/home/jenkins/build/libvirt/lib' JOB_BASE_NAME='systems=libvirt-freebsd-12' CCACHE_WRAPPERSDIR='/usr/libexec/ccache-wrappers' CCACHE_MAXSIZE='2G' HUDSON_HOME='/var/lib/jenkins' PYTHONPATH='/home/jenkins/build/libvirt/lib/python3.7/site-packages' BUILD_ID='360' PERL5LIB='/home/jenkins/build/libvirt/lib/perl5/amd64-freebsd-thread-multi' OLDPWD='/usr<https://ci.centos.org/job/libosinfo-check/systems=libvirt-freebsd-12/ws/'> JENKINS_SERVER_COOKIE='f4d3a7a925dabf8a' ROOT_BUILD_CAUSE='SCMTRIGGER' PWD='/usr<https://ci.centos.org/job/libosinfo-check/systems=libvirt-freebsd-12/ws/bui…'> NINJA='/usr/local/bin/ninja' _='/usr/local/bin/java' BUILD_TAG='jenkins-libosinfo-check-systems=libvirt-freebsd-12-360' NODE_LABELS='libvirt libvirt-freebsd-12' BUILD_CAUSE='UPSTREAMTRIGGER' BUILD_DISPLAY_NAME='#360' RUN_DISPLAY_URL='https://ci.centos.org/job/libosinfo-check/systems=libvirt-freebsd-12/360/di…' USER='jenkins' HOME='/home/jenkins' BUILD_URL='https://ci.centos.org/job/libosinfo-check/systems=libvirt-freebsd-12/360/' ROOT_BUILD_CAUSE_SCMTRIGGER='true' JOB_URL='https://ci.centos.org/job/libosinfo-check/systems=libvirt-freebsd-12/' BASH_ENV='/home/jenkins/.bashrc' PS1='[\u@\h \w]$ ' SHELL='/usr/local/bin/bash' HUDSON_URL='https://ci.centos.org/' HUDSON_COOKIE='dbd16c8b-6b1b-488f-8510-360a8092c6c7' WORKSPACE='<https://ci.centos.org/job/libosinfo-check/systems=libvirt-freebsd-12/ws/'> BUILD_CAUSE_UPSTREAMTRIGGER='true' PYTHON='/usr/local/bin/python3' NODE_NAME='libvirt-freebsd-12' systems='libvirt-freebsd-12' VIRT_PREFIX='/home/jenkins/build/libvirt' PKG_CONFIG_PATH='/home/jenkins/build/libvirt/lib/pkgconfig' BLOCKSIZE='K' EXECUTOR_NUMBER='0' SHLVL='0' 1/17 libosinfo:style / syntax-check FAIL 0.10 s (exit status 1) --- command --- 15:08:59 MESON_SOURCE_ROOT='/usr<https://ci.centos.org/job/libosinfo-check/systems=libvirt-freebsd-12/ws/'> /usr<https://ci.centos.org/job/libosinfo-check/systems=libvirt-freebsd-12/ws/bui…> --- stdout --- make: stopped in /usr<https://ci.centos.org/job/libosinfo-check/systems=libvirt-freebsd-12/ws/bui…> --- stderr --- make: "/usr<https://ci.centos.org/job/libosinfo-check/systems=libvirt-freebsd-12/ws/bui…"> line 65: Missing dependency operator make: "/usr<https://ci.centos.org/job/libosinfo-check/systems=libvirt-freebsd-12/ws/bui…"> line 67: Need an operator make: "/usr<https://ci.centos.org/job/libosinfo-check/systems=libvirt-freebsd-12/ws/bui…"> line 69: Need an operator make: Unknown modifier '.' make: Unknown modifier '.' make: Unknown modifier '.' make: "/usr<https://ci.centos.org/job/libosinfo-check/systems=libvirt-freebsd-12/ws/bui…"> line 113: Missing dependency operator make: "/usr<https://ci.centos.org/job/libosinfo-check/systems=libvirt-freebsd-12/ws/bui…"> line 115: Need an operator make: "/usr<https://ci.centos.org/job/libosinfo-check/systems=libvirt-freebsd-12/ws/bui…"> line 119: Need an operator make: Unknown modifier '.' make: Unknown modifier '.' make: Unknown modifier '.' make: Unknown modifier '.' make: Unknown modifier '.' make: Unknown modifier '.' make: Unknown modifier '.' make: Unknown modifier '.' make: Unknown modifier '.' make: Unknown modifier '.' make: Unknown modifier '.' make: Unknown modifier '.' make: Unknown modifier '.' make: "/usr<https://ci.centos.org/job/libosinfo-check/systems=libvirt-freebsd-12/ws/bui…"> line 218: Need an operator make: "/usr<https://ci.centos.org/job/libosinfo-check/systems=libvirt-freebsd-12/ws/bui…"> line 221: Need an operator make: "/usr<https://ci.centos.org/job/libosinfo-check/systems=libvirt-freebsd-12/ws/bui…"> line 223: Need an operator make: "/usr<https://ci.centos.org/job/libosinfo-check/systems=libvirt-freebsd-12/ws/bui…"> line 282: Need an operator make: "/usr<https://ci.centos.org/job/libosinfo-check/systems=libvirt-freebsd-12/ws/bui…"> line 376: Need an operator make: "/usr<https://ci.centos.org/job/libosinfo-check/systems=libvirt-freebsd-12/ws/bui…"> line 387: Need an operator make: Fatal errors encountered -- cannot continue ------- 2/17 libosinfo:unit / test-db OK 0.41 s --- command --- 15:08:59 /usr<https://ci.centos.org/job/libosinfo-check/systems=libvirt-freebsd-12/ws/bui…> --- stdout --- /db/basic: OK /db/device: OK /db/platform: OK /db/os: OK /db/prop_device: OK /db/prop_platform: OK /db/prop_os: OK /db/rel_os: OK /db/identify_media: OK /db/identify_tree: OK ------- 3/17 libosinfo:unit / test-device OK 0.35 s --- command --- 15:08:59 /usr<https://ci.centos.org/job/libosinfo-check/systems=libvirt-freebsd-12/ws/bui…> --- stdout --- /device/basic: OK ------- 4/17 libosinfo:unit / test-devicelinklist OK 0.08 s --- command --- 15:09:00 /usr<https://ci.centos.org/job/libosinfo-check/systems=libvirt-freebsd-12/ws/bui…> --- stdout --- /devicelinklist/get_devices: OK ------- 5/17 libosinfo:unit / test-entity OK 0.19 s --- command --- 15:09:00 /usr<https://ci.centos.org/job/libosinfo-check/systems=libvirt-freebsd-12/ws/bui…> --- stdout --- /entity/id: OK /entity/empty_props: OK /entity/single_prop_value: OK /entity/multi_prop_value: OK /entity/multi_props: OK /entity/multi_props_clear: OK /entity/int64_props: OK ------- 6/17 libosinfo:unit / test-filter OK 0.05 s --- command --- 15:09:00 /usr<https://ci.centos.org/job/libosinfo-check/systems=libvirt-freebsd-12/ws/bui…> --- stdout --- /filter/basic: OK /filter/filter_single: OK /filter/filter_multi: OK /filter/filter_combine: OK ------- 7/17 libosinfo:unit / test-firmware OK 0.15 s --- command --- 15:09:00 /usr<https://ci.centos.org/job/libosinfo-check/systems=libvirt-freebsd-12/ws/bui…> --- stdout --- /firmware/basic: OK /firmware/loaded/basic: OK ------- 8/17 libosinfo:unit / test-image OK 0.43 s --- command --- 15:09:00 /usr<https://ci.centos.org/job/libosinfo-check/systems=libvirt-freebsd-12/ws/bui…> --- stdout --- /image/basic: OK /image/loaded: OK ------- 9/17 libosinfo:unit / test-install-script OK 0.56 s --- command --- 15:09:00 /usr<https://ci.centos.org/job/libosinfo-check/systems=libvirt-freebsd-12/ws/bui…> --- stdout --- /install-script/script_file: OK /install-script/script_data: OK /install-script/script_datamap: OK /install-script/preferred_injection_method: OK /install-script/installation_source: OK ------- 10/17 libosinfo:unit / test-list OK 0.05 s --- command --- 15:09:00 /usr<https://ci.centos.org/job/libosinfo-check/systems=libvirt-freebsd-12/ws/bui…> --- stdout --- /list/basic: OK /list/lookup: OK /list/duplicate: OK /list/union: OK /list/intersect: OK /list/filter: OK /list/iterate: OK ------- 11/17 libosinfo:unit / test-loader OK 3.08 s --- command --- 15:09:00 /usr<https://ci.centos.org/job/libosinfo-check/systems=libvirt-freebsd-12/ws/bui…> --- stdout --- /loader/basic: OK ------- 12/17 libosinfo:unit / test-media OK 0.39 s --- command --- 15:09:00 /usr<https://ci.centos.org/job/libosinfo-check/systems=libvirt-freebsd-12/ws/bui…> --- stdout --- /media/basic: OK /media/loaded/attributes: OK /media/loaded/no-installer: OK /media/loaded/installer-script: OK ------- 13/17 libosinfo:unit / test-os OK 1.35 s --- command --- 15:09:01 /usr<https://ci.centos.org/job/libosinfo-check/systems=libvirt-freebsd-12/ws/bui…> --- stdout --- /os/basic: OK /os/loader: OK /os/devices: OK /os/devices_filter: OK /os/device_driver: OK /os/find_install_script: OK /os/mulitple_short_ids: OK /os/kernel_url_arg: OK /os/cloud_image_username_arg: OK /os/device_driver/priority: OK /os/device_driver/prioritized_priority: OK /os/devices/inheritance/basic: OK /os/devices/inheritance/removal: OK /os/resources/basic: OK /os/resources/inheritance: OK /os/firmwares/inheritance: OK ------- 14/17 libosinfo:unit / test-platform OK 0.05 s --- command --- 15:09:02 /usr<https://ci.centos.org/job/libosinfo-check/systems=libvirt-freebsd-12/ws/bui…> --- stdout --- /platform/basic: OK /platform/devices: OK /platform/devices_filter: OK ------- 15/17 libosinfo:unit / test-product OK 0.11 s --- command --- 15:09:02 /usr<https://ci.centos.org/job/libosinfo-check/systems=libvirt-freebsd-12/ws/bui…> --- stdout --- /product/basic: OK /product/relproduct: OK /product/supportdate: OK ------- 16/17 libosinfo:unit / test-productfilter OK 0.16 s --- command --- 15:09:02 /usr<https://ci.centos.org/job/libosinfo-check/systems=libvirt-freebsd-12/ws/bui…> --- stdout --- /productfilter/basic: OK /productfilter/productfilter_single: OK /productfilter/productfilter_multi: OK /productfilter/productfilter_combine: OK ------- 17/17 libosinfo:unit / test-tree OK 0.39 s --- command --- 15:09:03 /usr<https://ci.centos.org/job/libosinfo-check/systems=libvirt-freebsd-12/ws/bui…> --- stdout --- /tree/basic: OK /tree/os-variants: OK /tree/create-from-treeinfo: OK ------- Ok: 16 Expected Fail: 0 Fail: 1 Unexpected Pass: 0 Skipped: 0 Timeout: 0 + exit 1 Build step 'Execute shell' marked build as failure
1 1
0 0
  • ← Newer
  • 1
  • 2
  • 3
  • 4
  • 5
  • 6
  • 7
  • 8
  • Older →

HyperKitty Powered by HyperKitty version 1.3.12.