libvirt List Archives
Sign In Sign Up
Manage this list Sign In Sign Up

Keyboard Shortcuts

Thread View

  • j: Next unread message
  • k: Previous unread message
  • j a: Jump to all threads
  • j l: Jump to MailingList overview

CI

Thread Start a new thread
Download
Threads by month
  • ----- 2025 -----
  • August
  • July
  • June
  • May
  • April
  • March
  • February
  • January
  • ----- 2024 -----
  • December
  • November
  • October
  • September
  • August
  • July
  • June
  • May
  • April
  • March
  • February
  • January
  • ----- 2023 -----
  • December
  • November
  • October
  • September
  • August
  • July
  • June
  • May
  • April
  • March
  • February
  • January
  • ----- 2022 -----
  • December
  • November
  • October
  • September
  • August
  • July
  • June
  • May
  • April
  • March
  • February
  • January
  • ----- 2021 -----
  • December
  • November
  • October
  • September
  • August
  • July
  • June
  • May
  • April
  • March
  • February
  • January
  • ----- 2020 -----
  • December
  • November
  • October
  • September
  • August
  • July
  • June
  • May
  • April
  • March
  • February
  • January
  • ----- 2019 -----
  • December
  • November
  • October
  • September
  • August
  • July
  • June
  • May
  • April
  • March
  • February
  • January
  • ----- 2018 -----
  • December
  • November
  • October
  • September
  • August
  • July
  • June
  • May
  • April
  • March
  • February
  • January
  • ----- 2017 -----
  • December
  • November
  • October
  • September
  • August
  • July
  • June
  • May
  • April
  • March
  • February
  • January
  • ----- 2016 -----
  • December
  • November
  • October
  • September
  • August
  • July
ci@lists.libvirt.org

May 2020

  • 3 participants
  • 80 discussions
Build failed in Jenkins: libvirt-perl-check » libvirt-debian-10 #1247
by ci@centos.org 26 May '20

26 May '20
See <https://ci.centos.org/job/libvirt-perl-check/systems=libvirt-debian-10/1247…> ------------------------------------------ Started by upstream project "libvirt-perl-check" build number 1247 originally caused by: Started by upstream project "libvirt-perl-build" build number 1250 originally caused by: Started by upstream project "libvirt-build" build number 1448 originally caused by: Started by an SCM change Running as SYSTEM [EnvInject] - Loading node environment variables. Building remotely on libvirt-debian-10 (libvirt) in workspace <https://ci.centos.org/job/libvirt-perl-check/systems=libvirt-debian-10/ws/> [libvirt-perl] $ /bin/sh -xe /tmp/jenkins16035617417142432113.sh + export TEST_MAINTAINER=1 + perl Build test t/005-pod.t ............ ok t/010-pod-coverage.t ... ok t/015-changes.t ........ ok t/020-constants.t ...... ok t/030-api-coverage.t ... ok I/O warning : failed to load external entity "/home/jenkins/build/libvirt/share/libvirt/cpu_map/x86_Cooperlake.xml" libvirt error code: 27, message: XML error: failed to parse xml document '/home/jenkins/build/libvirt/share/libvirt/cpu_map/x86_Cooperlake.xml' # Looks like your test exited with 2 just after 24. t/100-connect.t ........ Dubious, test returned 2 (wstat 512, 0x200) Failed 1/25 subtests (less 1 skipped subtest: 23 okay) t/200-domains.t ........ ok t/300-networks.t ....... ok t/400-storage-pools.t .. ok t/500-storage-vols.t ... ok t/600-interfaces.t ..... ok t/800-events.t ......... ok Test Summary Report ------------------- t/100-connect.t (Wstat: 512 Tests: 24 Failed: 0) Non-zero exit status: 2 Parse errors: Bad plan. You planned 25 tests but ran 24. Files=12, Tests=2012, 51 wallclock secs ( 0.71 usr 0.16 sys + 15.86 cusr 1.01 csys = 17.74 CPU) Result: FAIL Failed 1/12 test programs. 0/2012 subtests failed. Build step 'Execute shell' marked build as failure
1 2
0 0
libvirt | Pipeline #149560482 has failed for master | 1da460bf
by GitLab 26 May '20

26 May '20
Your pipeline has failed. Project: libvirt ( https://gitlab.com/libvirt/libvirt ) Branch: master ( https://gitlab.com/libvirt/libvirt/-/commits/master ) Commit: 1da460bf ( https://gitlab.com/libvirt/libvirt/-/commit/1da460bff0e83ababf393721eab881e… ) Commit Message: scripts: Fix E741 that pycodesyle is pointing o... Commit Author: Erik Skultety ( https://gitlab.com/eskultety ) Pipeline #149560482 ( https://gitlab.com/libvirt/libvirt/pipelines/149560482 ) triggered by Erik Skultety ( https://gitlab.com/eskultety ) had 11 failed builds. Job #567205746 ( https://gitlab.com/libvirt/libvirt/-/jobs/567205746/raw ) Stage: native_build Name: x64-opensuse-151 Trace: PASS: virt-aa-helper-test ============================================================================ Testsuite summary for libvirt 6.4.0 ============================================================================ # TOTAL: 137 # PASS: 130 # SKIP: 4 # XFAIL: 0 # FAIL: 3 # XPASS: 0 # ERROR: 0 ============================================================================ See tests/test-suite.log Please report to libvir-list(a)redhat.com ============================================================================ make[5]: *** [Makefile:4705: test-suite.log] Error 1 make[5]: Leaving directory '/builds/libvirt/libvirt/build/libvirt-6.4.0/_build/sub/tests' make[4]: *** [Makefile:4813: check-TESTS] Error 2 make[4]: Leaving directory '/builds/libvirt/libvirt/build/libvirt-6.4.0/_build/sub/tests' make[3]: *** [Makefile:5864: check-am] Error 2 make[3]: Leaving directory '/builds/libvirt/libvirt/build/libvirt-6.4.0/_build/sub/tests' make[2]: *** [Makefile:777: check-recursive] Error 1 make[2]: Leaving directory '/builds/libvirt/libvirt/build/libvirt-6.4.0/_build/sub' make[1]: *** [Makefile:1069: check] Error 2 make[1]: Leaving directory '/builds/libvirt/libvirt/build/libvirt-6.4.0/_build/sub' make: *** [Makefile:990: distcheck] Error 1 section_end:1590476830:build_script section_start:1590476830:after_script Running after_script section_end:1590476831:after_script section_start:1590476831:upload_artifacts_on_failure Uploading artifacts for failed job section_end:1590476833:upload_artifacts_on_failure ERROR: Job failed: exit code 1  Job #567205742 ( https://gitlab.com/libvirt/libvirt/-/jobs/567205742/raw ) Stage: native_build Name: x64-centos-8 Trace: PASS: virsh-vcpupin ============================================================================ Testsuite summary for libvirt 6.4.0 ============================================================================ # TOTAL: 133 # PASS: 129 # SKIP: 1 # XFAIL: 0 # FAIL: 3 # XPASS: 0 # ERROR: 0 ============================================================================ See tests/test-suite.log Please report to libvir-list(a)redhat.com ============================================================================ make[5]: *** [Makefile:4840: test-suite.log] Error 1 make[5]: Leaving directory '/builds/libvirt/libvirt/build/libvirt-6.4.0/_build/sub/tests' make[4]: *** [Makefile:4948: check-TESTS] Error 2 make[4]: Leaving directory '/builds/libvirt/libvirt/build/libvirt-6.4.0/_build/sub/tests' make[3]: *** [Makefile:6002: check-am] Error 2 make[3]: Leaving directory '/builds/libvirt/libvirt/build/libvirt-6.4.0/_build/sub/tests' make[2]: *** [Makefile:777: check-recursive] Error 1 make[2]: Leaving directory '/builds/libvirt/libvirt/build/libvirt-6.4.0/_build/sub' make[1]: *** [Makefile:1072: check] Error 2 make[1]: Leaving directory '/builds/libvirt/libvirt/build/libvirt-6.4.0/_build/sub' make: *** [Makefile:993: distcheck] Error 1 section_end:1590476806:build_script section_start:1590476806:after_script Running after_script section_end:1590476807:after_script section_start:1590476807:upload_artifacts_on_failure Uploading artifacts for failed job section_end:1590476809:upload_artifacts_on_failure ERROR: Job failed: exit code 1  Job #567205747 ( https://gitlab.com/libvirt/libvirt/-/jobs/567205747/raw ) Stage: native_build Name: x64-ubuntu-1804 Trace: # SKIP: 4 # XFAIL: 0 # FAIL: 3 # XPASS: 0 # ERROR: 0 ============================================================================ See tests/test-suite.log Please report to libvir-list(a)redhat.com ============================================================================ Makefile:4704: recipe for target 'test-suite.log' failed make[5]: *** [test-suite.log] Error 1 make[5]: Leaving directory '/builds/libvirt/libvirt/build/libvirt-6.4.0/_build/sub/tests' Makefile:4810: recipe for target 'check-TESTS' failed make[4]: *** [check-TESTS] Error 2 make[4]: Leaving directory '/builds/libvirt/libvirt/build/libvirt-6.4.0/_build/sub/tests' Makefile:5863: recipe for target 'check-am' failed make[3]: *** [check-am] Error 2 make[3]: Leaving directory '/builds/libvirt/libvirt/build/libvirt-6.4.0/_build/sub/tests' Makefile:777: recipe for target 'check-recursive' failed make[2]: *** [check-recursive] Error 1 make[2]: Leaving directory '/builds/libvirt/libvirt/build/libvirt-6.4.0/_build/sub' Makefile:1069: recipe for target 'check' failed make[1]: *** [check] Error 2 make[1]: Leaving directory '/builds/libvirt/libvirt/build/libvirt-6.4.0/_build/sub' Makefile:985: recipe for target 'distcheck' failed make: *** [distcheck] Error 1 section_end:1590476773:build_script section_start:1590476773:after_script Running after_script section_end:1590476774:after_script section_start:1590476774:upload_artifacts_on_failure Uploading artifacts for failed job section_end:1590476776:upload_artifacts_on_failure ERROR: Job failed: exit code 1  Job #567205743 ( https://gitlab.com/libvirt/libvirt/-/jobs/567205743/raw ) Stage: native_build Name: x64-fedora-31 Trace: PASS: virsh-vcpupin ============================================================================ Testsuite summary for libvirt 6.4.0 ============================================================================ # TOTAL: 137 # PASS: 130 # SKIP: 4 # XFAIL: 0 # FAIL: 3 # XPASS: 0 # ERROR: 0 ============================================================================ See tests/test-suite.log Please report to libvir-list(a)redhat.com ============================================================================ make[5]: *** [Makefile:4840: test-suite.log] Error 1 make[5]: Leaving directory '/builds/libvirt/libvirt/build/libvirt-6.4.0/_build/sub/tests' make[4]: *** [Makefile:4948: check-TESTS] Error 2 make[4]: Leaving directory '/builds/libvirt/libvirt/build/libvirt-6.4.0/_build/sub/tests' make[3]: *** [Makefile:6002: check-am] Error 2 make[3]: Leaving directory '/builds/libvirt/libvirt/build/libvirt-6.4.0/_build/sub/tests' make[2]: *** [Makefile:777: check-recursive] Error 1 make[2]: Leaving directory '/builds/libvirt/libvirt/build/libvirt-6.4.0/_build/sub' make[1]: *** [Makefile:1072: check] Error 2 make[1]: Leaving directory '/builds/libvirt/libvirt/build/libvirt-6.4.0/_build/sub' make: *** [Makefile:993: distcheck] Error 1 section_end:1590476766:build_script section_start:1590476766:after_script Running after_script section_end:1590476768:after_script section_start:1590476768:upload_artifacts_on_failure Uploading artifacts for failed job section_end:1590476769:upload_artifacts_on_failure ERROR: Job failed: exit code 1  Job #567205745 ( https://gitlab.com/libvirt/libvirt/-/jobs/567205745/raw ) Stage: native_build Name: x64-fedora-rawhide Trace: PASS: virsh-vcpupin ============================================================================ Testsuite summary for libvirt 6.4.0 ============================================================================ # TOTAL: 137 # PASS: 130 # SKIP: 4 # XFAIL: 0 # FAIL: 3 # XPASS: 0 # ERROR: 0 ============================================================================ See tests/test-suite.log Please report to libvir-list(a)redhat.com ============================================================================ make[5]: *** [Makefile:4840: test-suite.log] Error 1 make[5]: Leaving directory '/builds/libvirt/libvirt/build/libvirt-6.4.0/_build/sub/tests' make[4]: *** [Makefile:4948: check-TESTS] Error 2 make[4]: Leaving directory '/builds/libvirt/libvirt/build/libvirt-6.4.0/_build/sub/tests' make[3]: *** [Makefile:6002: check-am] Error 2 make[3]: Leaving directory '/builds/libvirt/libvirt/build/libvirt-6.4.0/_build/sub/tests' make[2]: *** [Makefile:777: check-recursive] Error 1 make[2]: Leaving directory '/builds/libvirt/libvirt/build/libvirt-6.4.0/_build/sub' make[1]: *** [Makefile:1078: check] Error 2 make[1]: Leaving directory '/builds/libvirt/libvirt/build/libvirt-6.4.0/_build/sub' make: *** [Makefile:997: distcheck] Error 1 section_end:1590476760:build_script section_start:1590476760:after_script Running after_script section_end:1590476761:after_script section_start:1590476761:upload_artifacts_on_failure Uploading artifacts for failed job section_end:1590476762:upload_artifacts_on_failure ERROR: Job failed: exit code 1  Job #567205738 ( https://gitlab.com/libvirt/libvirt/-/jobs/567205738/raw ) Stage: native_build Name: x64-debian-9 Trace: # SKIP: 4 # XFAIL: 0 # FAIL: 3 # XPASS: 0 # ERROR: 0 ============================================================================ See tests/test-suite.log Please report to libvir-list(a)redhat.com ============================================================================ Makefile:4704: recipe for target 'test-suite.log' failed make[5]: *** [test-suite.log] Error 1 make[5]: Leaving directory '/builds/libvirt/libvirt/build/libvirt-6.4.0/_build/sub/tests' Makefile:4810: recipe for target 'check-TESTS' failed make[4]: *** [check-TESTS] Error 2 make[4]: Leaving directory '/builds/libvirt/libvirt/build/libvirt-6.4.0/_build/sub/tests' Makefile:5863: recipe for target 'check-am' failed make[3]: *** [check-am] Error 2 make[3]: Leaving directory '/builds/libvirt/libvirt/build/libvirt-6.4.0/_build/sub/tests' Makefile:777: recipe for target 'check-recursive' failed make[2]: *** [check-recursive] Error 1 make[2]: Leaving directory '/builds/libvirt/libvirt/build/libvirt-6.4.0/_build/sub' Makefile:1069: recipe for target 'check' failed make[1]: *** [check] Error 2 make[1]: Leaving directory '/builds/libvirt/libvirt/build/libvirt-6.4.0/_build/sub' Makefile:985: recipe for target 'distcheck' failed make: *** [distcheck] Error 1 section_end:1590476753:build_script section_start:1590476753:after_script Running after_script section_end:1590476755:after_script section_start:1590476755:upload_artifacts_on_failure Uploading artifacts for failed job section_end:1590476756:upload_artifacts_on_failure ERROR: Job failed: exit code 1  Job #567205744 ( https://gitlab.com/libvirt/libvirt/-/jobs/567205744/raw ) Stage: native_build Name: x64-fedora-32 Trace: PASS: virsh-vcpupin ============================================================================ Testsuite summary for libvirt 6.4.0 ============================================================================ # TOTAL: 137 # PASS: 130 # SKIP: 4 # XFAIL: 0 # FAIL: 3 # XPASS: 0 # ERROR: 0 ============================================================================ See tests/test-suite.log Please report to libvir-list(a)redhat.com ============================================================================ make[5]: *** [Makefile:4840: test-suite.log] Error 1 make[5]: Leaving directory '/builds/libvirt/libvirt/build/libvirt-6.4.0/_build/sub/tests' make[4]: *** [Makefile:4948: check-TESTS] Error 2 make[4]: Leaving directory '/builds/libvirt/libvirt/build/libvirt-6.4.0/_build/sub/tests' make[3]: *** [Makefile:6002: check-am] Error 2 make[3]: Leaving directory '/builds/libvirt/libvirt/build/libvirt-6.4.0/_build/sub/tests' make[2]: *** [Makefile:777: check-recursive] Error 1 make[2]: Leaving directory '/builds/libvirt/libvirt/build/libvirt-6.4.0/_build/sub' make[1]: *** [Makefile:1072: check] Error 2 make[1]: Leaving directory '/builds/libvirt/libvirt/build/libvirt-6.4.0/_build/sub' make: *** [Makefile:993: distcheck] Error 1 section_end:1590476723:build_script section_start:1590476723:after_script Running after_script section_end:1590476724:after_script section_start:1590476724:upload_artifacts_on_failure Uploading artifacts for failed job section_end:1590476726:upload_artifacts_on_failure ERROR: Job failed: exit code 1  Job #567205740 ( https://gitlab.com/libvirt/libvirt/-/jobs/567205740/raw ) Stage: native_build Name: x64-debian-sid Trace: PASS: virt-aa-helper-test ============================================================================ Testsuite summary for libvirt 6.4.0 ============================================================================ # TOTAL: 137 # PASS: 130 # SKIP: 4 # XFAIL: 0 # FAIL: 3 # XPASS: 0 # ERROR: 0 ============================================================================ See tests/test-suite.log Please report to libvir-list(a)redhat.com ============================================================================ make[5]: *** [Makefile:4840: test-suite.log] Error 1 make[5]: Leaving directory '/builds/libvirt/libvirt/build/libvirt-6.4.0/_build/sub/tests' make[4]: *** [Makefile:4948: check-TESTS] Error 2 make[4]: Leaving directory '/builds/libvirt/libvirt/build/libvirt-6.4.0/_build/sub/tests' make[3]: *** [Makefile:6002: check-am] Error 2 make[3]: Leaving directory '/builds/libvirt/libvirt/build/libvirt-6.4.0/_build/sub/tests' make[2]: *** [Makefile:777: check-recursive] Error 1 make[2]: Leaving directory '/builds/libvirt/libvirt/build/libvirt-6.4.0/_build/sub' make[1]: *** [Makefile:1078: check] Error 2 make[1]: Leaving directory '/builds/libvirt/libvirt/build/libvirt-6.4.0/_build/sub' make: *** [Makefile:997: distcheck] Error 1 section_end:1590476577:build_script section_start:1590476577:after_script Running after_script section_end:1590476578:after_script section_start:1590476578:upload_artifacts_on_failure Uploading artifacts for failed job section_end:1590476580:upload_artifacts_on_failure ERROR: Job failed: exit code 1  Job #567205748 ( https://gitlab.com/libvirt/libvirt/-/jobs/567205748/raw ) Stage: native_build Name: x64-ubuntu-2004 Trace: PASS: virt-aa-helper-test ============================================================================ Testsuite summary for libvirt 6.4.0 ============================================================================ # TOTAL: 137 # PASS: 130 # SKIP: 4 # XFAIL: 0 # FAIL: 3 # XPASS: 0 # ERROR: 0 ============================================================================ See tests/test-suite.log Please report to libvir-list(a)redhat.com ============================================================================ make[5]: *** [Makefile:4840: test-suite.log] Error 1 make[5]: Leaving directory '/builds/libvirt/libvirt/build/libvirt-6.4.0/_build/sub/tests' make[4]: *** [Makefile:4948: check-TESTS] Error 2 make[4]: Leaving directory '/builds/libvirt/libvirt/build/libvirt-6.4.0/_build/sub/tests' make[3]: *** [Makefile:6002: check-am] Error 2 make[3]: Leaving directory '/builds/libvirt/libvirt/build/libvirt-6.4.0/_build/sub/tests' make[2]: *** [Makefile:777: check-recursive] Error 1 make[2]: Leaving directory '/builds/libvirt/libvirt/build/libvirt-6.4.0/_build/sub' make[1]: *** [Makefile:1072: check] Error 2 make[1]: Leaving directory '/builds/libvirt/libvirt/build/libvirt-6.4.0/_build/sub' make: *** [Makefile:993: distcheck] Error 1 section_end:1590476563:build_script section_start:1590476563:after_script Running after_script section_end:1590476564:after_script section_start:1590476564:upload_artifacts_on_failure Uploading artifacts for failed job section_end:1590476566:upload_artifacts_on_failure ERROR: Job failed: exit code 1  Job #567205739 ( https://gitlab.com/libvirt/libvirt/-/jobs/567205739/raw ) Stage: native_build Name: x64-debian-10 Trace: PASS: virt-aa-helper-test ============================================================================ Testsuite summary for libvirt 6.4.0 ============================================================================ # TOTAL: 137 # PASS: 130 # SKIP: 4 # XFAIL: 0 # FAIL: 3 # XPASS: 0 # ERROR: 0 ============================================================================ See tests/test-suite.log Please report to libvir-list(a)redhat.com ============================================================================ make[5]: *** [Makefile:4840: test-suite.log] Error 1 make[5]: Leaving directory '/builds/libvirt/libvirt/build/libvirt-6.4.0/_build/sub/tests' make[4]: *** [Makefile:4948: check-TESTS] Error 2 make[4]: Leaving directory '/builds/libvirt/libvirt/build/libvirt-6.4.0/_build/sub/tests' make[3]: *** [Makefile:6002: check-am] Error 2 make[3]: Leaving directory '/builds/libvirt/libvirt/build/libvirt-6.4.0/_build/sub/tests' make[2]: *** [Makefile:777: check-recursive] Error 1 make[2]: Leaving directory '/builds/libvirt/libvirt/build/libvirt-6.4.0/_build/sub' make[1]: *** [Makefile:1072: check] Error 2 make[1]: Leaving directory '/builds/libvirt/libvirt/build/libvirt-6.4.0/_build/sub' make: *** [Makefile:993: distcheck] Error 1 section_end:1590476561:build_script section_start:1590476561:after_script Running after_script section_end:1590476562:after_script section_start:1590476562:upload_artifacts_on_failure Uploading artifacts for failed job section_end:1590476563:upload_artifacts_on_failure ERROR: Job failed: exit code 1  Job #567205741 ( https://gitlab.com/libvirt/libvirt/-/jobs/567205741/raw ) Stage: native_build Name: x64-centos-7 Trace: make[6]: Leaving directory `/builds/libvirt/libvirt/build/libvirt-6.4.0/_build/tests' ============================================================================ Testsuite summary for libvirt 6.4.0 ============================================================================ # TOTAL: 133 # PASS: 130 # SKIP: 0 # XFAIL: 0 # FAIL: 3 # XPASS: 0 # ERROR: 0 ============================================================================ See tests/test-suite.log Please report to libvir-list(a)redhat.com ============================================================================ make[5]: *** [test-suite.log] Error 1 make[5]: Leaving directory `/builds/libvirt/libvirt/build/libvirt-6.4.0/_build/tests' make[4]: *** [check-TESTS] Error 2 make[4]: Leaving directory `/builds/libvirt/libvirt/build/libvirt-6.4.0/_build/tests' make[3]: *** [check-am] Error 2 make[3]: Leaving directory `/builds/libvirt/libvirt/build/libvirt-6.4.0/_build/tests' make[2]: *** [check-recursive] Error 1 make[2]: Leaving directory `/builds/libvirt/libvirt/build/libvirt-6.4.0/_build' make[1]: *** [check] Error 2 make[1]: Leaving directory `/builds/libvirt/libvirt/build/libvirt-6.4.0/_build' make: *** [distcheck] Error 1 section_end:1590476440:build_script section_start:1590476440:after_script Running after_script section_end:1590476441:after_script section_start:1590476441:upload_artifacts_on_failure Uploading artifacts for failed job section_end:1590476443:upload_artifacts_on_failure ERROR: Job failed: exit code 1  -- You're receiving this email because of your account on gitlab.com.
1 0
0 0
libvirt | Pipeline #149475576 has failed for master | 3944f685
by GitLab 25 May '20

25 May '20
Your pipeline has failed. Project: libvirt ( https://gitlab.com/libvirt/libvirt ) Branch: master ( https://gitlab.com/libvirt/libvirt/-/commits/master ) Commit: 3944f685 ( https://gitlab.com/libvirt/libvirt/-/commit/3944f6855b9d4df73754bb6e5c8023d… ) Commit Message: cpu_map: Add Cooperlake x86 CPU model The step... Commit Author: Jiri Denemark ( https://gitlab.com/jirkade ) Pipeline #149475576 ( https://gitlab.com/libvirt/libvirt/pipelines/149475576 ) triggered by Jiri Denemark ( https://gitlab.com/jirkade ) had 11 failed builds. Job #566886544 ( https://gitlab.com/libvirt/libvirt/-/jobs/566886544/raw ) Stage: native_build Name: x64-centos-8 Trace: PASS: virsh-vcpupin ============================================================================ Testsuite summary for libvirt 6.4.0 ============================================================================ # TOTAL: 133 # PASS: 129 # SKIP: 1 # XFAIL: 0 # FAIL: 3 # XPASS: 0 # ERROR: 0 ============================================================================ See tests/test-suite.log Please report to libvir-list(a)redhat.com ============================================================================ make[5]: *** [Makefile:4840: test-suite.log] Error 1 make[5]: Leaving directory '/builds/libvirt/libvirt/build/libvirt-6.4.0/_build/sub/tests' make[4]: *** [Makefile:4948: check-TESTS] Error 2 make[4]: Leaving directory '/builds/libvirt/libvirt/build/libvirt-6.4.0/_build/sub/tests' make[3]: *** [Makefile:6002: check-am] Error 2 make[3]: Leaving directory '/builds/libvirt/libvirt/build/libvirt-6.4.0/_build/sub/tests' make[2]: *** [Makefile:777: check-recursive] Error 1 make[2]: Leaving directory '/builds/libvirt/libvirt/build/libvirt-6.4.0/_build/sub' make[1]: *** [Makefile:1072: check] Error 2 make[1]: Leaving directory '/builds/libvirt/libvirt/build/libvirt-6.4.0/_build/sub' make: *** [Makefile:993: distcheck] Error 1 section_end:1590442649:build_script section_start:1590442649:after_script Running after_script section_end:1590442650:after_script section_start:1590442650:upload_artifacts_on_failure Uploading artifacts for failed job section_end:1590442652:upload_artifacts_on_failure ERROR: Job failed: exit code 1  Job #566886548 ( https://gitlab.com/libvirt/libvirt/-/jobs/566886548/raw ) Stage: native_build Name: x64-opensuse-151 Trace: PASS: virt-aa-helper-test ============================================================================ Testsuite summary for libvirt 6.4.0 ============================================================================ # TOTAL: 137 # PASS: 130 # SKIP: 4 # XFAIL: 0 # FAIL: 3 # XPASS: 0 # ERROR: 0 ============================================================================ See tests/test-suite.log Please report to libvir-list(a)redhat.com ============================================================================ make[5]: *** [Makefile:4705: test-suite.log] Error 1 make[5]: Leaving directory '/builds/libvirt/libvirt/build/libvirt-6.4.0/_build/sub/tests' make[4]: *** [Makefile:4813: check-TESTS] Error 2 make[4]: Leaving directory '/builds/libvirt/libvirt/build/libvirt-6.4.0/_build/sub/tests' make[3]: *** [Makefile:5864: check-am] Error 2 make[3]: Leaving directory '/builds/libvirt/libvirt/build/libvirt-6.4.0/_build/sub/tests' make[2]: *** [Makefile:777: check-recursive] Error 1 make[2]: Leaving directory '/builds/libvirt/libvirt/build/libvirt-6.4.0/_build/sub' make[1]: *** [Makefile:1069: check] Error 2 make[1]: Leaving directory '/builds/libvirt/libvirt/build/libvirt-6.4.0/_build/sub' make: *** [Makefile:990: distcheck] Error 1 section_end:1590442557:build_script section_start:1590442557:after_script Running after_script section_end:1590442558:after_script section_start:1590442558:upload_artifacts_on_failure Uploading artifacts for failed job section_end:1590442560:upload_artifacts_on_failure ERROR: Job failed: exit code 1  Job #566886549 ( https://gitlab.com/libvirt/libvirt/-/jobs/566886549/raw ) Stage: native_build Name: x64-ubuntu-1804 Trace: # SKIP: 4 # XFAIL: 0 # FAIL: 3 # XPASS: 0 # ERROR: 0 ============================================================================ See tests/test-suite.log Please report to libvir-list(a)redhat.com ============================================================================ Makefile:4704: recipe for target 'test-suite.log' failed make[5]: *** [test-suite.log] Error 1 make[5]: Leaving directory '/builds/libvirt/libvirt/build/libvirt-6.4.0/_build/sub/tests' Makefile:4810: recipe for target 'check-TESTS' failed make[4]: *** [check-TESTS] Error 2 make[4]: Leaving directory '/builds/libvirt/libvirt/build/libvirt-6.4.0/_build/sub/tests' Makefile:5863: recipe for target 'check-am' failed make[3]: *** [check-am] Error 2 make[3]: Leaving directory '/builds/libvirt/libvirt/build/libvirt-6.4.0/_build/sub/tests' Makefile:777: recipe for target 'check-recursive' failed make[2]: *** [check-recursive] Error 1 make[2]: Leaving directory '/builds/libvirt/libvirt/build/libvirt-6.4.0/_build/sub' Makefile:1069: recipe for target 'check' failed make[1]: *** [check] Error 2 make[1]: Leaving directory '/builds/libvirt/libvirt/build/libvirt-6.4.0/_build/sub' Makefile:985: recipe for target 'distcheck' failed make: *** [distcheck] Error 1 section_end:1590442516:build_script section_start:1590442516:after_script Running after_script section_end:1590442517:after_script section_start:1590442517:upload_artifacts_on_failure Uploading artifacts for failed job section_end:1590442518:upload_artifacts_on_failure ERROR: Job failed: exit code 1  Job #566886547 ( https://gitlab.com/libvirt/libvirt/-/jobs/566886547/raw ) Stage: native_build Name: x64-fedora-rawhide Trace: PASS: virsh-vcpupin ============================================================================ Testsuite summary for libvirt 6.4.0 ============================================================================ # TOTAL: 137 # PASS: 130 # SKIP: 4 # XFAIL: 0 # FAIL: 3 # XPASS: 0 # ERROR: 0 ============================================================================ See tests/test-suite.log Please report to libvir-list(a)redhat.com ============================================================================ make[5]: *** [Makefile:4840: test-suite.log] Error 1 make[5]: Leaving directory '/builds/libvirt/libvirt/build/libvirt-6.4.0/_build/sub/tests' make[4]: *** [Makefile:4948: check-TESTS] Error 2 make[4]: Leaving directory '/builds/libvirt/libvirt/build/libvirt-6.4.0/_build/sub/tests' make[3]: *** [Makefile:6002: check-am] Error 2 make[3]: Leaving directory '/builds/libvirt/libvirt/build/libvirt-6.4.0/_build/sub/tests' make[2]: *** [Makefile:777: check-recursive] Error 1 make[2]: Leaving directory '/builds/libvirt/libvirt/build/libvirt-6.4.0/_build/sub' make[1]: *** [Makefile:1078: check] Error 2 make[1]: Leaving directory '/builds/libvirt/libvirt/build/libvirt-6.4.0/_build/sub' make: *** [Makefile:997: distcheck] Error 1 section_end:1590442506:build_script section_start:1590442506:after_script Running after_script section_end:1590442507:after_script section_start:1590442507:upload_artifacts_on_failure Uploading artifacts for failed job section_end:1590442509:upload_artifacts_on_failure ERROR: Job failed: exit code 1  Job #566886540 ( https://gitlab.com/libvirt/libvirt/-/jobs/566886540/raw ) Stage: native_build Name: x64-debian-9 Trace: # SKIP: 4 # XFAIL: 0 # FAIL: 3 # XPASS: 0 # ERROR: 0 ============================================================================ See tests/test-suite.log Please report to libvir-list(a)redhat.com ============================================================================ Makefile:4704: recipe for target 'test-suite.log' failed make[5]: *** [test-suite.log] Error 1 make[5]: Leaving directory '/builds/libvirt/libvirt/build/libvirt-6.4.0/_build/sub/tests' Makefile:4810: recipe for target 'check-TESTS' failed make[4]: *** [check-TESTS] Error 2 make[4]: Leaving directory '/builds/libvirt/libvirt/build/libvirt-6.4.0/_build/sub/tests' Makefile:5863: recipe for target 'check-am' failed make[3]: *** [check-am] Error 2 make[3]: Leaving directory '/builds/libvirt/libvirt/build/libvirt-6.4.0/_build/sub/tests' Makefile:777: recipe for target 'check-recursive' failed make[2]: *** [check-recursive] Error 1 make[2]: Leaving directory '/builds/libvirt/libvirt/build/libvirt-6.4.0/_build/sub' Makefile:1069: recipe for target 'check' failed make[1]: *** [check] Error 2 make[1]: Leaving directory '/builds/libvirt/libvirt/build/libvirt-6.4.0/_build/sub' Makefile:985: recipe for target 'distcheck' failed make: *** [distcheck] Error 1 section_end:1590442503:build_script section_start:1590442503:after_script Running after_script section_end:1590442504:after_script section_start:1590442504:upload_artifacts_on_failure Uploading artifacts for failed job section_end:1590442506:upload_artifacts_on_failure ERROR: Job failed: exit code 1  Job #566886546 ( https://gitlab.com/libvirt/libvirt/-/jobs/566886546/raw ) Stage: native_build Name: x64-fedora-32 Trace: PASS: virsh-vcpupin ============================================================================ Testsuite summary for libvirt 6.4.0 ============================================================================ # TOTAL: 137 # PASS: 130 # SKIP: 4 # XFAIL: 0 # FAIL: 3 # XPASS: 0 # ERROR: 0 ============================================================================ See tests/test-suite.log Please report to libvir-list(a)redhat.com ============================================================================ make[5]: *** [Makefile:4840: test-suite.log] Error 1 make[5]: Leaving directory '/builds/libvirt/libvirt/build/libvirt-6.4.0/_build/sub/tests' make[4]: *** [Makefile:4948: check-TESTS] Error 2 make[4]: Leaving directory '/builds/libvirt/libvirt/build/libvirt-6.4.0/_build/sub/tests' make[3]: *** [Makefile:6002: check-am] Error 2 make[3]: Leaving directory '/builds/libvirt/libvirt/build/libvirt-6.4.0/_build/sub/tests' make[2]: *** [Makefile:777: check-recursive] Error 1 make[2]: Leaving directory '/builds/libvirt/libvirt/build/libvirt-6.4.0/_build/sub' make[1]: *** [Makefile:1072: check] Error 2 make[1]: Leaving directory '/builds/libvirt/libvirt/build/libvirt-6.4.0/_build/sub' make: *** [Makefile:993: distcheck] Error 1 section_end:1590442488:build_script section_start:1590442488:after_script Running after_script section_end:1590442489:after_script section_start:1590442489:upload_artifacts_on_failure Uploading artifacts for failed job section_end:1590442491:upload_artifacts_on_failure ERROR: Job failed: exit code 1  Job #566886545 ( https://gitlab.com/libvirt/libvirt/-/jobs/566886545/raw ) Stage: native_build Name: x64-fedora-31 Trace: PASS: virsh-vcpupin ============================================================================ Testsuite summary for libvirt 6.4.0 ============================================================================ # TOTAL: 137 # PASS: 130 # SKIP: 4 # XFAIL: 0 # FAIL: 3 # XPASS: 0 # ERROR: 0 ============================================================================ See tests/test-suite.log Please report to libvir-list(a)redhat.com ============================================================================ make[5]: *** [Makefile:4840: test-suite.log] Error 1 make[5]: Leaving directory '/builds/libvirt/libvirt/build/libvirt-6.4.0/_build/sub/tests' make[4]: *** [Makefile:4948: check-TESTS] Error 2 make[4]: Leaving directory '/builds/libvirt/libvirt/build/libvirt-6.4.0/_build/sub/tests' make[3]: *** [Makefile:6002: check-am] Error 2 make[3]: Leaving directory '/builds/libvirt/libvirt/build/libvirt-6.4.0/_build/sub/tests' make[2]: *** [Makefile:777: check-recursive] Error 1 make[2]: Leaving directory '/builds/libvirt/libvirt/build/libvirt-6.4.0/_build/sub' make[1]: *** [Makefile:1072: check] Error 2 make[1]: Leaving directory '/builds/libvirt/libvirt/build/libvirt-6.4.0/_build/sub' make: *** [Makefile:993: distcheck] Error 1 section_end:1590442412:build_script section_start:1590442412:after_script Running after_script section_end:1590442413:after_script section_start:1590442413:upload_artifacts_on_failure Uploading artifacts for failed job section_end:1590442415:upload_artifacts_on_failure ERROR: Job failed: exit code 1  Job #566886541 ( https://gitlab.com/libvirt/libvirt/-/jobs/566886541/raw ) Stage: native_build Name: x64-debian-10 Trace: PASS: virt-aa-helper-test ============================================================================ Testsuite summary for libvirt 6.4.0 ============================================================================ # TOTAL: 137 # PASS: 130 # SKIP: 4 # XFAIL: 0 # FAIL: 3 # XPASS: 0 # ERROR: 0 ============================================================================ See tests/test-suite.log Please report to libvir-list(a)redhat.com ============================================================================ make[5]: *** [Makefile:4840: test-suite.log] Error 1 make[5]: Leaving directory '/builds/libvirt/libvirt/build/libvirt-6.4.0/_build/sub/tests' make[4]: *** [Makefile:4948: check-TESTS] Error 2 make[4]: Leaving directory '/builds/libvirt/libvirt/build/libvirt-6.4.0/_build/sub/tests' make[3]: *** [Makefile:6002: check-am] Error 2 make[3]: Leaving directory '/builds/libvirt/libvirt/build/libvirt-6.4.0/_build/sub/tests' make[2]: *** [Makefile:777: check-recursive] Error 1 make[2]: Leaving directory '/builds/libvirt/libvirt/build/libvirt-6.4.0/_build/sub' make[1]: *** [Makefile:1072: check] Error 2 make[1]: Leaving directory '/builds/libvirt/libvirt/build/libvirt-6.4.0/_build/sub' make: *** [Makefile:993: distcheck] Error 1 section_end:1590442359:build_script section_start:1590442359:after_script Running after_script section_end:1590442361:after_script section_start:1590442361:upload_artifacts_on_failure Uploading artifacts for failed job section_end:1590442362:upload_artifacts_on_failure ERROR: Job failed: exit code 1  Job #566886550 ( https://gitlab.com/libvirt/libvirt/-/jobs/566886550/raw ) Stage: native_build Name: x64-ubuntu-2004 Trace: PASS: virt-aa-helper-test ============================================================================ Testsuite summary for libvirt 6.4.0 ============================================================================ # TOTAL: 137 # PASS: 130 # SKIP: 4 # XFAIL: 0 # FAIL: 3 # XPASS: 0 # ERROR: 0 ============================================================================ See tests/test-suite.log Please report to libvir-list(a)redhat.com ============================================================================ make[5]: *** [Makefile:4840: test-suite.log] Error 1 make[5]: Leaving directory '/builds/libvirt/libvirt/build/libvirt-6.4.0/_build/sub/tests' make[4]: *** [Makefile:4948: check-TESTS] Error 2 make[4]: Leaving directory '/builds/libvirt/libvirt/build/libvirt-6.4.0/_build/sub/tests' make[3]: *** [Makefile:6002: check-am] Error 2 make[3]: Leaving directory '/builds/libvirt/libvirt/build/libvirt-6.4.0/_build/sub/tests' make[2]: *** [Makefile:777: check-recursive] Error 1 make[2]: Leaving directory '/builds/libvirt/libvirt/build/libvirt-6.4.0/_build/sub' make[1]: *** [Makefile:1072: check] Error 2 make[1]: Leaving directory '/builds/libvirt/libvirt/build/libvirt-6.4.0/_build/sub' make: *** [Makefile:993: distcheck] Error 1 section_end:1590442348:build_script section_start:1590442348:after_script Running after_script section_end:1590442350:after_script section_start:1590442350:upload_artifacts_on_failure Uploading artifacts for failed job section_end:1590442351:upload_artifacts_on_failure ERROR: Job failed: exit code 1  Job #566886542 ( https://gitlab.com/libvirt/libvirt/-/jobs/566886542/raw ) Stage: native_build Name: x64-debian-sid Trace: PASS: virt-aa-helper-test ============================================================================ Testsuite summary for libvirt 6.4.0 ============================================================================ # TOTAL: 137 # PASS: 130 # SKIP: 4 # XFAIL: 0 # FAIL: 3 # XPASS: 0 # ERROR: 0 ============================================================================ See tests/test-suite.log Please report to libvir-list(a)redhat.com ============================================================================ make[5]: *** [Makefile:4840: test-suite.log] Error 1 make[5]: Leaving directory '/builds/libvirt/libvirt/build/libvirt-6.4.0/_build/sub/tests' make[4]: *** [Makefile:4948: check-TESTS] Error 2 make[4]: Leaving directory '/builds/libvirt/libvirt/build/libvirt-6.4.0/_build/sub/tests' make[3]: *** [Makefile:6002: check-am] Error 2 make[3]: Leaving directory '/builds/libvirt/libvirt/build/libvirt-6.4.0/_build/sub/tests' make[2]: *** [Makefile:777: check-recursive] Error 1 make[2]: Leaving directory '/builds/libvirt/libvirt/build/libvirt-6.4.0/_build/sub' make[1]: *** [Makefile:1078: check] Error 2 make[1]: Leaving directory '/builds/libvirt/libvirt/build/libvirt-6.4.0/_build/sub' make: *** [Makefile:997: distcheck] Error 1 section_end:1590442303:build_script section_start:1590442303:after_script Running after_script section_end:1590442304:after_script section_start:1590442304:upload_artifacts_on_failure Uploading artifacts for failed job section_end:1590442306:upload_artifacts_on_failure ERROR: Job failed: exit code 1  Job #566886543 ( https://gitlab.com/libvirt/libvirt/-/jobs/566886543/raw ) Stage: native_build Name: x64-centos-7 Trace: make[6]: Leaving directory `/builds/libvirt/libvirt/build/libvirt-6.4.0/_build/tests' ============================================================================ Testsuite summary for libvirt 6.4.0 ============================================================================ # TOTAL: 133 # PASS: 130 # SKIP: 0 # XFAIL: 0 # FAIL: 3 # XPASS: 0 # ERROR: 0 ============================================================================ See tests/test-suite.log Please report to libvir-list(a)redhat.com ============================================================================ make[5]: *** [test-suite.log] Error 1 make[5]: Leaving directory `/builds/libvirt/libvirt/build/libvirt-6.4.0/_build/tests' make[4]: *** [check-TESTS] Error 2 make[4]: Leaving directory `/builds/libvirt/libvirt/build/libvirt-6.4.0/_build/tests' make[3]: *** [check-am] Error 2 make[3]: Leaving directory `/builds/libvirt/libvirt/build/libvirt-6.4.0/_build/tests' make[2]: *** [check-recursive] Error 1 make[2]: Leaving directory `/builds/libvirt/libvirt/build/libvirt-6.4.0/_build' make[1]: *** [check] Error 2 make[1]: Leaving directory `/builds/libvirt/libvirt/build/libvirt-6.4.0/_build' make: *** [distcheck] Error 1 section_end:1590442208:build_script section_start:1590442208:after_script Running after_script section_end:1590442209:after_script section_start:1590442209:upload_artifacts_on_failure Uploading artifacts for failed job section_end:1590442211:upload_artifacts_on_failure ERROR: Job failed: exit code 1  -- You're receiving this email because of your account on gitlab.com.
1 0
0 0
Build failed in Jenkins: libosinfo-check » libvirt-freebsd-11 #372
by ci@centos.org 21 May '20

21 May '20
See <https://ci.centos.org/job/libosinfo-check/systems=libvirt-freebsd-11/372/di…> ------------------------------------------ [...truncated 11.64 KB...] prohibit_undesirable_word_seq prohibit_xalloc_without_use prohibit_test_double_equal prohibit_xfreopen_without_use redundant_const space_tab trailing_blank unmarked_diagnostics useless_cpp_parens 27.00 TAB_in_indentation 27.00 Wundef_boolean 28.00 avoid_if_before_free 27.00 avoid_attribute_unused_in_header 28.00 bracket_spacing_check 28.00 bindtextdomain 28.00 cast_of_x_alloc_return_value 28.00 const_long_option 28.00 cast_of_argument_to_free 28.00 error_message_period 28.00 copyright_format 28.00 error_message_warn_fatal 28.00 preprocessor_indentation 28.00 po_check 28.00 prohibit_HAVE_MBRTOWC 28.00 prohibit_argmatch_without_use 28.00 prohibit_assert_without_use 28.00 prohibit_atoi_atof 28.00 prohibit_S_IS_definition 28.00 prohibit_backup_files 27.00 prohibit_canonicalize_without_use 27.00 prohibit_cloexec_without_use 28.00 prohibit_c_ctype_without_use 28.00 prohibit_close_stream_without_use 27.00 prohibit_dirent_without_use 27.00 prohibit_double_semicolon 28.00 prohibit_defined_have_decl_tests 28.00 prohibit_empty_lines_at_EOF 28.00 prohibit_error_without_use 28.00 prohibit_doubled_word 28.00 prohibit_hash_pjw_without_use 28.00 prohibit_hash_without_use 28.00 prohibit_inttostr_without_use 28.00 prohibit_getopt_without_use 28.00 prohibit_long_options_without_use 28.00 prohibit_ignore_value_without_use 28.00 prohibit_openat_without_use 28.00 prohibit_magic_number_exit 28.00 prohibit_quote_without_use 28.00 prohibit_quotearg_without_use 28.00 prohibit_posixver_without_use 28.00 prohibit_root_dev_ino_without_use 28.00 prohibit_safe_read_without_use 28.00 prohibit_path_max_allocation ------- 2/17 libosinfo:unit / test-db OK 0.31 s --- command --- 12:35:43 /usr<https://ci.centos.org/job/libosinfo-check/systems=libvirt-freebsd-11/ws/bui…> --- stdout --- /db/basic: OK /db/device: OK /db/platform: OK /db/os: OK /db/prop_device: OK /db/prop_platform: OK /db/prop_os: OK /db/rel_os: OK /db/identify_media: OK /db/identify_tree: OK ------- 3/17 libosinfo:unit / test-device OK 0.10 s --- command --- 12:35:43 /usr<https://ci.centos.org/job/libosinfo-check/systems=libvirt-freebsd-11/ws/bui…> --- stdout --- /device/basic: OK ------- 4/17 libosinfo:unit / test-devicelinklist OK 0.06 s --- command --- 12:35:43 /usr<https://ci.centos.org/job/libosinfo-check/systems=libvirt-freebsd-11/ws/bui…> --- stdout --- /devicelinklist/get_devices: OK ------- 5/17 libosinfo:unit / test-entity OK 0.07 s --- command --- 12:35:43 /usr<https://ci.centos.org/job/libosinfo-check/systems=libvirt-freebsd-11/ws/bui…> --- stdout --- /entity/id: OK /entity/empty_props: OK /entity/single_prop_value: OK /entity/multi_prop_value: OK /entity/multi_props: OK /entity/multi_props_clear: OK /entity/int64_props: OK ------- 6/17 libosinfo:unit / test-filter OK 0.08 s --- command --- 12:35:44 /usr<https://ci.centos.org/job/libosinfo-check/systems=libvirt-freebsd-11/ws/bui…> --- stdout --- /filter/basic: OK /filter/filter_single: OK /filter/filter_multi: OK /filter/filter_combine: OK ------- 7/17 libosinfo:unit / test-firmware OK 0.19 s --- command --- 12:35:44 /usr<https://ci.centos.org/job/libosinfo-check/systems=libvirt-freebsd-11/ws/bui…> --- stdout --- /firmware/basic: OK /firmware/loaded/basic: OK ------- 8/17 libosinfo:unit / test-image OK 0.68 s --- command --- 12:35:44 /usr<https://ci.centos.org/job/libosinfo-check/systems=libvirt-freebsd-11/ws/bui…> --- stdout --- /image/basic: OK /image/loaded: OK ------- 9/17 libosinfo:unit / test-install-script OK 1.37 s --- command --- 12:35:45 /usr<https://ci.centos.org/job/libosinfo-check/systems=libvirt-freebsd-11/ws/bui…> --- stdout --- /install-script/script_file: OK /install-script/script_data: OK /install-script/script_datamap: OK /install-script/preferred_injection_method: OK /install-script/installation_source: OK ------- 10/17 libosinfo:unit / test-list OK 0.23 s --- command --- 12:35:46 /usr<https://ci.centos.org/job/libosinfo-check/systems=libvirt-freebsd-11/ws/bui…> --- stdout --- /list/basic: OK /list/lookup: OK /list/duplicate: OK /list/union: OK /list/intersect: OK /list/filter: OK /list/iterate: OK ------- 11/17 libosinfo:unit / test-loader OK 14.73 s --- command --- 12:35:46 /usr<https://ci.centos.org/job/libosinfo-check/systems=libvirt-freebsd-11/ws/bui…> --- stdout --- /loader/basic: OK ------- 12/17 libosinfo:unit / test-media OK 1.06 s --- command --- 12:36:01 /usr<https://ci.centos.org/job/libosinfo-check/systems=libvirt-freebsd-11/ws/bui…> --- stdout --- /media/basic: OK /media/loaded/attributes: OK /media/loaded/no-installer: OK /media/loaded/installer-script: OK ------- 13/17 libosinfo:unit / test-os OK 4.74 s --- command --- 12:36:02 /usr<https://ci.centos.org/job/libosinfo-check/systems=libvirt-freebsd-11/ws/bui…> --- stdout --- /os/basic: OK /os/loader: OK /os/devices: OK /os/devices_filter: OK /os/device_driver: OK /os/find_install_script: OK /os/mulitple_short_ids: OK /os/kernel_url_arg: OK /os/cloud_image_username_arg: OK /os/device_driver/priority: OK /os/device_driver/prioritized_priority: OK /os/devices/inheritance/basic: OK /os/devices/inheritance/removal: OK /os/resources/basic: OK /os/resources/inheritance: OK /os/firmwares/inheritance: OK ------- 14/17 libosinfo:unit / test-platform OK 0.05 s --- command --- 12:36:07 /usr<https://ci.centos.org/job/libosinfo-check/systems=libvirt-freebsd-11/ws/bui…> --- stdout --- /platform/basic: OK /platform/devices: OK /platform/devices_filter: OK ------- 15/17 libosinfo:unit / test-product OK 1.28 s --- command --- 12:36:07 /usr<https://ci.centos.org/job/libosinfo-check/systems=libvirt-freebsd-11/ws/bui…> --- stdout --- /product/basic: OK /product/relproduct: OK /product/supportdate: OK ------- 16/17 libosinfo:unit / test-productfilter OK 0.11 s --- command --- 12:36:08 /usr<https://ci.centos.org/job/libosinfo-check/systems=libvirt-freebsd-11/ws/bui…> --- stdout --- /productfilter/basic: OK /productfilter/productfilter_single: OK /productfilter/productfilter_multi: OK /productfilter/productfilter_combine: OK ------- 17/17 libosinfo:unit / test-tree OK 0.80 s --- command --- 12:36:08 /usr<https://ci.centos.org/job/libosinfo-check/systems=libvirt-freebsd-11/ws/bui…> --- stdout --- /tree/basic: OK /tree/os-variants: OK /tree/create-from-treeinfo: OK ------- Ok: 16 Expected Fail: 0 Fail: 0 Unexpected Pass: 0 Skipped: 0 Timeout: 1 + exit 1 Build step 'Execute shell' marked build as failure
1 1
0 0
Build failed in Jenkins: libvirt-check » libvirt-fedora-rawhide #1170
by ci@centos.org 19 May '20

19 May '20
See <https://ci.centos.org/job/libvirt-check/systems=libvirt-fedora-rawhide/1170…> ------------------------------------------ Started by upstream project "libvirt-check" build number 1170 originally caused by: Started by upstream project "libvirt-syntax-check" build number 1189 originally caused by: Started by upstream project "libvirt-build" build number 1436 originally caused by: Started by an SCM change Running as SYSTEM [EnvInject] - Loading node environment variables. Building remotely on libvirt-fedora-rawhide (libvirt) in workspace <https://ci.centos.org/job/libvirt-check/systems=libvirt-fedora-rawhide/ws/> [libvirt] $ /bin/sh -xe /tmp/jenkins4295331228964327131.sh ++ uname + '[' Linux '!=' FreeBSD ']' + export VIR_TEST_EXPENSIVE=1 + VIR_TEST_EXPENSIVE=1 + export VIR_TEST_DEBUG=2 + VIR_TEST_DEBUG=2 + cd build + /usr/bin/make check /usr/bin/make check-recursive make[1]: Entering directory '<https://ci.centos.org/job/libvirt-check/systems=libvirt-fedora-rawhide/ws/b…'> Making check in . make[2]: Entering directory '<https://ci.centos.org/job/libvirt-check/systems=libvirt-fedora-rawhide/ws/b…'> /usr/bin/make check-local make[3]: Entering directory '<https://ci.centos.org/job/libvirt-check/systems=libvirt-fedora-rawhide/ws/b…'> /usr/bin/make all-recursive make[4]: Entering directory '<https://ci.centos.org/job/libvirt-check/systems=libvirt-fedora-rawhide/ws/b…'> Making all in . make[5]: Entering directory '<https://ci.centos.org/job/libvirt-check/systems=libvirt-fedora-rawhide/ws/b…'> make[5]: Leaving directory '<https://ci.centos.org/job/libvirt-check/systems=libvirt-fedora-rawhide/ws/b…'> Making all in include/libvirt make[5]: Entering directory '<https://ci.centos.org/job/libvirt-check/systems=libvirt-fedora-rawhide/ws/b…'> make[5]: Nothing to be done for 'all'. make[5]: Leaving directory '<https://ci.centos.org/job/libvirt-check/systems=libvirt-fedora-rawhide/ws/b…'> Making all in src make[5]: Entering directory '<https://ci.centos.org/job/libvirt-check/systems=libvirt-fedora-rawhide/ws/b…'> /usr/bin/make all-am make[6]: Entering directory '<https://ci.centos.org/job/libvirt-check/systems=libvirt-fedora-rawhide/ws/b…'> make[6]: Nothing to be done for 'all-am'. make[6]: Leaving directory '<https://ci.centos.org/job/libvirt-check/systems=libvirt-fedora-rawhide/ws/b…'> make[5]: Leaving directory '<https://ci.centos.org/job/libvirt-check/systems=libvirt-fedora-rawhide/ws/b…'> Making all in tools make[5]: Entering directory '<https://ci.centos.org/job/libvirt-check/systems=libvirt-fedora-rawhide/ws/b…'> /usr/bin/make all-am make[6]: Entering directory '<https://ci.centos.org/job/libvirt-check/systems=libvirt-fedora-rawhide/ws/b…'> make[6]: Nothing to be done for 'all-am'. make[6]: Leaving directory '<https://ci.centos.org/job/libvirt-check/systems=libvirt-fedora-rawhide/ws/b…'> make[5]: Leaving directory '<https://ci.centos.org/job/libvirt-check/systems=libvirt-fedora-rawhide/ws/b…'> Making all in docs make[5]: Entering directory '<https://ci.centos.org/job/libvirt-check/systems=libvirt-fedora-rawhide/ws/b…'> make[5]: Leaving directory '<https://ci.centos.org/job/libvirt-check/systems=libvirt-fedora-rawhide/ws/b…'> Making all in tests make[5]: Entering directory '<https://ci.centos.org/job/libvirt-check/systems=libvirt-fedora-rawhide/ws/b…'> make[5]: Nothing to be done for 'all'. make[5]: Leaving directory '<https://ci.centos.org/job/libvirt-check/systems=libvirt-fedora-rawhide/ws/b…'> Making all in po make[5]: Entering directory '<https://ci.centos.org/job/libvirt-check/systems=libvirt-fedora-rawhide/ws/b…'> make[5]: Nothing to be done for 'all'. make[5]: Leaving directory '<https://ci.centos.org/job/libvirt-check/systems=libvirt-fedora-rawhide/ws/b…'> Making all in examples make[5]: Entering directory '<https://ci.centos.org/job/libvirt-check/systems=libvirt-fedora-rawhide/ws/b…'> make[5]: Nothing to be done for 'all'. make[5]: Leaving directory '<https://ci.centos.org/job/libvirt-check/systems=libvirt-fedora-rawhide/ws/b…'> make[4]: Leaving directory '<https://ci.centos.org/job/libvirt-check/systems=libvirt-fedora-rawhide/ws/b…'> make[3]: Leaving directory '<https://ci.centos.org/job/libvirt-check/systems=libvirt-fedora-rawhide/ws/b…'> make[2]: Leaving directory '<https://ci.centos.org/job/libvirt-check/systems=libvirt-fedora-rawhide/ws/b…'> Making check in include/libvirt make[2]: Entering directory '<https://ci.centos.org/job/libvirt-check/systems=libvirt-fedora-rawhide/ws/b…'> make[2]: Nothing to be done for 'check'. make[2]: Leaving directory '<https://ci.centos.org/job/libvirt-check/systems=libvirt-fedora-rawhide/ws/b…'> Making check in src make[2]: Entering directory '<https://ci.centos.org/job/libvirt-check/systems=libvirt-fedora-rawhide/ws/b…'> /usr/bin/make check-am make[3]: Entering directory '<https://ci.centos.org/job/libvirt-check/systems=libvirt-fedora-rawhide/ws/b…'> /usr/bin/make check-local make[4]: Entering directory '<https://ci.centos.org/job/libvirt-check/systems=libvirt-fedora-rawhide/ws/b…'> GEN ../../src/remote_protocol-struct GEN ../../src/lxc_protocol-struct GEN ../../src/qemu_protocol-struct GEN ../../src/virnetprotocol-struct GEN ../../src/virkeepaliveprotocol-struct GEN ../../src/lxc_monitor_protocol-struct GEN ../../src/lock_protocol-struct GEN ../../src/admin_protocol-struct GEN check-symfile GEN check-symsorting GEN check-drivername GEN check-driverimpls GEN check-aclrules GEN check-aclperms GEN check-admin-symfile GEN check-admin-symsorting GEN check-admin-drivername GEN check-augeas Syntax error in lens definition Failed to load qemu/test_libvirtd_qemu.aug qemu/test_libvirtd_qemu.aug:96.3-203.1:exception thrown in test qemu/test_libvirtd_qemu.aug:96.8-.34:exception: Iterated lens matched less than it should Lens: ../../src/qemu/libvirtd_qemu.aug:170.13-.43: Last match: ../../src/qemu/libvirtd_qemu.aug:18.52-.113: Not matching: ../../src/qemu/libvirtd_qemu.aug:12.19-.31: Error encountered at 48:27 (1615 characters into string) <\n "/dev/ptmx", "/dev/kvm"|=|,\n]\nsave_image_format = "raw> Tree generated so far: /default_tls_x509_cert_dir = "/etc/pki/qemu" /default_tls_x509_verify = "1" /default_tls_x509_secret_uuid = "00000000-0000-0000-0000-000000000000" /vnc_listen = "0.0.0.0" /vnc_auto_unix_socket = "1" /vnc_tls = "1" /vnc_tls_x509_cert_dir = "/etc/pki/libvirt-vnc" /vnc_tls_x509_secret_uuid = "00000000-0000-0000-0000-000000000000" /vnc_tls_x509_verify = "1" /vnc_password = "XYZ12345" /vnc_sasl = "1" /vnc_sasl_dir = "/some/directory/sasl2" /vnc_allow_host_audio = "0" /spice_listen = "0.0.0.0" /spice_tls = "1" /spice_tls_x509_cert_dir = "/etc/pki/libvirt-spice" /spice_auto_unix_socket = "1" /spice_password = "XYZ12345" /spice_sasl = "1" /spice_sasl_dir = "/some/directory/sasl2" /chardev_tls = "1" /chardev_tls_x509_cert_dir = "/etc/pki/libvirt-chardev" /chardev_tls_x509_verify = "1" /chardev_tls_x509_secret_uuid = "00000000-0000-0000-0000-000000000000" /vxhs_tls = "1" /vxhs_tls_x509_cert_dir = "/etc/pki/libvirt-vxhs" /nbd_tls = "1" /nbd_tls_x509_cert_dir = "/etc/pki/libvirt-nbd" /migrate_tls_x509_cert_dir = "/etc/pki/libvirt-migrate" /migrate_tls_x509_verify = "1" /migrate_tls_x509_secret_uuid = "00000000-0000-0000-0000-000000000000" /nographics_allow_host_audio = "1" /remote_display_port_min = "5900" /remote_display_port_max = "65535" /remote_websocket_port_min = "5700" /remote_websocket_port_max = "65535" /security_driver = "selinux" /security_default_confined = "1" /security_require_confined = "1" /user = "root" /group = "root" /dynamic_ownership = "1" /remember_owner = "1" /cgroup_controllers /cgroup_controllers/1 = "cpu" /cgroup_controllers/2 = "devices" /cgroup_controllers/3 = "memory" /cgroup_controllers/4 = "blkio" /cgroup_controllers/5 = "cpuset" /cgroup_controllers/6 = "cpuacct" make[4]: *** [Makefile:14849: check-augeas] Error 1 make[4]: *** Waiting for unfinished jobs.... make[4]: Leaving directory '<https://ci.centos.org/job/libvirt-check/systems=libvirt-fedora-rawhide/ws/b…'> make[3]: *** [Makefile:12731: check-am] Error 2 make[3]: Leaving directory '<https://ci.centos.org/job/libvirt-check/systems=libvirt-fedora-rawhide/ws/b…'> make[2]: *** [Makefile:12733: check] Error 2 make[2]: Leaving directory '<https://ci.centos.org/job/libvirt-check/systems=libvirt-fedora-rawhide/ws/b…'> make[1]: *** [Makefile:777: check-recursive] Error 1 make[1]: Leaving directory '<https://ci.centos.org/job/libvirt-check/systems=libvirt-fedora-rawhide/ws/b…'> make: *** [Makefile:1078: check] Error 2 + xargs cat + find -name test-suite.log + exit 1 Build step 'Execute shell' marked build as failure
1 1
0 0
Build failed in Jenkins: libvirt-check » libvirt-fedora-32 #1170
by ci@centos.org 19 May '20

19 May '20
See <https://ci.centos.org/job/libvirt-check/systems=libvirt-fedora-32/1170/disp…> ------------------------------------------ Started by upstream project "libvirt-check" build number 1170 originally caused by: Started by upstream project "libvirt-syntax-check" build number 1189 originally caused by: Started by upstream project "libvirt-build" build number 1436 originally caused by: Started by an SCM change Running as SYSTEM [EnvInject] - Loading node environment variables. Building remotely on libvirt-fedora-32 (libvirt) in workspace <https://ci.centos.org/job/libvirt-check/systems=libvirt-fedora-32/ws/> [libvirt] $ /bin/sh -xe /tmp/jenkins16099967706358906173.sh ++ uname + '[' Linux '!=' FreeBSD ']' + export VIR_TEST_EXPENSIVE=1 + VIR_TEST_EXPENSIVE=1 + export VIR_TEST_DEBUG=2 + VIR_TEST_DEBUG=2 + cd build + /usr/bin/make check /usr/bin/make check-recursive make[1]: Entering directory '<https://ci.centos.org/job/libvirt-check/systems=libvirt-fedora-32/ws/build'> Making check in . make[2]: Entering directory '<https://ci.centos.org/job/libvirt-check/systems=libvirt-fedora-32/ws/build'> /usr/bin/make check-local make[3]: Entering directory '<https://ci.centos.org/job/libvirt-check/systems=libvirt-fedora-32/ws/build'> /usr/bin/make all-recursive make[4]: Entering directory '<https://ci.centos.org/job/libvirt-check/systems=libvirt-fedora-32/ws/build'> Making all in . make[5]: Entering directory '<https://ci.centos.org/job/libvirt-check/systems=libvirt-fedora-32/ws/build'> make[5]: Leaving directory '<https://ci.centos.org/job/libvirt-check/systems=libvirt-fedora-32/ws/build'> Making all in include/libvirt make[5]: Entering directory '<https://ci.centos.org/job/libvirt-check/systems=libvirt-fedora-32/ws/build/…'> make[5]: Nothing to be done for 'all'. make[5]: Leaving directory '<https://ci.centos.org/job/libvirt-check/systems=libvirt-fedora-32/ws/build/…'> Making all in src make[5]: Entering directory '<https://ci.centos.org/job/libvirt-check/systems=libvirt-fedora-32/ws/build/…'> /usr/bin/make all-am make[6]: Entering directory '<https://ci.centos.org/job/libvirt-check/systems=libvirt-fedora-32/ws/build/…'> make[6]: Nothing to be done for 'all-am'. make[6]: Leaving directory '<https://ci.centos.org/job/libvirt-check/systems=libvirt-fedora-32/ws/build/…'> make[5]: Leaving directory '<https://ci.centos.org/job/libvirt-check/systems=libvirt-fedora-32/ws/build/…'> Making all in tools make[5]: Entering directory '<https://ci.centos.org/job/libvirt-check/systems=libvirt-fedora-32/ws/build/…'> /usr/bin/make all-am make[6]: Entering directory '<https://ci.centos.org/job/libvirt-check/systems=libvirt-fedora-32/ws/build/…'> make[6]: Nothing to be done for 'all-am'. make[6]: Leaving directory '<https://ci.centos.org/job/libvirt-check/systems=libvirt-fedora-32/ws/build/…'> make[5]: Leaving directory '<https://ci.centos.org/job/libvirt-check/systems=libvirt-fedora-32/ws/build/…'> Making all in docs make[5]: Entering directory '<https://ci.centos.org/job/libvirt-check/systems=libvirt-fedora-32/ws/build/…'> make[5]: Leaving directory '<https://ci.centos.org/job/libvirt-check/systems=libvirt-fedora-32/ws/build/…'> Making all in tests make[5]: Entering directory '<https://ci.centos.org/job/libvirt-check/systems=libvirt-fedora-32/ws/build/…'> make[5]: Nothing to be done for 'all'. make[5]: Leaving directory '<https://ci.centos.org/job/libvirt-check/systems=libvirt-fedora-32/ws/build/…'> Making all in po make[5]: Entering directory '<https://ci.centos.org/job/libvirt-check/systems=libvirt-fedora-32/ws/build/…'> make[5]: Nothing to be done for 'all'. make[5]: Leaving directory '<https://ci.centos.org/job/libvirt-check/systems=libvirt-fedora-32/ws/build/…'> Making all in examples make[5]: Entering directory '<https://ci.centos.org/job/libvirt-check/systems=libvirt-fedora-32/ws/build/…'> make[5]: Nothing to be done for 'all'. make[5]: Leaving directory '<https://ci.centos.org/job/libvirt-check/systems=libvirt-fedora-32/ws/build/…'> make[4]: Leaving directory '<https://ci.centos.org/job/libvirt-check/systems=libvirt-fedora-32/ws/build'> make[3]: Leaving directory '<https://ci.centos.org/job/libvirt-check/systems=libvirt-fedora-32/ws/build'> make[2]: Leaving directory '<https://ci.centos.org/job/libvirt-check/systems=libvirt-fedora-32/ws/build'> Making check in include/libvirt make[2]: Entering directory '<https://ci.centos.org/job/libvirt-check/systems=libvirt-fedora-32/ws/build/…'> make[2]: Nothing to be done for 'check'. make[2]: Leaving directory '<https://ci.centos.org/job/libvirt-check/systems=libvirt-fedora-32/ws/build/…'> Making check in src make[2]: Entering directory '<https://ci.centos.org/job/libvirt-check/systems=libvirt-fedora-32/ws/build/…'> /usr/bin/make check-am make[3]: Entering directory '<https://ci.centos.org/job/libvirt-check/systems=libvirt-fedora-32/ws/build/…'> /usr/bin/make check-local make[4]: Entering directory '<https://ci.centos.org/job/libvirt-check/systems=libvirt-fedora-32/ws/build/…'> GEN ../../src/remote_protocol-struct GEN ../../src/lxc_protocol-struct GEN ../../src/qemu_protocol-struct GEN ../../src/virnetprotocol-struct GEN ../../src/virkeepaliveprotocol-struct GEN ../../src/lxc_monitor_protocol-struct GEN ../../src/lock_protocol-struct GEN ../../src/admin_protocol-struct GEN check-symfile GEN check-symsorting GEN check-drivername GEN check-driverimpls GEN check-aclrules GEN check-aclperms GEN check-admin-symfile GEN check-admin-symsorting GEN check-admin-drivername GEN check-augeas Syntax error in lens definition Failed to load qemu/test_libvirtd_qemu.aug qemu/test_libvirtd_qemu.aug:96.3-203.1:exception thrown in test qemu/test_libvirtd_qemu.aug:96.8-.34:exception: Iterated lens matched less than it should Lens: ../../src/qemu/libvirtd_qemu.aug:170.13-.43: Last match: ../../src/qemu/libvirtd_qemu.aug:18.52-.113: Not matching: ../../src/qemu/libvirtd_qemu.aug:12.19-.31: Error encountered at 48:27 (1615 characters into string) <\n "/dev/ptmx", "/dev/kvm"|=|,\n]\nsave_image_format = "raw> Tree generated so far: /default_tls_x509_cert_dir = "/etc/pki/qemu" /default_tls_x509_verify = "1" /default_tls_x509_secret_uuid = "00000000-0000-0000-0000-000000000000" /vnc_listen = "0.0.0.0" /vnc_auto_unix_socket = "1" /vnc_tls = "1" /vnc_tls_x509_cert_dir = "/etc/pki/libvirt-vnc" /vnc_tls_x509_secret_uuid = "00000000-0000-0000-0000-000000000000" /vnc_tls_x509_verify = "1" /vnc_password = "XYZ12345" /vnc_sasl = "1" /vnc_sasl_dir = "/some/directory/sasl2" /vnc_allow_host_audio = "0" /spice_listen = "0.0.0.0" /spice_tls = "1" /spice_tls_x509_cert_dir = "/etc/pki/libvirt-spice" /spice_auto_unix_socket = "1" /spice_password = "XYZ12345" /spice_sasl = "1" /spice_sasl_dir = "/some/directory/sasl2" /chardev_tls = "1" /chardev_tls_x509_cert_dir = "/etc/pki/libvirt-chardev" /chardev_tls_x509_verify = "1" /chardev_tls_x509_secret_uuid = "00000000-0000-0000-0000-000000000000" /vxhs_tls = "1" /vxhs_tls_x509_cert_dir = "/etc/pki/libvirt-vxhs" /nbd_tls = "1" /nbd_tls_x509_cert_dir = "/etc/pki/libvirt-nbd" /migrate_tls_x509_cert_dir = "/etc/pki/libvirt-migrate" /migrate_tls_x509_verify = "1" /migrate_tls_x509_secret_uuid = "00000000-0000-0000-0000-000000000000" /nographics_allow_host_audio = "1" /remote_display_port_min = "5900" /remote_display_port_max = "65535" /remote_websocket_port_min = "5700" /remote_websocket_port_max = "65535" /security_driver = "selinux" /security_default_confined = "1" /security_require_confined = "1" /user = "root" /group = "root" /dynamic_ownership = "1" /remember_owner = "1" /cgroup_controllers /cgroup_controllers/1 = "cpu" /cgroup_controllers/2 = "devices" /cgroup_controllers/3 = "memory" /cgroup_controllers/4 = "blkio" /cgroup_controllers/5 = "cpuset" /cgroup_controllers/6 = "cpuacct" make[4]: *** [Makefile:14849: check-augeas] Error 1 make[4]: *** Waiting for unfinished jobs.... make[4]: Leaving directory '<https://ci.centos.org/job/libvirt-check/systems=libvirt-fedora-32/ws/build/…'> make[3]: *** [Makefile:12731: check-am] Error 2 make[3]: Leaving directory '<https://ci.centos.org/job/libvirt-check/systems=libvirt-fedora-32/ws/build/…'> make[2]: *** [Makefile:12733: check] Error 2 make[2]: Leaving directory '<https://ci.centos.org/job/libvirt-check/systems=libvirt-fedora-32/ws/build/…'> make[1]: *** [Makefile:777: check-recursive] Error 1 make[1]: Leaving directory '<https://ci.centos.org/job/libvirt-check/systems=libvirt-fedora-32/ws/build'> make: *** [Makefile:1072: check] Error 2 + xargs cat + find -name test-suite.log + exit 1 Build step 'Execute shell' marked build as failure
1 1
0 0
Build failed in Jenkins: libvirt-check » libvirt-fedora-31 #1170
by ci@centos.org 19 May '20

19 May '20
See <https://ci.centos.org/job/libvirt-check/systems=libvirt-fedora-31/1170/disp…> ------------------------------------------ Started by upstream project "libvirt-check" build number 1170 originally caused by: Started by upstream project "libvirt-syntax-check" build number 1189 originally caused by: Started by upstream project "libvirt-build" build number 1436 originally caused by: Started by an SCM change Running as SYSTEM [EnvInject] - Loading node environment variables. Building remotely on libvirt-fedora-31 (libvirt) in workspace <https://ci.centos.org/job/libvirt-check/systems=libvirt-fedora-31/ws/> [libvirt] $ /bin/sh -xe /tmp/jenkins4351116908529978892.sh ++ uname + '[' Linux '!=' FreeBSD ']' + export VIR_TEST_EXPENSIVE=1 + VIR_TEST_EXPENSIVE=1 + export VIR_TEST_DEBUG=2 + VIR_TEST_DEBUG=2 + cd build + /usr/bin/make check /usr/bin/make check-recursive make[1]: Entering directory '<https://ci.centos.org/job/libvirt-check/systems=libvirt-fedora-31/ws/build'> Making check in . make[2]: Entering directory '<https://ci.centos.org/job/libvirt-check/systems=libvirt-fedora-31/ws/build'> /usr/bin/make check-local make[3]: Entering directory '<https://ci.centos.org/job/libvirt-check/systems=libvirt-fedora-31/ws/build'> /usr/bin/make all-recursive make[4]: Entering directory '<https://ci.centos.org/job/libvirt-check/systems=libvirt-fedora-31/ws/build'> Making all in . make[5]: Entering directory '<https://ci.centos.org/job/libvirt-check/systems=libvirt-fedora-31/ws/build'> make[5]: Leaving directory '<https://ci.centos.org/job/libvirt-check/systems=libvirt-fedora-31/ws/build'> Making all in include/libvirt make[5]: Entering directory '<https://ci.centos.org/job/libvirt-check/systems=libvirt-fedora-31/ws/build/…'> make[5]: Nothing to be done for 'all'. make[5]: Leaving directory '<https://ci.centos.org/job/libvirt-check/systems=libvirt-fedora-31/ws/build/…'> Making all in src make[5]: Entering directory '<https://ci.centos.org/job/libvirt-check/systems=libvirt-fedora-31/ws/build/…'> /usr/bin/make all-am make[6]: Entering directory '<https://ci.centos.org/job/libvirt-check/systems=libvirt-fedora-31/ws/build/…'> make[6]: Nothing to be done for 'all-am'. make[6]: Leaving directory '<https://ci.centos.org/job/libvirt-check/systems=libvirt-fedora-31/ws/build/…'> make[5]: Leaving directory '<https://ci.centos.org/job/libvirt-check/systems=libvirt-fedora-31/ws/build/…'> Making all in tools make[5]: Entering directory '<https://ci.centos.org/job/libvirt-check/systems=libvirt-fedora-31/ws/build/…'> /usr/bin/make all-am make[6]: Entering directory '<https://ci.centos.org/job/libvirt-check/systems=libvirt-fedora-31/ws/build/…'> make[6]: Nothing to be done for 'all-am'. make[6]: Leaving directory '<https://ci.centos.org/job/libvirt-check/systems=libvirt-fedora-31/ws/build/…'> make[5]: Leaving directory '<https://ci.centos.org/job/libvirt-check/systems=libvirt-fedora-31/ws/build/…'> Making all in docs make[5]: Entering directory '<https://ci.centos.org/job/libvirt-check/systems=libvirt-fedora-31/ws/build/…'> make[5]: Leaving directory '<https://ci.centos.org/job/libvirt-check/systems=libvirt-fedora-31/ws/build/…'> Making all in tests make[5]: Entering directory '<https://ci.centos.org/job/libvirt-check/systems=libvirt-fedora-31/ws/build/…'> make[5]: Nothing to be done for 'all'. make[5]: Leaving directory '<https://ci.centos.org/job/libvirt-check/systems=libvirt-fedora-31/ws/build/…'> Making all in po make[5]: Entering directory '<https://ci.centos.org/job/libvirt-check/systems=libvirt-fedora-31/ws/build/…'> make[5]: Nothing to be done for 'all'. make[5]: Leaving directory '<https://ci.centos.org/job/libvirt-check/systems=libvirt-fedora-31/ws/build/…'> Making all in examples make[5]: Entering directory '<https://ci.centos.org/job/libvirt-check/systems=libvirt-fedora-31/ws/build/…'> make[5]: Nothing to be done for 'all'. make[5]: Leaving directory '<https://ci.centos.org/job/libvirt-check/systems=libvirt-fedora-31/ws/build/…'> make[4]: Leaving directory '<https://ci.centos.org/job/libvirt-check/systems=libvirt-fedora-31/ws/build'> make[3]: Leaving directory '<https://ci.centos.org/job/libvirt-check/systems=libvirt-fedora-31/ws/build'> make[2]: Leaving directory '<https://ci.centos.org/job/libvirt-check/systems=libvirt-fedora-31/ws/build'> Making check in include/libvirt make[2]: Entering directory '<https://ci.centos.org/job/libvirt-check/systems=libvirt-fedora-31/ws/build/…'> make[2]: Nothing to be done for 'check'. make[2]: Leaving directory '<https://ci.centos.org/job/libvirt-check/systems=libvirt-fedora-31/ws/build/…'> Making check in src make[2]: Entering directory '<https://ci.centos.org/job/libvirt-check/systems=libvirt-fedora-31/ws/build/…'> /usr/bin/make check-am make[3]: Entering directory '<https://ci.centos.org/job/libvirt-check/systems=libvirt-fedora-31/ws/build/…'> /usr/bin/make check-local make[4]: Entering directory '<https://ci.centos.org/job/libvirt-check/systems=libvirt-fedora-31/ws/build/…'> GEN ../../src/remote_protocol-struct GEN ../../src/lxc_protocol-struct GEN ../../src/qemu_protocol-struct GEN ../../src/virnetprotocol-struct GEN ../../src/virkeepaliveprotocol-struct GEN ../../src/lxc_monitor_protocol-struct GEN ../../src/lock_protocol-struct GEN ../../src/admin_protocol-struct GEN check-symfile GEN check-symsorting GEN check-drivername GEN check-driverimpls GEN check-aclrules GEN check-aclperms GEN check-admin-symfile GEN check-admin-symsorting GEN check-admin-drivername GEN check-augeas Syntax error in lens definition Failed to load qemu/test_libvirtd_qemu.aug qemu/test_libvirtd_qemu.aug:96.3-203.1:exception thrown in test qemu/test_libvirtd_qemu.aug:96.8-.34:exception: Iterated lens matched less than it should Lens: ../../src/qemu/libvirtd_qemu.aug:170.13-.43: Last match: ../../src/qemu/libvirtd_qemu.aug:18.52-.113: Not matching: ../../src/qemu/libvirtd_qemu.aug:12.19-.31: Error encountered at 48:27 (1615 characters into string) <\n "/dev/ptmx", "/dev/kvm"|=|,\n]\nsave_image_format = "raw> Tree generated so far: /default_tls_x509_cert_dir = "/etc/pki/qemu" /default_tls_x509_verify = "1" /default_tls_x509_secret_uuid = "00000000-0000-0000-0000-000000000000" /vnc_listen = "0.0.0.0" /vnc_auto_unix_socket = "1" /vnc_tls = "1" /vnc_tls_x509_cert_dir = "/etc/pki/libvirt-vnc" /vnc_tls_x509_secret_uuid = "00000000-0000-0000-0000-000000000000" /vnc_tls_x509_verify = "1" /vnc_password = "XYZ12345" /vnc_sasl = "1" /vnc_sasl_dir = "/some/directory/sasl2" /vnc_allow_host_audio = "0" /spice_listen = "0.0.0.0" /spice_tls = "1" /spice_tls_x509_cert_dir = "/etc/pki/libvirt-spice" /spice_auto_unix_socket = "1" /spice_password = "XYZ12345" /spice_sasl = "1" /spice_sasl_dir = "/some/directory/sasl2" /chardev_tls = "1" /chardev_tls_x509_cert_dir = "/etc/pki/libvirt-chardev" /chardev_tls_x509_verify = "1" /chardev_tls_x509_secret_uuid = "00000000-0000-0000-0000-000000000000" /vxhs_tls = "1" /vxhs_tls_x509_cert_dir = "/etc/pki/libvirt-vxhs" /nbd_tls = "1" /nbd_tls_x509_cert_dir = "/etc/pki/libvirt-nbd" /migrate_tls_x509_cert_dir = "/etc/pki/libvirt-migrate" /migrate_tls_x509_verify = "1" /migrate_tls_x509_secret_uuid = "00000000-0000-0000-0000-000000000000" /nographics_allow_host_audio = "1" /remote_display_port_min = "5900" /remote_display_port_max = "65535" /remote_websocket_port_min = "5700" /remote_websocket_port_max = "65535" /security_driver = "selinux" /security_default_confined = "1" /security_require_confined = "1" /user = "root" /group = "root" /dynamic_ownership = "1" /remember_owner = "1" /cgroup_controllers /cgroup_controllers/1 = "cpu" /cgroup_controllers/2 = "devices" /cgroup_controllers/3 = "memory" /cgroup_controllers/4 = "blkio" /cgroup_controllers/5 = "cpuset" /cgroup_controllers/6 = "cpuacct" make[4]: *** [Makefile:14849: check-augeas] Error 1 make[4]: *** Waiting for unfinished jobs.... make[4]: Leaving directory '<https://ci.centos.org/job/libvirt-check/systems=libvirt-fedora-31/ws/build/…'> make[3]: *** [Makefile:12731: check-am] Error 2 make[3]: Leaving directory '<https://ci.centos.org/job/libvirt-check/systems=libvirt-fedora-31/ws/build/…'> make[2]: *** [Makefile:12733: check] Error 2 make[2]: Leaving directory '<https://ci.centos.org/job/libvirt-check/systems=libvirt-fedora-31/ws/build/…'> make[1]: *** [Makefile:777: check-recursive] Error 1 make[1]: Leaving directory '<https://ci.centos.org/job/libvirt-check/systems=libvirt-fedora-31/ws/build'> make: *** [Makefile:1072: check] Error 2 + find -name test-suite.log + xargs cat + exit 1 Build step 'Execute shell' marked build as failure
1 1
0 0
Build failed in Jenkins: libvirt-check » libvirt-debian-9 #1170
by ci@centos.org 19 May '20

19 May '20
See <https://ci.centos.org/job/libvirt-check/systems=libvirt-debian-9/1170/displ…> ------------------------------------------ Started by upstream project "libvirt-check" build number 1170 originally caused by: Started by upstream project "libvirt-syntax-check" build number 1189 originally caused by: Started by upstream project "libvirt-build" build number 1436 originally caused by: Started by an SCM change Running as SYSTEM [EnvInject] - Loading node environment variables. Building remotely on libvirt-debian-9 (libvirt) in workspace <https://ci.centos.org/job/libvirt-check/systems=libvirt-debian-9/ws/> [libvirt] $ /bin/sh -xe /tmp/jenkins8682309388986390057.sh + uname + [ Linux != FreeBSD ] + export VIR_TEST_EXPENSIVE=1 + export VIR_TEST_DEBUG=2 + cd build + /usr/bin/make check /usr/bin/make check-recursive make[1]: Entering directory '<https://ci.centos.org/job/libvirt-check/systems=libvirt-debian-9/ws/build'> Making check in . make[2]: Entering directory '<https://ci.centos.org/job/libvirt-check/systems=libvirt-debian-9/ws/build'> /usr/bin/make check-local make[3]: Entering directory '<https://ci.centos.org/job/libvirt-check/systems=libvirt-debian-9/ws/build'> /usr/bin/make all-recursive make[4]: Entering directory '<https://ci.centos.org/job/libvirt-check/systems=libvirt-debian-9/ws/build'> Making all in . make[5]: Entering directory '<https://ci.centos.org/job/libvirt-check/systems=libvirt-debian-9/ws/build'> make[5]: Leaving directory '<https://ci.centos.org/job/libvirt-check/systems=libvirt-debian-9/ws/build'> Making all in include/libvirt make[5]: Entering directory '<https://ci.centos.org/job/libvirt-check/systems=libvirt-debian-9/ws/build/i…'> make[5]: Nothing to be done for 'all'. make[5]: Leaving directory '<https://ci.centos.org/job/libvirt-check/systems=libvirt-debian-9/ws/build/i…'> Making all in src make[5]: Entering directory '<https://ci.centos.org/job/libvirt-check/systems=libvirt-debian-9/ws/build/s…'> /usr/bin/make all-am make[6]: Entering directory '<https://ci.centos.org/job/libvirt-check/systems=libvirt-debian-9/ws/build/s…'> make[6]: Nothing to be done for 'all-am'. make[6]: Leaving directory '<https://ci.centos.org/job/libvirt-check/systems=libvirt-debian-9/ws/build/s…'> make[5]: Leaving directory '<https://ci.centos.org/job/libvirt-check/systems=libvirt-debian-9/ws/build/s…'> Making all in tools make[5]: Entering directory '<https://ci.centos.org/job/libvirt-check/systems=libvirt-debian-9/ws/build/t…'> /usr/bin/make all-am make[6]: Entering directory '<https://ci.centos.org/job/libvirt-check/systems=libvirt-debian-9/ws/build/t…'> make[6]: Nothing to be done for 'all-am'. make[6]: Leaving directory '<https://ci.centos.org/job/libvirt-check/systems=libvirt-debian-9/ws/build/t…'> make[5]: Leaving directory '<https://ci.centos.org/job/libvirt-check/systems=libvirt-debian-9/ws/build/t…'> Making all in docs make[5]: Entering directory '<https://ci.centos.org/job/libvirt-check/systems=libvirt-debian-9/ws/build/d…'> make[5]: Leaving directory '<https://ci.centos.org/job/libvirt-check/systems=libvirt-debian-9/ws/build/d…'> Making all in tests make[5]: Entering directory '<https://ci.centos.org/job/libvirt-check/systems=libvirt-debian-9/ws/build/t…'> make[5]: Nothing to be done for 'all'. make[5]: Leaving directory '<https://ci.centos.org/job/libvirt-check/systems=libvirt-debian-9/ws/build/t…'> Making all in po make[5]: Entering directory '<https://ci.centos.org/job/libvirt-check/systems=libvirt-debian-9/ws/build/po'> make[5]: Nothing to be done for 'all'. make[5]: Leaving directory '<https://ci.centos.org/job/libvirt-check/systems=libvirt-debian-9/ws/build/po'> Making all in examples make[5]: Entering directory '<https://ci.centos.org/job/libvirt-check/systems=libvirt-debian-9/ws/build/e…'> make[5]: Nothing to be done for 'all'. make[5]: Leaving directory '<https://ci.centos.org/job/libvirt-check/systems=libvirt-debian-9/ws/build/e…'> make[4]: Leaving directory '<https://ci.centos.org/job/libvirt-check/systems=libvirt-debian-9/ws/build'> make[3]: Leaving directory '<https://ci.centos.org/job/libvirt-check/systems=libvirt-debian-9/ws/build'> make[2]: Leaving directory '<https://ci.centos.org/job/libvirt-check/systems=libvirt-debian-9/ws/build'> Making check in include/libvirt make[2]: Entering directory '<https://ci.centos.org/job/libvirt-check/systems=libvirt-debian-9/ws/build/i…'> make[2]: Nothing to be done for 'check'. make[2]: Leaving directory '<https://ci.centos.org/job/libvirt-check/systems=libvirt-debian-9/ws/build/i…'> Making check in src make[2]: Entering directory '<https://ci.centos.org/job/libvirt-check/systems=libvirt-debian-9/ws/build/s…'> /usr/bin/make check-am make[3]: Entering directory '<https://ci.centos.org/job/libvirt-check/systems=libvirt-debian-9/ws/build/s…'> /usr/bin/make check-local make[4]: Entering directory '<https://ci.centos.org/job/libvirt-check/systems=libvirt-debian-9/ws/build/s…'> GEN ../../src/remote_protocol-struct GEN ../../src/lxc_protocol-struct GEN ../../src/qemu_protocol-struct WARNING: no output, pdwtags appears broken: WARNING: die__process_unit: DW_TAG_restrict_type (0x37) @ <0x19e> not handled! WARNING: skipping the remote protocol test WARNING: no output, pdwtags appears broken: WARNING: die__process_unit: DW_TAG_restrict_type (0x37) @ <0x1da> not handled! WARNING: skipping the remote protocol test GEN ../../src/virnetprotocol-struct WARNING: no output, pdwtags appears broken: WARNING: die__process_unit: DW_TAG_restrict_type (0x37) @ <0x193> not handled! WARNING: skipping the remote protocol test GEN ../../src/lxc_monitor_protocol-struct GEN ../../src/virkeepaliveprotocol-struct WARNING: no output, pdwtags appears broken: WARNING: die__process_unit: DW_TAG_restrict_type (0x37) @ <0x19e> not handled! WARNING: skipping the remote protocol test GEN ../../src/lock_protocol-struct WARNING: no output, pdwtags appears broken: WARNING: die__process_unit: DW_TAG_restrict_type (0x37) @ <0x193> not handled! WARNING: skipping the remote protocol test WARNING: no output, pdwtags appears broken: WARNING: die__process_unit: DW_TAG_restrict_type (0x37) @ <0x193> not handled! WARNING: skipping the remote protocol test GEN ../../src/admin_protocol-struct WARNING: no output, pdwtags appears broken: WARNING: die__process_unit: DW_TAG_restrict_type (0x37) @ <0x193> not handled! WARNING: skipping the remote protocol test WARNING: no output, pdwtags appears broken: WARNING: die__process_unit: DW_TAG_restrict_type (0x37) @ <0x19e> not handled! WARNING: skipping the remote protocol test GEN check-symfile GEN check-drivername GEN check-symsorting GEN check-driverimpls GEN check-aclrules GEN check-aclperms GEN check-admin-symfile GEN check-admin-symsorting GEN check-admin-drivername GEN check-augeas Syntax error in lens definition Failed to load qemu/test_libvirtd_qemu.aug qemu/test_libvirtd_qemu.aug:96.3-203.1:exception thrown in test qemu/test_libvirtd_qemu.aug:96.8-.34:exception: Iterated lens matched less than it should Lens: ../../src/qemu/libvirtd_qemu.aug:170.13-.43: Last match: ../../src/qemu/libvirtd_qemu.aug:18.52-.113: Not matching: ../../src/qemu/libvirtd_qemu.aug:12.19-.31: Error encountered at 48:27 (1615 characters into string) <\n "/dev/ptmx", "/dev/kvm"|=|,\n]\nsave_image_format = "raw> Tree generated so far: /default_tls_x509_cert_dir = "/etc/pki/qemu" /default_tls_x509_verify = "1" /default_tls_x509_secret_uuid = "00000000-0000-0000-0000-000000000000" /vnc_listen = "0.0.0.0" /vnc_auto_unix_socket = "1" /vnc_tls = "1" /vnc_tls_x509_cert_dir = "/etc/pki/libvirt-vnc" /vnc_tls_x509_secret_uuid = "00000000-0000-0000-0000-000000000000" /vnc_tls_x509_verify = "1" /vnc_password = "XYZ12345" /vnc_sasl = "1" /vnc_sasl_dir = "/some/directory/sasl2" /vnc_allow_host_audio = "0" /spice_listen = "0.0.0.0" /spice_tls = "1" /spice_tls_x509_cert_dir = "/etc/pki/libvirt-spice" /spice_auto_unix_socket = "1" /spice_password = "XYZ12345" /spice_sasl = "1" /spice_sasl_dir = "/some/directory/sasl2" /chardev_tls = "1" /chardev_tls_x509_cert_dir = "/etc/pki/libvirt-chardev" /chardev_tls_x509_verify = "1" /chardev_tls_x509_secret_uuid = "00000000-0000-0000-0000-000000000000" /vxhs_tls = "1" /vxhs_tls_x509_cert_dir = "/etc/pki/libvirt-vxhs" /nbd_tls = "1" /nbd_tls_x509_cert_dir = "/etc/pki/libvirt-nbd" /migrate_tls_x509_cert_dir = "/etc/pki/libvirt-migrate" /migrate_tls_x509_verify = "1" /migrate_tls_x509_secret_uuid = "00000000-0000-0000-0000-000000000000" /nographics_allow_host_audio = "1" /remote_display_port_min = "5900" /remote_display_port_max = "65535" /remote_websocket_port_min = "5700" /remote_websocket_port_max = "65535" /security_driver = "selinux" /security_default_confined = "1" /security_require_confined = "1" /user = "root" /group = "root" /dynamic_ownership = "1" /remember_owner = "1" /cgroup_controllers /cgroup_controllers/1 = "cpu" /cgroup_controllers/2 = "devices" /cgroup_controllers/3 = "memory" /cgroup_controllers/4 = "blkio" /cgroup_controllers/5 = "cpuset" /cgroup_controllers/6 = "cpuacct" Makefile:13498: recipe for target 'check-augeas' failed make[4]: *** [check-augeas] Error 1 make[4]: Leaving directory '<https://ci.centos.org/job/libvirt-check/systems=libvirt-debian-9/ws/build/s…'> Makefile:12274: recipe for target 'check-am' failed make[3]: *** [check-am] Error 2 make[3]: Leaving directory '<https://ci.centos.org/job/libvirt-check/systems=libvirt-debian-9/ws/build/s…'> Makefile:12276: recipe for target 'check' failed make[2]: *** [check] Error 2 make[2]: Leaving directory '<https://ci.centos.org/job/libvirt-check/systems=libvirt-debian-9/ws/build/s…'> Makefile:777: recipe for target 'check-recursive' failed make[1]: *** [check-recursive] Error 1 make[1]: Leaving directory '<https://ci.centos.org/job/libvirt-check/systems=libvirt-debian-9/ws/build'> Makefile:1069: recipe for target 'check' failed make: *** [check] Error 2 + find -name test-suite.log+ xargs cat + exit 1 Build step 'Execute shell' marked build as failure
1 1
0 0
Build failed in Jenkins: libvirt-check » libvirt-centos-7 #1170
by ci@centos.org 19 May '20

19 May '20
See <https://ci.centos.org/job/libvirt-check/systems=libvirt-centos-7/1170/displ…> ------------------------------------------ Started by upstream project "libvirt-check" build number 1170 originally caused by: Started by upstream project "libvirt-syntax-check" build number 1189 originally caused by: Started by upstream project "libvirt-build" build number 1436 originally caused by: Started by an SCM change Running as SYSTEM [EnvInject] - Loading node environment variables. Building remotely on libvirt-centos-7 (libvirt) in workspace <https://ci.centos.org/job/libvirt-check/systems=libvirt-centos-7/ws/> [libvirt] $ /bin/sh -xe /tmp/jenkins16115298772349633643.sh ++ uname + '[' Linux '!=' FreeBSD ']' + export VIR_TEST_EXPENSIVE=1 + VIR_TEST_EXPENSIVE=1 + export VIR_TEST_DEBUG=2 + VIR_TEST_DEBUG=2 + cd build + /usr/bin/make check /usr/bin/make check-recursive make[1]: Entering directory `<https://ci.centos.org/job/libvirt-check/systems=libvirt-centos-7/ws/build'> Making check in . make[2]: Entering directory `<https://ci.centos.org/job/libvirt-check/systems=libvirt-centos-7/ws/build'> /usr/bin/make check-local make[3]: Entering directory `<https://ci.centos.org/job/libvirt-check/systems=libvirt-centos-7/ws/build'> /usr/bin/make all-recursive make[4]: Entering directory `<https://ci.centos.org/job/libvirt-check/systems=libvirt-centos-7/ws/build'> Making all in . make[5]: Entering directory `<https://ci.centos.org/job/libvirt-check/systems=libvirt-centos-7/ws/build'> make[5]: Leaving directory `<https://ci.centos.org/job/libvirt-check/systems=libvirt-centos-7/ws/build'> Making all in include/libvirt make[5]: Entering directory `<https://ci.centos.org/job/libvirt-check/systems=libvirt-centos-7/ws/build/i…'> make[5]: Nothing to be done for `all'. make[5]: Leaving directory `<https://ci.centos.org/job/libvirt-check/systems=libvirt-centos-7/ws/build/i…'> Making all in src make[5]: Entering directory `<https://ci.centos.org/job/libvirt-check/systems=libvirt-centos-7/ws/build/s…'> /usr/bin/make all-am make[6]: Entering directory `<https://ci.centos.org/job/libvirt-check/systems=libvirt-centos-7/ws/build/s…'> make[6]: Nothing to be done for `all-am'. make[6]: Leaving directory `<https://ci.centos.org/job/libvirt-check/systems=libvirt-centos-7/ws/build/s…'> make[5]: Leaving directory `<https://ci.centos.org/job/libvirt-check/systems=libvirt-centos-7/ws/build/s…'> Making all in tools make[5]: Entering directory `<https://ci.centos.org/job/libvirt-check/systems=libvirt-centos-7/ws/build/t…'> /usr/bin/make all-am make[6]: Entering directory `<https://ci.centos.org/job/libvirt-check/systems=libvirt-centos-7/ws/build/t…'> make[6]: Nothing to be done for `all-am'. make[6]: Leaving directory `<https://ci.centos.org/job/libvirt-check/systems=libvirt-centos-7/ws/build/t…'> make[5]: Leaving directory `<https://ci.centos.org/job/libvirt-check/systems=libvirt-centos-7/ws/build/t…'> Making all in docs make[5]: Entering directory `<https://ci.centos.org/job/libvirt-check/systems=libvirt-centos-7/ws/build/d…'> make[5]: Leaving directory `<https://ci.centos.org/job/libvirt-check/systems=libvirt-centos-7/ws/build/d…'> Making all in tests make[5]: Entering directory `<https://ci.centos.org/job/libvirt-check/systems=libvirt-centos-7/ws/build/t…'> make[5]: Nothing to be done for `all'. make[5]: Leaving directory `<https://ci.centos.org/job/libvirt-check/systems=libvirt-centos-7/ws/build/t…'> Making all in po make[5]: Entering directory `<https://ci.centos.org/job/libvirt-check/systems=libvirt-centos-7/ws/build/po'> make[5]: Nothing to be done for `all'. make[5]: Leaving directory `<https://ci.centos.org/job/libvirt-check/systems=libvirt-centos-7/ws/build/po'> Making all in examples make[5]: Entering directory `<https://ci.centos.org/job/libvirt-check/systems=libvirt-centos-7/ws/build/e…'> make[5]: Nothing to be done for `all'. make[5]: Leaving directory `<https://ci.centos.org/job/libvirt-check/systems=libvirt-centos-7/ws/build/e…'> make[4]: Leaving directory `<https://ci.centos.org/job/libvirt-check/systems=libvirt-centos-7/ws/build'> make[3]: Leaving directory `<https://ci.centos.org/job/libvirt-check/systems=libvirt-centos-7/ws/build'> make[2]: Leaving directory `<https://ci.centos.org/job/libvirt-check/systems=libvirt-centos-7/ws/build'> Making check in include/libvirt make[2]: Entering directory `<https://ci.centos.org/job/libvirt-check/systems=libvirt-centos-7/ws/build/i…'> make[2]: Nothing to be done for `check'. make[2]: Leaving directory `<https://ci.centos.org/job/libvirt-check/systems=libvirt-centos-7/ws/build/i…'> Making check in src make[2]: Entering directory `<https://ci.centos.org/job/libvirt-check/systems=libvirt-centos-7/ws/build/s…'> /usr/bin/make check-am make[3]: Entering directory `<https://ci.centos.org/job/libvirt-check/systems=libvirt-centos-7/ws/build/s…'> /usr/bin/make check-local make[4]: Entering directory `<https://ci.centos.org/job/libvirt-check/systems=libvirt-centos-7/ws/build/s…'> GEN ../../src/remote_protocol-struct GEN ../../src/lxc_protocol-struct GEN ../../src/qemu_protocol-struct GEN ../../src/virnetprotocol-struct GEN ../../src/virkeepaliveprotocol-struct GEN ../../src/lxc_monitor_protocol-struct GEN ../../src/lock_protocol-struct GEN ../../src/admin_protocol-struct GEN check-symfile GEN check-symsorting GEN check-drivername GEN check-driverimpls GEN check-aclrules GEN check-aclperms GEN check-admin-symfile GEN check-admin-symsorting GEN check-admin-drivername GEN check-augeas Syntax error in lens definition Failed to load qemu/test_libvirtd_qemu.aug qemu/test_libvirtd_qemu.aug:96.3-203.1:exception thrown in test qemu/test_libvirtd_qemu.aug:96.8-.34:exception: Iterated lens matched less than it should Lens: ../../src/qemu/libvirtd_qemu.aug:170.13-.43: Last match: ../../src/qemu/libvirtd_qemu.aug:18.52-.113: Not matching: ../../src/qemu/libvirtd_qemu.aug:12.19-.31: Error encountered at 48:27 (1615 characters into string) <\n "/dev/ptmx", "/dev/kvm"|=|,\n]\nsave_image_format = "raw> Tree generated so far: /default_tls_x509_cert_dir = "/etc/pki/qemu" /default_tls_x509_verify = "1" /default_tls_x509_secret_uuid = "00000000-0000-0000-0000-000000000000" /vnc_listen = "0.0.0.0" /vnc_auto_unix_socket = "1" /vnc_tls = "1" /vnc_tls_x509_cert_dir = "/etc/pki/libvirt-vnc" /vnc_tls_x509_secret_uuid = "00000000-0000-0000-0000-000000000000" /vnc_tls_x509_verify = "1" /vnc_password = "XYZ12345" /vnc_sasl = "1" /vnc_sasl_dir = "/some/directory/sasl2" /vnc_allow_host_audio = "0" /spice_listen = "0.0.0.0" /spice_tls = "1" /spice_tls_x509_cert_dir = "/etc/pki/libvirt-spice" /spice_auto_unix_socket = "1" /spice_password = "XYZ12345" /spice_sasl = "1" /spice_sasl_dir = "/some/directory/sasl2" /chardev_tls = "1" /chardev_tls_x509_cert_dir = "/etc/pki/libvirt-chardev" /chardev_tls_x509_verify = "1" /chardev_tls_x509_secret_uuid = "00000000-0000-0000-0000-000000000000" /vxhs_tls = "1" /vxhs_tls_x509_cert_dir = "/etc/pki/libvirt-vxhs" /nbd_tls = "1" /nbd_tls_x509_cert_dir = "/etc/pki/libvirt-nbd" /migrate_tls_x509_cert_dir = "/etc/pki/libvirt-migrate" /migrate_tls_x509_verify = "1" /migrate_tls_x509_secret_uuid = "00000000-0000-0000-0000-000000000000" /nographics_allow_host_audio = "1" /remote_display_port_min = "5900" /remote_display_port_max = "65535" /remote_websocket_port_min = "5700" /remote_websocket_port_max = "65535" /security_driver = "selinux" /security_default_confined = "1" /security_require_confined = "1" /user = "root" /group = "root" /dynamic_ownership = "1" /remember_owner = "1" /cgroup_controllers /cgroup_controllers/1 = "cpu" /cgroup_controllers/2 = "devices" /cgroup_controllers/3 = "memory" /cgroup_controllers/4 = "blkio" /cgroup_controllers/5 = "cpuset" /cgroup_controllers/6 = "cpuacct" make[4]: *** [check-augeas] Error 1 make[4]: Leaving directory `<https://ci.centos.org/job/libvirt-check/systems=libvirt-centos-7/ws/build/s…'> make[3]: *** [check-am] Error 2 make[3]: Leaving directory `<https://ci.centos.org/job/libvirt-check/systems=libvirt-centos-7/ws/build/s…'> make[2]: *** [check] Error 2 make[2]: Leaving directory `<https://ci.centos.org/job/libvirt-check/systems=libvirt-centos-7/ws/build/s…'> make[1]: *** [check-recursive] Error 1 make[1]: Leaving directory `<https://ci.centos.org/job/libvirt-check/systems=libvirt-centos-7/ws/build'> make: *** [check] Error 2 + xargs cat + find -name test-suite.log + exit 1 Build step 'Execute shell' marked build as failure
1 1
0 0
Build failed in Jenkins: libvirt-check » libvirt-freebsd-12 #1170
by ci@centos.org 19 May '20

19 May '20
See <https://ci.centos.org/job/libvirt-check/systems=libvirt-freebsd-12/1170/dis…> ------------------------------------------ Started by upstream project "libvirt-check" build number 1170 originally caused by: Started by upstream project "libvirt-syntax-check" build number 1189 originally caused by: Started by upstream project "libvirt-build" build number 1436 originally caused by: Started by an SCM change Running as SYSTEM [EnvInject] - Loading node environment variables. Building remotely on libvirt-freebsd-12 (libvirt) in workspace <https://ci.centos.org/job/libvirt-check/systems=libvirt-freebsd-12/ws/> [libvirt] $ /bin/sh -xe /tmp/jenkins14798062680695422774.sh + uname + [ FreeBSD '!=' FreeBSD ] + export 'VIR_TEST_DEBUG=2' + cd build + /usr/local/bin/gmake check /usr/local/bin/gmake check-recursive gmake[1]: Entering directory '/usr<https://ci.centos.org/job/libvirt-check/systems=libvirt-freebsd-12/ws/build'> Making check in . gmake[2]: Entering directory '/usr<https://ci.centos.org/job/libvirt-check/systems=libvirt-freebsd-12/ws/build'> /usr/local/bin/gmake check-local gmake[3]: Entering directory '/usr<https://ci.centos.org/job/libvirt-check/systems=libvirt-freebsd-12/ws/build'> /usr/local/bin/gmake all-recursive gmake[4]: Entering directory '/usr<https://ci.centos.org/job/libvirt-check/systems=libvirt-freebsd-12/ws/build'> Making all in . gmake[5]: Entering directory '/usr<https://ci.centos.org/job/libvirt-check/systems=libvirt-freebsd-12/ws/build'> gmake[5]: Leaving directory '/usr<https://ci.centos.org/job/libvirt-check/systems=libvirt-freebsd-12/ws/build'> Making all in include/libvirt gmake[5]: Entering directory '/usr<https://ci.centos.org/job/libvirt-check/systems=libvirt-freebsd-12/ws/build…'> gmake[5]: Nothing to be done for 'all'. gmake[5]: Leaving directory '/usr<https://ci.centos.org/job/libvirt-check/systems=libvirt-freebsd-12/ws/build…'> Making all in src gmake[5]: Entering directory '/usr<https://ci.centos.org/job/libvirt-check/systems=libvirt-freebsd-12/ws/build…'> /usr/local/bin/gmake all-am gmake[6]: Entering directory '/usr<https://ci.centos.org/job/libvirt-check/systems=libvirt-freebsd-12/ws/build…'> gmake[6]: Nothing to be done for 'all-am'. gmake[6]: Leaving directory '/usr<https://ci.centos.org/job/libvirt-check/systems=libvirt-freebsd-12/ws/build…'> gmake[5]: Leaving directory '/usr<https://ci.centos.org/job/libvirt-check/systems=libvirt-freebsd-12/ws/build…'> Making all in tools gmake[5]: Entering directory '/usr<https://ci.centos.org/job/libvirt-check/systems=libvirt-freebsd-12/ws/build…'> /usr/local/bin/gmake all-am gmake[6]: Entering directory '/usr<https://ci.centos.org/job/libvirt-check/systems=libvirt-freebsd-12/ws/build…'> gmake[6]: Nothing to be done for 'all-am'. gmake[6]: Leaving directory '/usr<https://ci.centos.org/job/libvirt-check/systems=libvirt-freebsd-12/ws/build…'> gmake[5]: Leaving directory '/usr<https://ci.centos.org/job/libvirt-check/systems=libvirt-freebsd-12/ws/build…'> Making all in docs gmake[5]: Entering directory '/usr<https://ci.centos.org/job/libvirt-check/systems=libvirt-freebsd-12/ws/build…'> gmake[5]: Leaving directory '/usr<https://ci.centos.org/job/libvirt-check/systems=libvirt-freebsd-12/ws/build…'> Making all in tests gmake[5]: Entering directory '/usr<https://ci.centos.org/job/libvirt-check/systems=libvirt-freebsd-12/ws/build…'> gmake[5]: Nothing to be done for 'all'. gmake[5]: Leaving directory '/usr<https://ci.centos.org/job/libvirt-check/systems=libvirt-freebsd-12/ws/build…'> Making all in po gmake[5]: Entering directory '/usr<https://ci.centos.org/job/libvirt-check/systems=libvirt-freebsd-12/ws/build…'> cat: POTFILES: No such file or directory gmake[5]: Nothing to be done for 'all'. gmake[5]: Leaving directory '/usr<https://ci.centos.org/job/libvirt-check/systems=libvirt-freebsd-12/ws/build…'> Making all in examples gmake[5]: Entering directory '/usr<https://ci.centos.org/job/libvirt-check/systems=libvirt-freebsd-12/ws/build…'> gmake[5]: Nothing to be done for 'all'. gmake[5]: Leaving directory '/usr<https://ci.centos.org/job/libvirt-check/systems=libvirt-freebsd-12/ws/build…'> gmake[4]: Leaving directory '/usr<https://ci.centos.org/job/libvirt-check/systems=libvirt-freebsd-12/ws/build'> gmake[3]: Leaving directory '/usr<https://ci.centos.org/job/libvirt-check/systems=libvirt-freebsd-12/ws/build'> gmake[2]: Leaving directory '/usr<https://ci.centos.org/job/libvirt-check/systems=libvirt-freebsd-12/ws/build'> Making check in include/libvirt gmake[2]: Entering directory '/usr<https://ci.centos.org/job/libvirt-check/systems=libvirt-freebsd-12/ws/build…'> gmake[2]: Nothing to be done for 'check'. gmake[2]: Leaving directory '/usr<https://ci.centos.org/job/libvirt-check/systems=libvirt-freebsd-12/ws/build…'> Making check in src gmake[2]: Entering directory '/usr<https://ci.centos.org/job/libvirt-check/systems=libvirt-freebsd-12/ws/build…'> /usr/local/bin/gmake check-am gmake[3]: Entering directory '/usr<https://ci.centos.org/job/libvirt-check/systems=libvirt-freebsd-12/ws/build…'> /usr/local/bin/gmake check-local gmake[4]: Entering directory '/usr<https://ci.centos.org/job/libvirt-check/systems=libvirt-freebsd-12/ws/build…'> GEN ../../src/remote_protocol-struct GEN ../../src/lxc_protocol-struct GEN ../../src/qemu_protocol-struct WARNING: skipping pdwtags test with Clang GEN ../../src/virnetprotocol-struct WARNING: skipping pdwtags test with Clang GEN ../../src/virkeepaliveprotocol-struct WARNING: skipping pdwtags test with Clang GEN ../../src/lock_protocol-struct WARNING: skipping pdwtags test with Clang GEN ../../src/admin_protocol-struct WARNING: skipping pdwtags test with Clang GEN check-symsorting WARNING: skipping pdwtags test with Clang GEN check-drivername WARNING: skipping pdwtags test with Clang GEN check-driverimpls GEN check-aclrules GEN check-aclperms GEN check-admin-symsorting GEN check-admin-drivername GEN check-augeas Syntax error in lens definition Failed to load qemu/test_libvirtd_qemu.aug qemu/test_libvirtd_qemu.aug:96.3-203.1:exception thrown in test qemu/test_libvirtd_qemu.aug:96.8-.34:exception: Iterated lens matched less than it should Lens: ../../src/qemu/libvirtd_qemu.aug:170.13-.43: Last match: ../../src/qemu/libvirtd_qemu.aug:18.52-.113: Not matching: ../../src/qemu/libvirtd_qemu.aug:12.19-.31: Error encountered at 48:27 (1615 characters into string) <\n "/dev/ptmx", "/dev/kvm"|=|,\n]\nsave_image_format = "raw> Tree generated so far: /default_tls_x509_cert_dir = "/etc/pki/qemu" /default_tls_x509_verify = "1" /default_tls_x509_secret_uuid = "00000000-0000-0000-0000-000000000000" /vnc_listen = "0.0.0.0" /vnc_auto_unix_socket = "1" /vnc_tls = "1" /vnc_tls_x509_cert_dir = "/etc/pki/libvirt-vnc" /vnc_tls_x509_secret_uuid = "00000000-0000-0000-0000-000000000000" /vnc_tls_x509_verify = "1" /vnc_password = "XYZ12345" /vnc_sasl = "1" /vnc_sasl_dir = "/some/directory/sasl2" /vnc_allow_host_audio = "0" /spice_listen = "0.0.0.0" /spice_tls = "1" /spice_tls_x509_cert_dir = "/etc/pki/libvirt-spice" /spice_auto_unix_socket = "1" /spice_password = "XYZ12345" /spice_sasl = "1" /spice_sasl_dir = "/some/directory/sasl2" /chardev_tls = "1" /chardev_tls_x509_cert_dir = "/etc/pki/libvirt-chardev" /chardev_tls_x509_verify = "1" /chardev_tls_x509_secret_uuid = "00000000-0000-0000-0000-000000000000" /vxhs_tls = "1" /vxhs_tls_x509_cert_dir = "/etc/pki/libvirt-vxhs" /nbd_tls = "1" /nbd_tls_x509_cert_dir = "/etc/pki/libvirt-nbd" /migrate_tls_x509_cert_dir = "/etc/pki/libvirt-migrate" /migrate_tls_x509_verify = "1" /migrate_tls_x509_secret_uuid = "00000000-0000-0000-0000-000000000000" /nographics_allow_host_audio = "1" /remote_display_port_min = "5900" /remote_display_port_max = "65535" /remote_websocket_port_min = "5700" /remote_websocket_port_max = "65535" /security_driver = "selinux" /security_default_confined = "1" /security_require_confined = "1" /user = "root" /group = "root" /dynamic_ownership = "1" /remember_owner = "1" /cgroup_controllers /cgroup_controllers/1 = "cpu" /cgroup_controllers/2 = "devices" /cgroup_controllers/3 = "memory" /cgroup_controllers/4 = "blkio" /cgroup_controllers/5 = "cpuset" /cgroup_controllers/6 = "cpuacct" gmake[4]: *** [Makefile:14849: check-augeas] Error 1 gmake[4]: *** Waiting for unfinished jobs.... gmake[4]: Leaving directory '/usr<https://ci.centos.org/job/libvirt-check/systems=libvirt-freebsd-12/ws/build…'> gmake[3]: *** [Makefile:12731: check-am] Error 2 gmake[3]: Leaving directory '/usr<https://ci.centos.org/job/libvirt-check/systems=libvirt-freebsd-12/ws/build…'> gmake[2]: *** [Makefile:12733: check] Error 2 gmake[2]: Leaving directory '/usr<https://ci.centos.org/job/libvirt-check/systems=libvirt-freebsd-12/ws/build…'> gmake[1]: *** [Makefile:777: check-recursive] Error 1 gmake[1]: Leaving directory '/usr<https://ci.centos.org/job/libvirt-check/systems=libvirt-freebsd-12/ws/build'> gmake: *** [Makefile:1072: check] Error 2 + find -name test-suite.log find: illegal option -- n + xargs cat usage: find [-H | -L | -P] [-EXdsx] [-f path] path ... [expression] find [-H | -L | -P] [-EXdsx] -f path [path ...] [expression] + exit 1 Build step 'Execute shell' marked build as failure
1 1
0 0
  • ← Newer
  • 1
  • 2
  • 3
  • 4
  • 5
  • 6
  • 7
  • 8
  • Older →

HyperKitty Powered by HyperKitty version 1.3.12.