libvirt List Archives
Sign In Sign Up
Manage this list Sign In Sign Up

Keyboard Shortcuts

Thread View

  • j: Next unread message
  • k: Previous unread message
  • j a: Jump to all threads
  • j l: Jump to MailingList overview

CI

Thread Start a new thread
Download
Threads by month
  • ----- 2025 -----
  • August
  • July
  • June
  • May
  • April
  • March
  • February
  • January
  • ----- 2024 -----
  • December
  • November
  • October
  • September
  • August
  • July
  • June
  • May
  • April
  • March
  • February
  • January
  • ----- 2023 -----
  • December
  • November
  • October
  • September
  • August
  • July
  • June
  • May
  • April
  • March
  • February
  • January
  • ----- 2022 -----
  • December
  • November
  • October
  • September
  • August
  • July
  • June
  • May
  • April
  • March
  • February
  • January
  • ----- 2021 -----
  • December
  • November
  • October
  • September
  • August
  • July
  • June
  • May
  • April
  • March
  • February
  • January
  • ----- 2020 -----
  • December
  • November
  • October
  • September
  • August
  • July
  • June
  • May
  • April
  • March
  • February
  • January
  • ----- 2019 -----
  • December
  • November
  • October
  • September
  • August
  • July
  • June
  • May
  • April
  • March
  • February
  • January
  • ----- 2018 -----
  • December
  • November
  • October
  • September
  • August
  • July
  • June
  • May
  • April
  • March
  • February
  • January
  • ----- 2017 -----
  • December
  • November
  • October
  • September
  • August
  • July
  • June
  • May
  • April
  • March
  • February
  • January
  • ----- 2016 -----
  • December
  • November
  • October
  • September
  • August
  • July
ci@lists.libvirt.org

May 2020

  • 3 participants
  • 80 discussions
libvirt-go-xml | Pipeline #151264927 has failed for master | 00c72bc0
by GitLab 31 May '20

31 May '20
Your pipeline has failed. Project: libvirt-go-xml ( https://gitlab.com/libvirt/libvirt-go-xml ) Branch: master ( https://gitlab.com/libvirt/libvirt-go-xml/-/commits/master ) Commit: 00c72bc0 ( https://gitlab.com/libvirt/libvirt-go-xml/-/commit/00c72bc08a1e7ff194946705… ) Commit Message: Use uint for DomainCell.Memory Signed-off-by: ... Commit Author: Andrea Bolognani ( https://gitlab.com/abologna ) Pipeline #151264927 ( https://gitlab.com/libvirt/libvirt-go-xml/pipelines/151264927 ) triggered by Daniel Berrange ( https://gitlab.com/berrange ) had 5 failed builds. Job #574458960 ( https://gitlab.com/libvirt/libvirt-go-xml/-/jobs/574458960/raw ) Stage: build Name: go_1_12 Job #574458967 ( https://gitlab.com/libvirt/libvirt-go-xml/-/jobs/574458967/raw ) Stage: build Name: go_1_13 Trace: Skipping Git submodules setup section_end:1590894409:get_sources section_start:1590894409:restore_cache Restoring cache section_end:1590894410:restore_cache section_start:1590894410:download_artifacts Downloading artifacts section_end:1590894412:download_artifacts section_start:1590894412:build_script Running before_script and script $ go test -timeout 10m -tags xmlroundtrip -v === RUN TestDomainSnapshot --- PASS: TestDomainSnapshot (0.00s) === RUN TestDomain --- PASS: TestDomain (0.01s) === RUN TestNetwork --- PASS: TestNetwork (0.00s) === RUN TestNodeDevice --- PASS: TestNodeDevice (0.00s) === RUN TestSecret --- PASS: TestSecret (0.00s) === RUN TestStoragePool --- PASS: TestStoragePool (0.00s) === RUN TestStorageVolume --- PASS: TestStorageVolume (0.00s) === RUN TestRoundTrip --- FAIL: TestRoundTrip (35.65s) xml_test.go:374: testdata/libvirt/tests/qemuxml2argvdata/downscript.xml: /domain[0]/devices[0]/interface[0]/downscript[0]: element in expected XML missing in actual XML FAIL exit status 1 FAIL _/builds/libvirt/libvirt-go-xml 35.663s section_end:1590894455:build_script section_start:1590894455:after_script Running after_script section_end:1590894456:after_script section_start:1590894456:upload_artifacts_on_failure Uploading artifacts for failed job section_end:1590894457:upload_artifacts_on_failure ERROR: Job failed: exit code 1  Job #574458969 ( https://gitlab.com/libvirt/libvirt-go-xml/-/jobs/574458969/raw ) Stage: build Name: go_1_14 Trace: Skipping Git submodules setup section_end:1590894410:get_sources section_start:1590894410:restore_cache Restoring cache section_end:1590894411:restore_cache section_start:1590894411:download_artifacts Downloading artifacts section_end:1590894413:download_artifacts section_start:1590894413:build_script Running before_script and script $ go test -timeout 10m -tags xmlroundtrip -v === RUN TestDomainSnapshot --- PASS: TestDomainSnapshot (0.00s) === RUN TestDomain --- PASS: TestDomain (0.01s) === RUN TestNetwork --- PASS: TestNetwork (0.00s) === RUN TestNodeDevice --- PASS: TestNodeDevice (0.00s) === RUN TestSecret --- PASS: TestSecret (0.00s) === RUN TestStoragePool --- PASS: TestStoragePool (0.00s) === RUN TestStorageVolume --- PASS: TestStorageVolume (0.00s) === RUN TestRoundTrip TestRoundTrip: xml_test.go:374: testdata/libvirt/tests/qemuxml2argvdata/downscript.xml: /domain[0]/devices[0]/interface[0]/downscript[0]: element in expected XML missing in actual XML --- FAIL: TestRoundTrip (35.32s) FAIL exit status 1 FAIL _/builds/libvirt/libvirt-go-xml 35.332s section_end:1590894455:build_script section_start:1590894455:after_script Running after_script section_end:1590894456:after_script section_start:1590894456:upload_artifacts_on_failure Uploading artifacts for failed job section_end:1590894457:upload_artifacts_on_failure ERROR: Job failed: exit code 1  Job #574458948 ( https://gitlab.com/libvirt/libvirt-go-xml/-/jobs/574458948/raw ) Stage: build Name: go_1_10 Trace: Skipping Git submodules setup section_end:1590894409:get_sources section_start:1590894409:restore_cache Restoring cache section_end:1590894411:restore_cache section_start:1590894411:download_artifacts Downloading artifacts section_end:1590894412:download_artifacts section_start:1590894412:build_script Running before_script and script $ go test -timeout 10m -tags xmlroundtrip -v === RUN TestDomainSnapshot --- PASS: TestDomainSnapshot (0.00s) === RUN TestDomain --- PASS: TestDomain (0.01s) === RUN TestNetwork --- PASS: TestNetwork (0.00s) === RUN TestNodeDevice --- PASS: TestNodeDevice (0.00s) === RUN TestSecret --- PASS: TestSecret (0.00s) === RUN TestStoragePool --- PASS: TestStoragePool (0.00s) === RUN TestStorageVolume --- PASS: TestStorageVolume (0.00s) === RUN TestRoundTrip --- FAIL: TestRoundTrip (37.05s) xml_test.go:374: testdata/libvirt/tests/qemuxml2argvdata/downscript.xml: /domain[0]/devices[0]/interface[0]/downscript[0]: element in expected XML missing in actual XML FAIL exit status 1 FAIL _/builds/libvirt/libvirt-go-xml 37.067s section_end:1590894454:build_script section_start:1590894454:after_script Running after_script section_end:1590894455:after_script section_start:1590894455:upload_artifacts_on_failure Uploading artifacts for failed job section_end:1590894456:upload_artifacts_on_failure ERROR: Job failed: exit code 1  Job #574458955 ( https://gitlab.com/libvirt/libvirt-go-xml/-/jobs/574458955/raw ) Stage: build Name: go_1_11 Trace: Skipping Git submodules setup section_end:1590894404:get_sources section_start:1590894404:restore_cache Restoring cache section_end:1590894406:restore_cache section_start:1590894406:download_artifacts Downloading artifacts section_end:1590894407:download_artifacts section_start:1590894407:build_script Running before_script and script $ go test -timeout 10m -tags xmlroundtrip -v === RUN TestDomainSnapshot --- PASS: TestDomainSnapshot (0.00s) === RUN TestDomain --- PASS: TestDomain (0.01s) === RUN TestNetwork --- PASS: TestNetwork (0.00s) === RUN TestNodeDevice --- PASS: TestNodeDevice (0.00s) === RUN TestSecret --- PASS: TestSecret (0.00s) === RUN TestStoragePool --- PASS: TestStoragePool (0.00s) === RUN TestStorageVolume --- PASS: TestStorageVolume (0.00s) === RUN TestRoundTrip --- FAIL: TestRoundTrip (36.86s) xml_test.go:374: testdata/libvirt/tests/qemuxml2argvdata/downscript.xml: /domain[0]/devices[0]/interface[0]/downscript[0]: element in expected XML missing in actual XML FAIL exit status 1 FAIL _/builds/libvirt/libvirt-go-xml 36.876s section_end:1590894450:build_script section_start:1590894450:after_script Running after_script section_end:1590894452:after_script section_start:1590894452:upload_artifacts_on_failure Uploading artifacts for failed job section_end:1590894453:upload_artifacts_on_failure ERROR: Job failed: exit code 1  -- You're receiving this email because of your account on gitlab.com.
1 0
0 0
libvirt-go-xml | Pipeline #151115997 has failed for master | 00c72bc0
by GitLab 30 May '20

30 May '20
Your pipeline has failed. Project: libvirt-go-xml ( https://gitlab.com/libvirt/libvirt-go-xml ) Branch: master ( https://gitlab.com/libvirt/libvirt-go-xml/-/commits/master ) Commit: 00c72bc0 ( https://gitlab.com/libvirt/libvirt-go-xml/-/commit/00c72bc08a1e7ff194946705… ) Commit Message: Use uint for DomainCell.Memory Signed-off-by: ... Commit Author: Andrea Bolognani ( https://gitlab.com/abologna ) Pipeline #151115997 ( https://gitlab.com/libvirt/libvirt-go-xml/pipelines/151115997 ) triggered by Daniel Berrange ( https://gitlab.com/berrange ) had 5 failed builds. Job #574012809 ( https://gitlab.com/libvirt/libvirt-go-xml/-/jobs/574012809/raw ) Stage: build Name: go_1_12 Trace: Skipping Git submodules setup section_end:1590808008:get_sources section_start:1590808008:restore_cache Restoring cache section_end:1590808010:restore_cache section_start:1590808010:download_artifacts Downloading artifacts section_end:1590808011:download_artifacts section_start:1590808011:build_script Running before_script and script $ go test -timeout 10m -tags xmlroundtrip -v === RUN TestDomainSnapshot --- PASS: TestDomainSnapshot (0.00s) === RUN TestDomain --- PASS: TestDomain (0.01s) === RUN TestNetwork --- PASS: TestNetwork (0.00s) === RUN TestNodeDevice --- PASS: TestNodeDevice (0.00s) === RUN TestSecret --- PASS: TestSecret (0.00s) === RUN TestStoragePool --- PASS: TestStoragePool (0.00s) === RUN TestStorageVolume --- PASS: TestStorageVolume (0.00s) === RUN TestRoundTrip --- FAIL: TestRoundTrip (31.46s) xml_test.go:374: testdata/libvirt/tests/qemuxml2argvdata/downscript.xml: /domain[0]/devices[0]/interface[0]/downscript[0]: element in expected XML missing in actual XML FAIL exit status 1 FAIL _/builds/libvirt/libvirt-go-xml 31.475s section_end:1590808049:build_script section_start:1590808049:after_script Running after_script section_end:1590808051:after_script section_start:1590808051:upload_artifacts_on_failure Uploading artifacts for failed job section_end:1590808052:upload_artifacts_on_failure ERROR: Job failed: exit code 1  Job #574012803 ( https://gitlab.com/libvirt/libvirt-go-xml/-/jobs/574012803/raw ) Stage: build Name: go_1_11 Trace: Skipping Git submodules setup section_end:1590808009:get_sources section_start:1590808009:restore_cache Restoring cache section_end:1590808011:restore_cache section_start:1590808011:download_artifacts Downloading artifacts section_end:1590808012:download_artifacts section_start:1590808012:build_script Running before_script and script $ go test -timeout 10m -tags xmlroundtrip -v === RUN TestDomainSnapshot --- PASS: TestDomainSnapshot (0.00s) === RUN TestDomain --- PASS: TestDomain (0.01s) === RUN TestNetwork --- PASS: TestNetwork (0.00s) === RUN TestNodeDevice --- PASS: TestNodeDevice (0.00s) === RUN TestSecret --- PASS: TestSecret (0.00s) === RUN TestStoragePool --- PASS: TestStoragePool (0.00s) === RUN TestStorageVolume --- PASS: TestStorageVolume (0.00s) === RUN TestRoundTrip --- FAIL: TestRoundTrip (30.59s) xml_test.go:374: testdata/libvirt/tests/qemuxml2argvdata/downscript.xml: /domain[0]/devices[0]/interface[0]/downscript[0]: element in expected XML missing in actual XML FAIL exit status 1 FAIL _/builds/libvirt/libvirt-go-xml 30.609s section_end:1590808049:build_script section_start:1590808049:after_script Running after_script section_end:1590808051:after_script section_start:1590808051:upload_artifacts_on_failure Uploading artifacts for failed job section_end:1590808052:upload_artifacts_on_failure ERROR: Job failed: exit code 1  Job #574012815 ( https://gitlab.com/libvirt/libvirt-go-xml/-/jobs/574012815/raw ) Stage: build Name: go_1_13 Trace: Skipping Git submodules setup section_end:1590808007:get_sources section_start:1590808007:restore_cache Restoring cache section_end:1590808009:restore_cache section_start:1590808009:download_artifacts Downloading artifacts section_end:1590808010:download_artifacts section_start:1590808010:build_script Running before_script and script $ go test -timeout 10m -tags xmlroundtrip -v === RUN TestDomainSnapshot --- PASS: TestDomainSnapshot (0.00s) === RUN TestDomain --- PASS: TestDomain (0.01s) === RUN TestNetwork --- PASS: TestNetwork (0.00s) === RUN TestNodeDevice --- PASS: TestNodeDevice (0.00s) === RUN TestSecret --- PASS: TestSecret (0.00s) === RUN TestStoragePool --- PASS: TestStoragePool (0.00s) === RUN TestStorageVolume --- PASS: TestStorageVolume (0.00s) === RUN TestRoundTrip --- FAIL: TestRoundTrip (31.41s) xml_test.go:374: testdata/libvirt/tests/qemuxml2argvdata/downscript.xml: /domain[0]/devices[0]/interface[0]/downscript[0]: element in expected XML missing in actual XML FAIL exit status 1 FAIL _/builds/libvirt/libvirt-go-xml 31.423s section_end:1590808048:build_script section_start:1590808048:after_script Running after_script section_end:1590808050:after_script section_start:1590808050:upload_artifacts_on_failure Uploading artifacts for failed job section_end:1590808051:upload_artifacts_on_failure ERROR: Job failed: exit code 1  Job #574012825 ( https://gitlab.com/libvirt/libvirt-go-xml/-/jobs/574012825/raw ) Stage: build Name: go_1_14 Trace: Skipping Git submodules setup section_end:1590808002:get_sources section_start:1590808002:restore_cache Restoring cache section_end:1590808004:restore_cache section_start:1590808004:download_artifacts Downloading artifacts section_end:1590808005:download_artifacts section_start:1590808005:build_script Running before_script and script $ go test -timeout 10m -tags xmlroundtrip -v === RUN TestDomainSnapshot --- PASS: TestDomainSnapshot (0.00s) === RUN TestDomain --- PASS: TestDomain (0.01s) === RUN TestNetwork --- PASS: TestNetwork (0.00s) === RUN TestNodeDevice --- PASS: TestNodeDevice (0.00s) === RUN TestSecret --- PASS: TestSecret (0.00s) === RUN TestStoragePool --- PASS: TestStoragePool (0.00s) === RUN TestStorageVolume --- PASS: TestStorageVolume (0.00s) === RUN TestRoundTrip TestRoundTrip: xml_test.go:374: testdata/libvirt/tests/qemuxml2argvdata/downscript.xml: /domain[0]/devices[0]/interface[0]/downscript[0]: element in expected XML missing in actual XML --- FAIL: TestRoundTrip (32.17s) FAIL exit status 1 FAIL _/builds/libvirt/libvirt-go-xml 32.182s section_end:1590808044:build_script section_start:1590808044:after_script Running after_script section_end:1590808045:after_script section_start:1590808045:upload_artifacts_on_failure Uploading artifacts for failed job section_end:1590808047:upload_artifacts_on_failure ERROR: Job failed: exit code 1  Job #574012799 ( https://gitlab.com/libvirt/libvirt-go-xml/-/jobs/574012799/raw ) Stage: build Name: go_1_10 Trace: Skipping Git submodules setup section_end:1590808002:get_sources section_start:1590808002:restore_cache Restoring cache section_end:1590808003:restore_cache section_start:1590808003:download_artifacts Downloading artifacts section_end:1590808005:download_artifacts section_start:1590808005:build_script Running before_script and script $ go test -timeout 10m -tags xmlroundtrip -v === RUN TestDomainSnapshot --- PASS: TestDomainSnapshot (0.00s) === RUN TestDomain --- PASS: TestDomain (0.01s) === RUN TestNetwork --- PASS: TestNetwork (0.00s) === RUN TestNodeDevice --- PASS: TestNodeDevice (0.00s) === RUN TestSecret --- PASS: TestSecret (0.00s) === RUN TestStoragePool --- PASS: TestStoragePool (0.00s) === RUN TestStorageVolume --- PASS: TestStorageVolume (0.00s) === RUN TestRoundTrip --- FAIL: TestRoundTrip (31.79s) xml_test.go:374: testdata/libvirt/tests/qemuxml2argvdata/downscript.xml: /domain[0]/devices[0]/interface[0]/downscript[0]: element in expected XML missing in actual XML FAIL exit status 1 FAIL _/builds/libvirt/libvirt-go-xml 31.807s section_end:1590808041:build_script section_start:1590808041:after_script Running after_script section_end:1590808043:after_script section_start:1590808043:upload_artifacts_on_failure Uploading artifacts for failed job section_end:1590808044:upload_artifacts_on_failure ERROR: Job failed: exit code 1  -- You're receiving this email because of your account on gitlab.com.
1 0
0 0
libvirt-go-xml | Pipeline #150747446 has failed for master | 00c72bc0
by GitLab 29 May '20

29 May '20
Your pipeline has failed. Project: libvirt-go-xml ( https://gitlab.com/libvirt/libvirt-go-xml ) Branch: master ( https://gitlab.com/libvirt/libvirt-go-xml/-/commits/master ) Commit: 00c72bc0 ( https://gitlab.com/libvirt/libvirt-go-xml/-/commit/00c72bc08a1e7ff194946705… ) Commit Message: Use uint for DomainCell.Memory Signed-off-by: ... Commit Author: Andrea Bolognani ( https://gitlab.com/abologna ) Pipeline #150747446 ( https://gitlab.com/libvirt/libvirt-go-xml/pipelines/150747446 ) triggered by Daniel Berrange ( https://gitlab.com/berrange ) had 5 failed builds. Job #572399616 ( https://gitlab.com/libvirt/libvirt-go-xml/-/jobs/572399616/raw ) Stage: build Name: go_1_11 Trace: Skipping Git submodules setup section_end:1590721575:get_sources section_start:1590721575:restore_cache Restoring cache section_end:1590721576:restore_cache section_start:1590721576:download_artifacts Downloading artifacts section_end:1590721578:download_artifacts section_start:1590721578:build_script Running before_script and script $ go test -timeout 10m -tags xmlroundtrip -v === RUN TestDomainSnapshot --- PASS: TestDomainSnapshot (0.00s) === RUN TestDomain --- PASS: TestDomain (0.01s) === RUN TestNetwork --- PASS: TestNetwork (0.00s) === RUN TestNodeDevice --- PASS: TestNodeDevice (0.00s) === RUN TestSecret --- PASS: TestSecret (0.00s) === RUN TestStoragePool --- PASS: TestStoragePool (0.00s) === RUN TestStorageVolume --- PASS: TestStorageVolume (0.00s) === RUN TestRoundTrip --- FAIL: TestRoundTrip (33.50s) xml_test.go:374: testdata/libvirt/tests/qemuxml2argvdata/downscript.xml: /domain[0]/devices[0]/interface[0]/downscript[0]: element in expected XML missing in actual XML FAIL exit status 1 FAIL _/builds/libvirt/libvirt-go-xml 33.516s section_end:1590721617:build_script section_start:1590721617:after_script Running after_script section_end:1590721619:after_script section_start:1590721619:upload_artifacts_on_failure Uploading artifacts for failed job section_end:1590721620:upload_artifacts_on_failure ERROR: Job failed: exit code 1  Job #572399627 ( https://gitlab.com/libvirt/libvirt-go-xml/-/jobs/572399627/raw ) Stage: build Name: go_1_13 Trace: Skipping Git submodules setup section_end:1590721569:get_sources section_start:1590721569:restore_cache Restoring cache section_end:1590721570:restore_cache section_start:1590721570:download_artifacts Downloading artifacts section_end:1590721572:download_artifacts section_start:1590721572:build_script Running before_script and script $ go test -timeout 10m -tags xmlroundtrip -v === RUN TestDomainSnapshot --- PASS: TestDomainSnapshot (0.00s) === RUN TestDomain --- PASS: TestDomain (0.01s) === RUN TestNetwork --- PASS: TestNetwork (0.00s) === RUN TestNodeDevice --- PASS: TestNodeDevice (0.00s) === RUN TestSecret --- PASS: TestSecret (0.00s) === RUN TestStoragePool --- PASS: TestStoragePool (0.00s) === RUN TestStorageVolume --- PASS: TestStorageVolume (0.00s) === RUN TestRoundTrip --- FAIL: TestRoundTrip (37.59s) xml_test.go:374: testdata/libvirt/tests/qemuxml2argvdata/downscript.xml: /domain[0]/devices[0]/interface[0]/downscript[0]: element in expected XML missing in actual XML FAIL exit status 1 FAIL _/builds/libvirt/libvirt-go-xml 37.604s section_end:1590721616:build_script section_start:1590721616:after_script Running after_script section_end:1590721617:after_script section_start:1590721617:upload_artifacts_on_failure Uploading artifacts for failed job section_end:1590721619:upload_artifacts_on_failure ERROR: Job failed: exit code 1  Job #572399612 ( https://gitlab.com/libvirt/libvirt-go-xml/-/jobs/572399612/raw ) Stage: build Name: go_1_10 Trace: Skipping Git submodules setup section_end:1590721569:get_sources section_start:1590721569:restore_cache Restoring cache section_end:1590721571:restore_cache section_start:1590721571:download_artifacts Downloading artifacts section_end:1590721572:download_artifacts section_start:1590721572:build_script Running before_script and script $ go test -timeout 10m -tags xmlroundtrip -v === RUN TestDomainSnapshot --- PASS: TestDomainSnapshot (0.00s) === RUN TestDomain --- PASS: TestDomain (0.01s) === RUN TestNetwork --- PASS: TestNetwork (0.00s) === RUN TestNodeDevice --- PASS: TestNodeDevice (0.00s) === RUN TestSecret --- PASS: TestSecret (0.00s) === RUN TestStoragePool --- PASS: TestStoragePool (0.00s) === RUN TestStorageVolume --- PASS: TestStorageVolume (0.00s) === RUN TestRoundTrip --- FAIL: TestRoundTrip (38.31s) xml_test.go:374: testdata/libvirt/tests/qemuxml2argvdata/downscript.xml: /domain[0]/devices[0]/interface[0]/downscript[0]: element in expected XML missing in actual XML FAIL exit status 1 FAIL _/builds/libvirt/libvirt-go-xml 38.325s section_end:1590721615:build_script section_start:1590721615:after_script Running after_script section_end:1590721617:after_script section_start:1590721617:upload_artifacts_on_failure Uploading artifacts for failed job section_end:1590721618:upload_artifacts_on_failure ERROR: Job failed: exit code 1  Job #572399620 ( https://gitlab.com/libvirt/libvirt-go-xml/-/jobs/572399620/raw ) Stage: build Name: go_1_12 Trace: Skipping Git submodules setup section_end:1590721569:get_sources section_start:1590721569:restore_cache Restoring cache section_end:1590721570:restore_cache section_start:1590721570:download_artifacts Downloading artifacts section_end:1590721571:download_artifacts section_start:1590721571:build_script Running before_script and script $ go test -timeout 10m -tags xmlroundtrip -v === RUN TestDomainSnapshot --- PASS: TestDomainSnapshot (0.00s) === RUN TestDomain --- PASS: TestDomain (0.01s) === RUN TestNetwork --- PASS: TestNetwork (0.00s) === RUN TestNodeDevice --- PASS: TestNodeDevice (0.00s) === RUN TestSecret --- PASS: TestSecret (0.00s) === RUN TestStoragePool --- PASS: TestStoragePool (0.00s) === RUN TestStorageVolume --- PASS: TestStorageVolume (0.00s) === RUN TestRoundTrip --- FAIL: TestRoundTrip (36.92s) xml_test.go:374: testdata/libvirt/tests/qemuxml2argvdata/downscript.xml: /domain[0]/devices[0]/interface[0]/downscript[0]: element in expected XML missing in actual XML FAIL exit status 1 FAIL _/builds/libvirt/libvirt-go-xml 36.940s section_end:1590721615:build_script section_start:1590721615:after_script Running after_script section_end:1590721616:after_script section_start:1590721616:upload_artifacts_on_failure Uploading artifacts for failed job section_end:1590721617:upload_artifacts_on_failure ERROR: Job failed: exit code 1  Job #572399634 ( https://gitlab.com/libvirt/libvirt-go-xml/-/jobs/572399634/raw ) Stage: build Name: go_1_14 Trace: Skipping Git submodules setup section_end:1590721568:get_sources section_start:1590721568:restore_cache Restoring cache section_end:1590721570:restore_cache section_start:1590721570:download_artifacts Downloading artifacts section_end:1590721571:download_artifacts section_start:1590721571:build_script Running before_script and script $ go test -timeout 10m -tags xmlroundtrip -v === RUN TestDomainSnapshot --- PASS: TestDomainSnapshot (0.00s) === RUN TestDomain --- PASS: TestDomain (0.01s) === RUN TestNetwork --- PASS: TestNetwork (0.00s) === RUN TestNodeDevice --- PASS: TestNodeDevice (0.00s) === RUN TestSecret --- PASS: TestSecret (0.00s) === RUN TestStoragePool --- PASS: TestStoragePool (0.00s) === RUN TestStorageVolume --- PASS: TestStorageVolume (0.00s) === RUN TestRoundTrip TestRoundTrip: xml_test.go:374: testdata/libvirt/tests/qemuxml2argvdata/downscript.xml: /domain[0]/devices[0]/interface[0]/downscript[0]: element in expected XML missing in actual XML --- FAIL: TestRoundTrip (36.40s) FAIL exit status 1 FAIL _/builds/libvirt/libvirt-go-xml 36.419s section_end:1590721614:build_script section_start:1590721614:after_script Running after_script section_end:1590721615:after_script section_start:1590721615:upload_artifacts_on_failure Uploading artifacts for failed job section_end:1590721617:upload_artifacts_on_failure ERROR: Job failed: exit code 1  -- You're receiving this email because of your account on gitlab.com.
1 0
0 0
libvirt-go-xml | Pipeline #150331828 has failed for master | 00c72bc0
by GitLab 28 May '20

28 May '20
Your pipeline has failed. Project: libvirt-go-xml ( https://gitlab.com/libvirt/libvirt-go-xml ) Branch: master ( https://gitlab.com/libvirt/libvirt-go-xml/-/commits/master ) Commit: 00c72bc0 ( https://gitlab.com/libvirt/libvirt-go-xml/-/commit/00c72bc08a1e7ff194946705… ) Commit Message: Use uint for DomainCell.Memory Signed-off-by: ... Commit Author: Andrea Bolognani ( https://gitlab.com/abologna ) Pipeline #150331828 ( https://gitlab.com/libvirt/libvirt-go-xml/pipelines/150331828 ) triggered by Daniel Berrange ( https://gitlab.com/berrange ) had 5 failed builds. Job #570571114 ( https://gitlab.com/libvirt/libvirt-go-xml/-/jobs/570571114/raw ) Stage: build Name: go_1_13 Trace: Skipping Git submodules setup section_end:1590635171:get_sources section_start:1590635171:restore_cache Restoring cache section_end:1590635172:restore_cache section_start:1590635172:download_artifacts Downloading artifacts section_end:1590635174:download_artifacts section_start:1590635174:build_script Running before_script and script $ go test -timeout 10m -tags xmlroundtrip -v === RUN TestDomainSnapshot --- PASS: TestDomainSnapshot (0.00s) === RUN TestDomain --- PASS: TestDomain (0.01s) === RUN TestNetwork --- PASS: TestNetwork (0.00s) === RUN TestNodeDevice --- PASS: TestNodeDevice (0.00s) === RUN TestSecret --- PASS: TestSecret (0.00s) === RUN TestStoragePool --- PASS: TestStoragePool (0.00s) === RUN TestStorageVolume --- PASS: TestStorageVolume (0.00s) === RUN TestRoundTrip --- FAIL: TestRoundTrip (36.08s) xml_test.go:374: testdata/libvirt/tests/qemuxml2argvdata/downscript.xml: /domain[0]/devices[0]/interface[0]/downscript[0]: element in expected XML missing in actual XML FAIL exit status 1 FAIL _/builds/libvirt/libvirt-go-xml 36.096s section_end:1590635216:build_script section_start:1590635216:after_script Running after_script section_end:1590635218:after_script section_start:1590635218:upload_artifacts_on_failure Uploading artifacts for failed job section_end:1590635219:upload_artifacts_on_failure ERROR: Job failed: exit code 1  Job #570571126 ( https://gitlab.com/libvirt/libvirt-go-xml/-/jobs/570571126/raw ) Stage: build Name: go_1_14 Trace: Skipping Git submodules setup section_end:1590635171:get_sources section_start:1590635171:restore_cache Restoring cache section_end:1590635173:restore_cache section_start:1590635173:download_artifacts Downloading artifacts section_end:1590635174:download_artifacts section_start:1590635174:build_script Running before_script and script $ go test -timeout 10m -tags xmlroundtrip -v === RUN TestDomainSnapshot --- PASS: TestDomainSnapshot (0.00s) === RUN TestDomain --- PASS: TestDomain (0.01s) === RUN TestNetwork --- PASS: TestNetwork (0.00s) === RUN TestNodeDevice --- PASS: TestNodeDevice (0.00s) === RUN TestSecret --- PASS: TestSecret (0.00s) === RUN TestStoragePool --- PASS: TestStoragePool (0.00s) === RUN TestStorageVolume --- PASS: TestStorageVolume (0.00s) === RUN TestRoundTrip TestRoundTrip: xml_test.go:374: testdata/libvirt/tests/qemuxml2argvdata/downscript.xml: /domain[0]/devices[0]/interface[0]/downscript[0]: element in expected XML missing in actual XML --- FAIL: TestRoundTrip (34.58s) FAIL exit status 1 FAIL _/builds/libvirt/libvirt-go-xml 34.595s section_end:1590635216:build_script section_start:1590635216:after_script Running after_script section_end:1590635217:after_script section_start:1590635217:upload_artifacts_on_failure Uploading artifacts for failed job section_end:1590635218:upload_artifacts_on_failure ERROR: Job failed: exit code 1  Job #570571086 ( https://gitlab.com/libvirt/libvirt-go-xml/-/jobs/570571086/raw ) Stage: build Name: go_1_11 Trace: Skipping Git submodules setup section_end:1590635169:get_sources section_start:1590635169:restore_cache Restoring cache section_end:1590635170:restore_cache section_start:1590635170:download_artifacts Downloading artifacts section_end:1590635172:download_artifacts section_start:1590635172:build_script Running before_script and script $ go test -timeout 10m -tags xmlroundtrip -v === RUN TestDomainSnapshot --- PASS: TestDomainSnapshot (0.00s) === RUN TestDomain --- PASS: TestDomain (0.01s) === RUN TestNetwork --- PASS: TestNetwork (0.00s) === RUN TestNodeDevice --- PASS: TestNodeDevice (0.00s) === RUN TestSecret --- PASS: TestSecret (0.00s) === RUN TestStoragePool --- PASS: TestStoragePool (0.00s) === RUN TestStorageVolume --- PASS: TestStorageVolume (0.00s) === RUN TestRoundTrip --- FAIL: TestRoundTrip (37.55s) xml_test.go:374: testdata/libvirt/tests/qemuxml2argvdata/downscript.xml: /domain[0]/devices[0]/interface[0]/downscript[0]: element in expected XML missing in actual XML FAIL exit status 1 FAIL _/builds/libvirt/libvirt-go-xml 37.565s section_end:1590635215:build_script section_start:1590635215:after_script Running after_script section_end:1590635217:after_script section_start:1590635217:upload_artifacts_on_failure Uploading artifacts for failed job section_end:1590635218:upload_artifacts_on_failure ERROR: Job failed: exit code 1  Job #570571096 ( https://gitlab.com/libvirt/libvirt-go-xml/-/jobs/570571096/raw ) Stage: build Name: go_1_12 Trace: Skipping Git submodules setup section_end:1590635169:get_sources section_start:1590635169:restore_cache Restoring cache section_end:1590635170:restore_cache section_start:1590635170:download_artifacts Downloading artifacts section_end:1590635172:download_artifacts section_start:1590635172:build_script Running before_script and script $ go test -timeout 10m -tags xmlroundtrip -v === RUN TestDomainSnapshot --- PASS: TestDomainSnapshot (0.00s) === RUN TestDomain --- PASS: TestDomain (0.01s) === RUN TestNetwork --- PASS: TestNetwork (0.00s) === RUN TestNodeDevice --- PASS: TestNodeDevice (0.00s) === RUN TestSecret --- PASS: TestSecret (0.00s) === RUN TestStoragePool --- PASS: TestStoragePool (0.00s) === RUN TestStorageVolume --- PASS: TestStorageVolume (0.00s) === RUN TestRoundTrip --- FAIL: TestRoundTrip (36.32s) xml_test.go:374: testdata/libvirt/tests/qemuxml2argvdata/downscript.xml: /domain[0]/devices[0]/interface[0]/downscript[0]: element in expected XML missing in actual XML FAIL exit status 1 FAIL _/builds/libvirt/libvirt-go-xml 36.337s section_end:1590635214:build_script section_start:1590635214:after_script Running after_script section_end:1590635216:after_script section_start:1590635216:upload_artifacts_on_failure Uploading artifacts for failed job section_end:1590635217:upload_artifacts_on_failure ERROR: Job failed: exit code 1  Job #570571071 ( https://gitlab.com/libvirt/libvirt-go-xml/-/jobs/570571071/raw ) Stage: build Name: go_1_10 Trace: Skipping Git submodules setup section_end:1590635167:get_sources section_start:1590635167:restore_cache Restoring cache section_end:1590635168:restore_cache section_start:1590635168:download_artifacts Downloading artifacts section_end:1590635170:download_artifacts section_start:1590635170:build_script Running before_script and script $ go test -timeout 10m -tags xmlroundtrip -v === RUN TestDomainSnapshot --- PASS: TestDomainSnapshot (0.00s) === RUN TestDomain --- PASS: TestDomain (0.01s) === RUN TestNetwork --- PASS: TestNetwork (0.00s) === RUN TestNodeDevice --- PASS: TestNodeDevice (0.00s) === RUN TestSecret --- PASS: TestSecret (0.00s) === RUN TestStoragePool --- PASS: TestStoragePool (0.00s) === RUN TestStorageVolume --- PASS: TestStorageVolume (0.00s) === RUN TestRoundTrip --- FAIL: TestRoundTrip (37.38s) xml_test.go:374: testdata/libvirt/tests/qemuxml2argvdata/downscript.xml: /domain[0]/devices[0]/interface[0]/downscript[0]: element in expected XML missing in actual XML FAIL exit status 1 FAIL _/builds/libvirt/libvirt-go-xml 37.393s section_end:1590635211:build_script section_start:1590635211:after_script Running after_script section_end:1590635213:after_script section_start:1590635213:upload_artifacts_on_failure Uploading artifacts for failed job section_end:1590635214:upload_artifacts_on_failure ERROR: Job failed: exit code 1  -- You're receiving this email because of your account on gitlab.com.
1 0
0 0
Passed: libvirt/libvirt#3446 (v6.4.0-rc1 - 55029d9)
by Travis CI 27 May '20

27 May '20
Build Update for libvirt/libvirt ------------------------------------- Build: #3446 Status: Passed Duration: 25 mins and 23 secs Commit: 55029d9 (v6.4.0-rc1) Author: Christian Ehrhardt Message: security: don't fail if built without attr support If built without attr support removing any image will trigger qemuBlockRemoveImageMetadata (the one that emits the warning) -> qemuSecurityMoveImageMetadata -> virSecurityManagerMoveImageMetadata -> virSecurityDACMoveImageMetadata -> virSecurityDACMoveImageMetadataHelper -> virProcessRunInFork (spawns subprocess) -> virSecurityMoveRememberedLabel In there due to !HAVE_LIBATTR virFileGetXAttrQuiet will return ENOSYS and from there the chain will error out. That is wrong and looks like: libvirtd[6320]: internal error: child reported (status=125): libvirtd[6320]: Unable to remove disk metadata on vm testguest from /var/lib/uvtool/libvirt/images/testguest.qcow (disk target vda) This change makes virSecurityDACMoveImageMetadataHelper and virSecuritySELinuxMoveImageMetadataHelper accept that error code gracefully and in that sense it is an extension of: 5214b2f1a3f "security: Don't skip label restore on file systems lacking XATTRs" which does the same for other call chains into the virFile*XAttr functions. Signed-off-by: Christian Ehrhardt <christian.ehrhardt(a)canonical.com> Reviewed-by: Michal Privoznik <mprivozn(a)redhat.com> View the changeset: https://github.com/libvirt/libvirt/compare/v6.4.0-rc1 View the full build log and details: https://travis-ci.org/github/libvirt/libvirt/builds/691901807?utm_medium=no… -- You can unsubscribe from build emails from the libvirt/libvirt repository going to https://travis-ci.org/account/preferences/unsubscribe?repository=4872032&ut…. Or unsubscribe from *all* email updating your settings at https://travis-ci.org/account/preferences/unsubscribe?utm_medium=notificati…. Or configure specific recipients for build notifications in your .travis.yml file. See https://docs.travis-ci.com/user/notifications.
1 0
0 0
libvirt-go-xml | Pipeline #150265172 has failed for master | 00c72bc0
by GitLab 27 May '20

27 May '20
Your pipeline has failed. Project: libvirt-go-xml ( https://gitlab.com/libvirt/libvirt-go-xml ) Branch: master ( https://gitlab.com/libvirt/libvirt-go-xml/-/commits/master ) Commit: 00c72bc0 ( https://gitlab.com/libvirt/libvirt-go-xml/-/commit/00c72bc08a1e7ff194946705… ) Commit Message: Use uint for DomainCell.Memory Signed-off-by: ... Commit Author: Andrea Bolognani ( https://gitlab.com/abologna ) Pipeline #150265172 ( https://gitlab.com/libvirt/libvirt-go-xml/pipelines/150265172 ) triggered by Daniel Veillard ( https://gitlab.com/veillard ) had 5 failed builds. Job #570299998 ( https://gitlab.com/libvirt/libvirt-go-xml/-/jobs/570299998/raw ) Stage: build Name: go_1_13 Trace: Skipping Git submodules setup section_end:1590612343:get_sources section_start:1590612343:restore_cache Restoring cache section_end:1590612344:restore_cache section_start:1590612344:download_artifacts Downloading artifacts section_end:1590612346:download_artifacts section_start:1590612346:build_script Running before_script and script $ go test -timeout 10m -tags xmlroundtrip -v === RUN TestDomainSnapshot --- PASS: TestDomainSnapshot (0.00s) === RUN TestDomain --- PASS: TestDomain (0.01s) === RUN TestNetwork --- PASS: TestNetwork (0.00s) === RUN TestNodeDevice --- PASS: TestNodeDevice (0.00s) === RUN TestSecret --- PASS: TestSecret (0.00s) === RUN TestStoragePool --- PASS: TestStoragePool (0.00s) === RUN TestStorageVolume --- PASS: TestStorageVolume (0.00s) === RUN TestRoundTrip --- FAIL: TestRoundTrip (34.50s) xml_test.go:374: testdata/libvirt/tests/qemuxml2argvdata/downscript.xml: /domain[0]/devices[0]/interface[0]/downscript[0]: element in expected XML missing in actual XML FAIL exit status 1 FAIL _/builds/libvirt/libvirt-go-xml 34.514s section_end:1590612387:build_script section_start:1590612387:after_script Running after_script section_end:1590612389:after_script section_start:1590612389:upload_artifacts_on_failure Uploading artifacts for failed job section_end:1590612390:upload_artifacts_on_failure ERROR: Job failed: exit code 1  Job #570299997 ( https://gitlab.com/libvirt/libvirt-go-xml/-/jobs/570299997/raw ) Stage: build Name: go_1_12 Trace: Skipping Git submodules setup section_end:1590612343:get_sources section_start:1590612343:restore_cache Restoring cache section_end:1590612345:restore_cache section_start:1590612345:download_artifacts Downloading artifacts section_end:1590612346:download_artifacts section_start:1590612346:build_script Running before_script and script $ go test -timeout 10m -tags xmlroundtrip -v === RUN TestDomainSnapshot --- PASS: TestDomainSnapshot (0.00s) === RUN TestDomain --- PASS: TestDomain (0.01s) === RUN TestNetwork --- PASS: TestNetwork (0.00s) === RUN TestNodeDevice --- PASS: TestNodeDevice (0.00s) === RUN TestSecret --- PASS: TestSecret (0.00s) === RUN TestStoragePool --- PASS: TestStoragePool (0.00s) === RUN TestStorageVolume --- PASS: TestStorageVolume (0.00s) === RUN TestRoundTrip --- FAIL: TestRoundTrip (33.77s) xml_test.go:374: testdata/libvirt/tests/qemuxml2argvdata/downscript.xml: /domain[0]/devices[0]/interface[0]/downscript[0]: element in expected XML missing in actual XML FAIL exit status 1 FAIL _/builds/libvirt/libvirt-go-xml 33.789s section_end:1590612387:build_script section_start:1590612387:after_script Running after_script section_end:1590612388:after_script section_start:1590612388:upload_artifacts_on_failure Uploading artifacts for failed job section_end:1590612390:upload_artifacts_on_failure ERROR: Job failed: exit code 1  Job #570299999 ( https://gitlab.com/libvirt/libvirt-go-xml/-/jobs/570299999/raw ) Stage: build Name: go_1_14 Trace: Skipping Git submodules setup section_end:1590612341:get_sources section_start:1590612341:restore_cache Restoring cache section_end:1590612343:restore_cache section_start:1590612343:download_artifacts Downloading artifacts section_end:1590612344:download_artifacts section_start:1590612344:build_script Running before_script and script $ go test -timeout 10m -tags xmlroundtrip -v === RUN TestDomainSnapshot --- PASS: TestDomainSnapshot (0.00s) === RUN TestDomain --- PASS: TestDomain (0.01s) === RUN TestNetwork --- PASS: TestNetwork (0.00s) === RUN TestNodeDevice --- PASS: TestNodeDevice (0.00s) === RUN TestSecret --- PASS: TestSecret (0.00s) === RUN TestStoragePool --- PASS: TestStoragePool (0.00s) === RUN TestStorageVolume --- PASS: TestStorageVolume (0.00s) === RUN TestRoundTrip TestRoundTrip: xml_test.go:374: testdata/libvirt/tests/qemuxml2argvdata/downscript.xml: /domain[0]/devices[0]/interface[0]/downscript[0]: element in expected XML missing in actual XML --- FAIL: TestRoundTrip (35.26s) FAIL exit status 1 FAIL _/builds/libvirt/libvirt-go-xml 35.272s section_end:1590612386:build_script section_start:1590612386:after_script Running after_script section_end:1590612387:after_script section_start:1590612387:upload_artifacts_on_failure Uploading artifacts for failed job section_end:1590612389:upload_artifacts_on_failure ERROR: Job failed: exit code 1  Job #570299996 ( https://gitlab.com/libvirt/libvirt-go-xml/-/jobs/570299996/raw ) Stage: build Name: go_1_11 Trace: Skipping Git submodules setup section_end:1590612341:get_sources section_start:1590612341:restore_cache Restoring cache section_end:1590612343:restore_cache section_start:1590612343:download_artifacts Downloading artifacts section_end:1590612344:download_artifacts section_start:1590612344:build_script Running before_script and script $ go test -timeout 10m -tags xmlroundtrip -v === RUN TestDomainSnapshot --- PASS: TestDomainSnapshot (0.00s) === RUN TestDomain --- PASS: TestDomain (0.01s) === RUN TestNetwork --- PASS: TestNetwork (0.00s) === RUN TestNodeDevice --- PASS: TestNodeDevice (0.00s) === RUN TestSecret --- PASS: TestSecret (0.00s) === RUN TestStoragePool --- PASS: TestStoragePool (0.00s) === RUN TestStorageVolume --- PASS: TestStorageVolume (0.00s) === RUN TestRoundTrip --- FAIL: TestRoundTrip (35.26s) xml_test.go:374: testdata/libvirt/tests/qemuxml2argvdata/downscript.xml: /domain[0]/devices[0]/interface[0]/downscript[0]: element in expected XML missing in actual XML FAIL exit status 1 FAIL _/builds/libvirt/libvirt-go-xml 35.280s section_end:1590612385:build_script section_start:1590612385:after_script Running after_script section_end:1590612387:after_script section_start:1590612387:upload_artifacts_on_failure Uploading artifacts for failed job section_end:1590612388:upload_artifacts_on_failure ERROR: Job failed: exit code 1  Job #570299995 ( https://gitlab.com/libvirt/libvirt-go-xml/-/jobs/570299995/raw ) Stage: build Name: go_1_10 Trace: Skipping Git submodules setup section_end:1590612339:get_sources section_start:1590612339:restore_cache Restoring cache section_end:1590612340:restore_cache section_start:1590612340:download_artifacts Downloading artifacts section_end:1590612342:download_artifacts section_start:1590612342:build_script Running before_script and script $ go test -timeout 10m -tags xmlroundtrip -v === RUN TestDomainSnapshot --- PASS: TestDomainSnapshot (0.00s) === RUN TestDomain --- PASS: TestDomain (0.01s) === RUN TestNetwork --- PASS: TestNetwork (0.00s) === RUN TestNodeDevice --- PASS: TestNodeDevice (0.00s) === RUN TestSecret --- PASS: TestSecret (0.00s) === RUN TestStoragePool --- PASS: TestStoragePool (0.00s) === RUN TestStorageVolume --- PASS: TestStorageVolume (0.00s) === RUN TestRoundTrip --- FAIL: TestRoundTrip (33.87s) xml_test.go:374: testdata/libvirt/tests/qemuxml2argvdata/downscript.xml: /domain[0]/devices[0]/interface[0]/downscript[0]: element in expected XML missing in actual XML FAIL exit status 1 FAIL _/builds/libvirt/libvirt-go-xml 33.893s section_end:1590612381:build_script section_start:1590612381:after_script Running after_script section_end:1590612382:after_script section_start:1590612382:upload_artifacts_on_failure Uploading artifacts for failed job section_end:1590612384:upload_artifacts_on_failure ERROR: Job failed: exit code 1  -- You're receiving this email because of your account on gitlab.com.
1 0
0 0
libvirt-go-xml | Pipeline #149922338 has failed for master | 00c72bc0
by GitLab 27 May '20

27 May '20
Your pipeline has failed. Project: libvirt-go-xml ( https://gitlab.com/libvirt/libvirt-go-xml ) Branch: master ( https://gitlab.com/libvirt/libvirt-go-xml/-/commits/master ) Commit: 00c72bc0 ( https://gitlab.com/libvirt/libvirt-go-xml/-/commit/00c72bc08a1e7ff194946705… ) Commit Message: Use uint for DomainCell.Memory Signed-off-by: ... Commit Author: Andrea Bolognani ( https://gitlab.com/abologna ) Pipeline #149922338 ( https://gitlab.com/libvirt/libvirt-go-xml/pipelines/149922338 ) triggered by Daniel Berrange ( https://gitlab.com/berrange ) had 5 failed builds. Job #568808964 ( https://gitlab.com/libvirt/libvirt-go-xml/-/jobs/568808964/raw ) Stage: build Name: go_1_13 Trace: Skipping Git submodules setup section_end:1590548784:get_sources section_start:1590548784:restore_cache Restoring cache section_end:1590548785:restore_cache section_start:1590548785:download_artifacts Downloading artifacts section_end:1590548787:download_artifacts section_start:1590548787:build_script Running before_script and script $ go test -timeout 10m -tags xmlroundtrip -v === RUN TestDomainSnapshot --- PASS: TestDomainSnapshot (0.00s) === RUN TestDomain --- PASS: TestDomain (0.01s) === RUN TestNetwork --- PASS: TestNetwork (0.00s) === RUN TestNodeDevice --- PASS: TestNodeDevice (0.00s) === RUN TestSecret --- PASS: TestSecret (0.00s) === RUN TestStoragePool --- PASS: TestStoragePool (0.00s) === RUN TestStorageVolume --- PASS: TestStorageVolume (0.00s) === RUN TestRoundTrip --- FAIL: TestRoundTrip (30.48s) xml_test.go:374: testdata/libvirt/tests/qemuxml2argvdata/downscript.xml: /domain[0]/devices[0]/interface[0]/downscript[0]: element in expected XML missing in actual XML FAIL exit status 1 FAIL _/builds/libvirt/libvirt-go-xml 30.492s section_end:1590548824:build_script section_start:1590548824:after_script Running after_script section_end:1590548826:after_script section_start:1590548826:upload_artifacts_on_failure Uploading artifacts for failed job section_end:1590548827:upload_artifacts_on_failure ERROR: Job failed: exit code 1  Job #568808946 ( https://gitlab.com/libvirt/libvirt-go-xml/-/jobs/568808946/raw ) Stage: build Name: go_1_11 Trace: Skipping Git submodules setup section_end:1590548780:get_sources section_start:1590548780:restore_cache Restoring cache section_end:1590548781:restore_cache section_start:1590548781:download_artifacts Downloading artifacts section_end:1590548783:download_artifacts section_start:1590548783:build_script Running before_script and script $ go test -timeout 10m -tags xmlroundtrip -v === RUN TestDomainSnapshot --- PASS: TestDomainSnapshot (0.00s) === RUN TestDomain --- PASS: TestDomain (0.01s) === RUN TestNetwork --- PASS: TestNetwork (0.00s) === RUN TestNodeDevice --- PASS: TestNodeDevice (0.00s) === RUN TestSecret --- PASS: TestSecret (0.00s) === RUN TestStoragePool --- PASS: TestStoragePool (0.00s) === RUN TestStorageVolume --- PASS: TestStorageVolume (0.00s) === RUN TestRoundTrip --- FAIL: TestRoundTrip (33.08s) xml_test.go:374: testdata/libvirt/tests/qemuxml2argvdata/downscript.xml: /domain[0]/devices[0]/interface[0]/downscript[0]: element in expected XML missing in actual XML FAIL exit status 1 FAIL _/builds/libvirt/libvirt-go-xml 33.097s section_end:1590548822:build_script section_start:1590548822:after_script Running after_script section_end:1590548824:after_script section_start:1590548824:upload_artifacts_on_failure Uploading artifacts for failed job section_end:1590548825:upload_artifacts_on_failure ERROR: Job failed: exit code 1  Job #568808957 ( https://gitlab.com/libvirt/libvirt-go-xml/-/jobs/568808957/raw ) Stage: build Name: go_1_12 Trace: Skipping Git submodules setup section_end:1590548776:get_sources section_start:1590548776:restore_cache Restoring cache section_end:1590548778:restore_cache section_start:1590548778:download_artifacts Downloading artifacts section_end:1590548779:download_artifacts section_start:1590548779:build_script Running before_script and script $ go test -timeout 10m -tags xmlroundtrip -v === RUN TestDomainSnapshot --- PASS: TestDomainSnapshot (0.00s) === RUN TestDomain --- PASS: TestDomain (0.01s) === RUN TestNetwork --- PASS: TestNetwork (0.00s) === RUN TestNodeDevice --- PASS: TestNodeDevice (0.00s) === RUN TestSecret --- PASS: TestSecret (0.00s) === RUN TestStoragePool --- PASS: TestStoragePool (0.00s) === RUN TestStorageVolume --- PASS: TestStorageVolume (0.00s) === RUN TestRoundTrip --- FAIL: TestRoundTrip (35.38s) xml_test.go:374: testdata/libvirt/tests/qemuxml2argvdata/downscript.xml: /domain[0]/devices[0]/interface[0]/downscript[0]: element in expected XML missing in actual XML FAIL exit status 1 FAIL _/builds/libvirt/libvirt-go-xml 35.396s section_end:1590548821:build_script section_start:1590548821:after_script Running after_script section_end:1590548823:after_script section_start:1590548823:upload_artifacts_on_failure Uploading artifacts for failed job section_end:1590548824:upload_artifacts_on_failure ERROR: Job failed: exit code 1  Job #568808966 ( https://gitlab.com/libvirt/libvirt-go-xml/-/jobs/568808966/raw ) Stage: build Name: go_1_14 Trace: Skipping Git submodules setup section_end:1590548775:get_sources section_start:1590548775:restore_cache Restoring cache section_end:1590548777:restore_cache section_start:1590548777:download_artifacts Downloading artifacts section_end:1590548778:download_artifacts section_start:1590548778:build_script Running before_script and script $ go test -timeout 10m -tags xmlroundtrip -v === RUN TestDomainSnapshot --- PASS: TestDomainSnapshot (0.00s) === RUN TestDomain --- PASS: TestDomain (0.01s) === RUN TestNetwork --- PASS: TestNetwork (0.00s) === RUN TestNodeDevice --- PASS: TestNodeDevice (0.00s) === RUN TestSecret --- PASS: TestSecret (0.00s) === RUN TestStoragePool --- PASS: TestStoragePool (0.00s) === RUN TestStorageVolume --- PASS: TestStorageVolume (0.00s) === RUN TestRoundTrip TestRoundTrip: xml_test.go:374: testdata/libvirt/tests/qemuxml2argvdata/downscript.xml: /domain[0]/devices[0]/interface[0]/downscript[0]: element in expected XML missing in actual XML --- FAIL: TestRoundTrip (35.08s) FAIL exit status 1 FAIL _/builds/libvirt/libvirt-go-xml 35.091s section_end:1590548820:build_script section_start:1590548820:after_script Running after_script section_end:1590548821:after_script section_start:1590548821:upload_artifacts_on_failure Uploading artifacts for failed job section_end:1590548822:upload_artifacts_on_failure ERROR: Job failed: exit code 1  Job #568808935 ( https://gitlab.com/libvirt/libvirt-go-xml/-/jobs/568808935/raw ) Stage: build Name: go_1_10 Trace: Skipping Git submodules setup section_end:1590548775:get_sources section_start:1590548775:restore_cache Restoring cache section_end:1590548777:restore_cache section_start:1590548777:download_artifacts Downloading artifacts section_end:1590548778:download_artifacts section_start:1590548778:build_script Running before_script and script $ go test -timeout 10m -tags xmlroundtrip -v === RUN TestDomainSnapshot --- PASS: TestDomainSnapshot (0.00s) === RUN TestDomain --- PASS: TestDomain (0.01s) === RUN TestNetwork --- PASS: TestNetwork (0.00s) === RUN TestNodeDevice --- PASS: TestNodeDevice (0.00s) === RUN TestSecret --- PASS: TestSecret (0.00s) === RUN TestStoragePool --- PASS: TestStoragePool (0.00s) === RUN TestStorageVolume --- PASS: TestStorageVolume (0.00s) === RUN TestRoundTrip --- FAIL: TestRoundTrip (35.37s) xml_test.go:374: testdata/libvirt/tests/qemuxml2argvdata/downscript.xml: /domain[0]/devices[0]/interface[0]/downscript[0]: element in expected XML missing in actual XML FAIL exit status 1 FAIL _/builds/libvirt/libvirt-go-xml 35.383s section_end:1590548818:build_script section_start:1590548818:after_script Running after_script section_end:1590548819:after_script section_start:1590548819:upload_artifacts_on_failure Uploading artifacts for failed job section_end:1590548821:upload_artifacts_on_failure ERROR: Job failed: exit code 1  -- You're receiving this email because of your account on gitlab.com.
1 0
0 0
Build failed in Jenkins: libvirt-rpm » libvirt-fedora-rawhide #1093
by ci@centos.org 26 May '20

26 May '20
See <https://ci.centos.org/job/libvirt-rpm/systems=libvirt-fedora-rawhide/1093/d…> ------------------------------------------ [...truncated 7.37 MB...] FAILED 339) cpuTestGuestCPUID(x86_64): Xeon-E5-2609-v3 ... libvirt: CPU Driver error : XML error: failed to parse xml document '<https://ci.centos.org/job/libvirt-rpm/systems=libvirt-fedora-rawhide/ws/bui…'> FAILED 340) cpuTestCPUIDSignature(x86_64): Xeon-E5-2609-v3 ... OK 341) cpuTestGuestCPUID(x86_64): Xeon-E5-2609-v3 ... libvirt: CPU Driver error : XML error: failed to parse xml document '<https://ci.centos.org/job/libvirt-rpm/systems=libvirt-fedora-rawhide/ws/bui…'> FAILED 342) cpuTestJSONCPUID(x86_64): Xeon-E5-2609-v3 ... libvirt: CPU Driver error : XML error: failed to parse xml document '<https://ci.centos.org/job/libvirt-rpm/systems=libvirt-fedora-rawhide/ws/bui…'> FAILED 343) cpuTestJSONSignature(x86_64): Xeon-E5-2609-v3 ... libvirt: CPU Driver error : XML error: failed to parse xml document '<https://ci.centos.org/job/libvirt-rpm/systems=libvirt-fedora-rawhide/ws/bui…'> FAILED 344) cpuTestUpdateLive(x86_64): Xeon-E5-2609-v3 ... libvirt: CPU Driver error : XML error: failed to parse xml document '<https://ci.centos.org/job/libvirt-rpm/systems=libvirt-fedora-rawhide/ws/bui…'> FAILED 345) cpuTestHostCPUID(x86_64): Xeon-E5-2623-v4 ... libvirt: CPU Driver error : XML error: failed to parse xml document '<https://ci.centos.org/job/libvirt-rpm/systems=libvirt-fedora-rawhide/ws/bui…'> FAILED 346) cpuTestGuestCPUID(x86_64): Xeon-E5-2623-v4 ... libvirt: CPU Driver error : XML error: failed to parse xml document '<https://ci.centos.org/job/libvirt-rpm/systems=libvirt-fedora-rawhide/ws/bui…'> FAILED 347) cpuTestCPUIDSignature(x86_64): Xeon-E5-2623-v4 ... OK 348) cpuTestGuestCPUID(x86_64): Xeon-E5-2623-v4 ... libvirt: CPU Driver error : XML error: failed to parse xml document '<https://ci.centos.org/job/libvirt-rpm/systems=libvirt-fedora-rawhide/ws/bui…'> FAILED 349) cpuTestJSONCPUID(x86_64): Xeon-E5-2623-v4 ... libvirt: CPU Driver error : XML error: failed to parse xml document '<https://ci.centos.org/job/libvirt-rpm/systems=libvirt-fedora-rawhide/ws/bui…'> FAILED 350) cpuTestJSONSignature(x86_64): Xeon-E5-2623-v4 ... libvirt: CPU Driver error : XML error: failed to parse xml document '<https://ci.centos.org/job/libvirt-rpm/systems=libvirt-fedora-rawhide/ws/bui…'> FAILED 351) cpuTestUpdateLive(x86_64): Xeon-E5-2623-v4 ... libvirt: CPU Driver error : XML error: failed to parse xml document '<https://ci.centos.org/job/libvirt-rpm/systems=libvirt-fedora-rawhide/ws/bui…'> FAILED 352) cpuTestHostCPUID(x86_64): Xeon-E5-2630-v3 ... libvirt: CPU Driver error : XML error: failed to parse xml document '<https://ci.centos.org/job/libvirt-rpm/systems=libvirt-fedora-rawhide/ws/bui…'> FAILED 353) cpuTestGuestCPUID(x86_64): Xeon-E5-2630-v3 ... libvirt: CPU Driver error : XML error: failed to parse xml document '<https://ci.centos.org/job/libvirt-rpm/systems=libvirt-fedora-rawhide/ws/bui…'> FAILED 354) cpuTestCPUIDSignature(x86_64): Xeon-E5-2630-v3 ... OK 355) cpuTestJSONCPUID(x86_64): Xeon-E5-2630-v3 ... libvirt: CPU Driver error : XML error: failed to parse xml document '<https://ci.centos.org/job/libvirt-rpm/systems=libvirt-fedora-rawhide/ws/bui…'> FAILED 356) cpuTestJSONSignature(x86_64): Xeon-E5-2630-v3 ... libvirt: CPU Driver error : XML error: failed to parse xml document '<https://ci.centos.org/job/libvirt-rpm/systems=libvirt-fedora-rawhide/ws/bui…'> FAILED 357) cpuTestUpdateLive(x86_64): Xeon-E5-2630-v3 ... libvirt: CPU Driver error : XML error: failed to parse xml document '<https://ci.centos.org/job/libvirt-rpm/systems=libvirt-fedora-rawhide/ws/bui…'> FAILED 358) cpuTestHostCPUID(x86_64): Xeon-E5-2630-v4 ... libvirt: CPU Driver error : XML error: failed to parse xml document '<https://ci.centos.org/job/libvirt-rpm/systems=libvirt-fedora-rawhide/ws/bui…'> FAILED 359) cpuTestGuestCPUID(x86_64): Xeon-E5-2630-v4 ... libvirt: CPU Driver error : XML error: failed to parse xml document '<https://ci.centos.org/job/libvirt-rpm/systems=libvirt-fedora-rawhide/ws/bui…'> FAILED 360) cpuTestCPUIDSignature(x86_64): Xeon-E5-2630-v4 ... OK 361) cpuTestGuestCPUID(x86_64): Xeon-E5-2630-v4 ... libvirt: CPU Driver error : XML error: failed to parse xml document '<https://ci.centos.org/job/libvirt-rpm/systems=libvirt-fedora-rawhide/ws/bui…'> FAILED 362) cpuTestJSONCPUID(x86_64): Xeon-E5-2630-v4 ... libvirt: CPU Driver error : XML error: failed to parse xml document '<https://ci.centos.org/job/libvirt-rpm/systems=libvirt-fedora-rawhide/ws/bui…'> FAILED 363) cpuTestJSONSignature(x86_64): Xeon-E5-2630-v4 ... libvirt: CPU Driver error : XML error: failed to parse xml document '<https://ci.centos.org/job/libvirt-rpm/systems=libvirt-fedora-rawhide/ws/bui…'> FAILED 364) cpuTestUpdateLive(x86_64): Xeon-E5-2630-v4 ... libvirt: CPU Driver error : XML error: failed to parse xml document '<https://ci.centos.org/job/libvirt-rpm/systems=libvirt-fedora-rawhide/ws/bui…'> FAILED 365) cpuTestHostCPUID(x86_64): Xeon-E5-2650 ... libvirt: CPU Driver error : XML error: failed to parse xml document '<https://ci.centos.org/job/libvirt-rpm/systems=libvirt-fedora-rawhide/ws/bui…'> FAILED 366) cpuTestGuestCPUID(x86_64): Xeon-E5-2650 ... libvirt: CPU Driver error : XML error: failed to parse xml document '<https://ci.centos.org/job/libvirt-rpm/systems=libvirt-fedora-rawhide/ws/bui…'> FAILED 367) cpuTestCPUIDSignature(x86_64): Xeon-E5-2650 ... OK 368) cpuTestGuestCPUID(x86_64): Xeon-E5-2650 ... libvirt: CPU Driver error : XML error: failed to parse xml document '<https://ci.centos.org/job/libvirt-rpm/systems=libvirt-fedora-rawhide/ws/bui…'> FAILED 369) cpuTestJSONCPUID(x86_64): Xeon-E5-2650 ... libvirt: CPU Driver error : XML error: failed to parse xml document '<https://ci.centos.org/job/libvirt-rpm/systems=libvirt-fedora-rawhide/ws/bui…'> FAILED 370) cpuTestJSONSignature(x86_64): Xeon-E5-2650 ... libvirt: CPU Driver error : XML error: failed to parse xml document '<https://ci.centos.org/job/libvirt-rpm/systems=libvirt-fedora-rawhide/ws/bui…'> FAILED 371) cpuTestUpdateLive(x86_64): Xeon-E5-2650 ... libvirt: CPU Driver error : XML error: failed to parse xml document '<https://ci.centos.org/job/libvirt-rpm/systems=libvirt-fedora-rawhide/ws/bui…'> FAILED 372) cpuTestHostCPUID(x86_64): Xeon-E5-2650-v3 ... libvirt: CPU Driver error : XML error: failed to parse xml document '<https://ci.centos.org/job/libvirt-rpm/systems=libvirt-fedora-rawhide/ws/bui…'> FAILED 373) cpuTestGuestCPUID(x86_64): Xeon-E5-2650-v3 ... libvirt: CPU Driver error : XML error: failed to parse xml document '<https://ci.centos.org/job/libvirt-rpm/systems=libvirt-fedora-rawhide/ws/bui…'> FAILED 374) cpuTestCPUIDSignature(x86_64): Xeon-E5-2650-v3 ... OK 375) cpuTestJSONCPUID(x86_64): Xeon-E5-2650-v3 ... libvirt: CPU Driver error : XML error: failed to parse xml document '<https://ci.centos.org/job/libvirt-rpm/systems=libvirt-fedora-rawhide/ws/bui…'> FAILED 376) cpuTestJSONSignature(x86_64): Xeon-E5-2650-v3 ... libvirt: CPU Driver error : XML error: failed to parse xml document '<https://ci.centos.org/job/libvirt-rpm/systems=libvirt-fedora-rawhide/ws/bui…'> FAILED 377) cpuTestUpdateLive(x86_64): Xeon-E5-2650-v3 ... libvirt: CPU Driver error : XML error: failed to parse xml document '<https://ci.centos.org/job/libvirt-rpm/systems=libvirt-fedora-rawhide/ws/bui…'> FAILED 378) cpuTestHostCPUID(x86_64): Xeon-E5-2650-v4 ... libvirt: CPU Driver error : XML error: failed to parse xml document '<https://ci.centos.org/job/libvirt-rpm/systems=libvirt-fedora-rawhide/ws/bui…'> FAILED 379) cpuTestGuestCPUID(x86_64): Xeon-E5-2650-v4 ... libvirt: CPU Driver error : XML error: failed to parse xml document '<https://ci.centos.org/job/libvirt-rpm/systems=libvirt-fedora-rawhide/ws/bui…'> FAILED 380) cpuTestCPUIDSignature(x86_64): Xeon-E5-2650-v4 ... OK 381) cpuTestGuestCPUID(x86_64): Xeon-E5-2650-v4 ... libvirt: CPU Driver error : XML error: failed to parse xml document '<https://ci.centos.org/job/libvirt-rpm/systems=libvirt-fedora-rawhide/ws/bui…'> FAILED 382) cpuTestJSONCPUID(x86_64): Xeon-E5-2650-v4 ... libvirt: CPU Driver error : XML error: failed to parse xml document '<https://ci.centos.org/job/libvirt-rpm/systems=libvirt-fedora-rawhide/ws/bui…'> FAILED 383) cpuTestJSONSignature(x86_64): Xeon-E5-2650-v4 ... libvirt: CPU Driver error : XML error: failed to parse xml document '<https://ci.centos.org/job/libvirt-rpm/systems=libvirt-fedora-rawhide/ws/bui…'> FAILED 384) cpuTestUpdateLive(x86_64): Xeon-E5-2650-v4 ... libvirt: CPU Driver error : XML error: failed to parse xml document '<https://ci.centos.org/job/libvirt-rpm/systems=libvirt-fedora-rawhide/ws/bui…'> FAILED 385) cpuTestHostCPUID(x86_64): Xeon-E7-4820 ... libvirt: CPU Driver error : XML error: failed to parse xml document '<https://ci.centos.org/job/libvirt-rpm/systems=libvirt-fedora-rawhide/ws/bui…'> FAILED 386) cpuTestGuestCPUID(x86_64): Xeon-E7-4820 ... libvirt: CPU Driver error : XML error: failed to parse xml document '<https://ci.centos.org/job/libvirt-rpm/systems=libvirt-fedora-rawhide/ws/bui…'> FAILED 387) cpuTestCPUIDSignature(x86_64): Xeon-E7-4820 ... OK 388) cpuTestJSONCPUID(x86_64): Xeon-E7-4820 ... libvirt: CPU Driver error : XML error: failed to parse xml document '<https://ci.centos.org/job/libvirt-rpm/systems=libvirt-fedora-rawhide/ws/bui…'> FAILED 389) cpuTestJSONSignature(x86_64): Xeon-E7-4820 ... libvirt: CPU Driver error : XML error: failed to parse xml document '<https://ci.centos.org/job/libvirt-rpm/systems=libvirt-fedora-rawhide/ws/bui…'> FAILED 390) cpuTestUpdateLive(x86_64): Xeon-E7-4820 ... libvirt: CPU Driver error : XML error: failed to parse xml document '<https://ci.centos.org/job/libvirt-rpm/systems=libvirt-fedora-rawhide/ws/bui…'> FAILED 391) cpuTestHostCPUID(x86_64): Xeon-E7-4830 ... libvirt: CPU Driver error : XML error: failed to parse xml document '<https://ci.centos.org/job/libvirt-rpm/systems=libvirt-fedora-rawhide/ws/bui…'> FAILED 392) cpuTestGuestCPUID(x86_64): Xeon-E7-4830 ... libvirt: CPU Driver error : XML error: failed to parse xml document '<https://ci.centos.org/job/libvirt-rpm/systems=libvirt-fedora-rawhide/ws/bui…'> FAILED 393) cpuTestCPUIDSignature(x86_64): Xeon-E7-4830 ... OK 394) cpuTestJSONCPUID(x86_64): Xeon-E7-4830 ... libvirt: CPU Driver error : XML error: failed to parse xml document '<https://ci.centos.org/job/libvirt-rpm/systems=libvirt-fedora-rawhide/ws/bui…'> FAILED 395) cpuTestJSONSignature(x86_64): Xeon-E7-4830 ... libvirt: CPU Driver error : XML error: failed to parse xml document '<https://ci.centos.org/job/libvirt-rpm/systems=libvirt-fedora-rawhide/ws/bui…'> FAILED 396) cpuTestUpdateLive(x86_64): Xeon-E7-4830 ... libvirt: CPU Driver error : XML error: failed to parse xml document '<https://ci.centos.org/job/libvirt-rpm/systems=libvirt-fedora-rawhide/ws/bui…'> FAILED 397) cpuTestHostCPUID(x86_64): Xeon-E7-8890-v3 ... libvirt: CPU Driver error : XML error: failed to parse xml document '<https://ci.centos.org/job/libvirt-rpm/systems=libvirt-fedora-rawhide/ws/bui…'> FAILED 398) cpuTestGuestCPUID(x86_64): Xeon-E7-8890-v3 ... libvirt: CPU Driver error : XML error: failed to parse xml document '<https://ci.centos.org/job/libvirt-rpm/systems=libvirt-fedora-rawhide/ws/bui…'> FAILED 399) cpuTestCPUIDSignature(x86_64): Xeon-E7-8890-v3 ... OK 400) cpuTestGuestCPUID(x86_64): Xeon-E7-8890-v3 ... libvirt: CPU Driver error : XML error: failed to parse xml document '<https://ci.centos.org/job/libvirt-rpm/systems=libvirt-fedora-rawhide/ws/bui…'> FAILED 401) cpuTestJSONCPUID(x86_64): Xeon-E7-8890-v3 ... libvirt: CPU Driver error : XML error: failed to parse xml document '<https://ci.centos.org/job/libvirt-rpm/systems=libvirt-fedora-rawhide/ws/bui…'> FAILED 402) cpuTestJSONSignature(x86_64): Xeon-E7-8890-v3 ... libvirt: CPU Driver error : XML error: failed to parse xml document '<https://ci.centos.org/job/libvirt-rpm/systems=libvirt-fedora-rawhide/ws/bui…'> FAILED 403) cpuTestUpdateLive(x86_64): Xeon-E7-8890-v3 ... libvirt: CPU Driver error : XML error: failed to parse xml document '<https://ci.centos.org/job/libvirt-rpm/systems=libvirt-fedora-rawhide/ws/bui…'> FAILED 404) cpuTestHostCPUID(x86_64): Xeon-E7540 ... libvirt: CPU Driver error : XML error: failed to parse xml document '<https://ci.centos.org/job/libvirt-rpm/systems=libvirt-fedora-rawhide/ws/bui…'> FAILED 405) cpuTestGuestCPUID(x86_64): Xeon-E7540 ... libvirt: CPU Driver error : XML error: failed to parse xml document '<https://ci.centos.org/job/libvirt-rpm/systems=libvirt-fedora-rawhide/ws/bui…'> FAILED 406) cpuTestCPUIDSignature(x86_64): Xeon-E7540 ... OK 407) cpuTestGuestCPUID(x86_64): Xeon-E7540 ... libvirt: CPU Driver error : XML error: failed to parse xml document '<https://ci.centos.org/job/libvirt-rpm/systems=libvirt-fedora-rawhide/ws/bui…'> FAILED 408) cpuTestJSONCPUID(x86_64): Xeon-E7540 ... libvirt: CPU Driver error : XML error: failed to parse xml document '<https://ci.centos.org/job/libvirt-rpm/systems=libvirt-fedora-rawhide/ws/bui…'> FAILED 409) cpuTestJSONSignature(x86_64): Xeon-E7540 ... libvirt: CPU Driver error : XML error: failed to parse xml document '<https://ci.centos.org/job/libvirt-rpm/systems=libvirt-fedora-rawhide/ws/bui…'> FAILED 410) cpuTestUpdateLive(x86_64): Xeon-E7540 ... libvirt: CPU Driver error : XML error: failed to parse xml document '<https://ci.centos.org/job/libvirt-rpm/systems=libvirt-fedora-rawhide/ws/bui…'> FAILED 411) cpuTestHostCPUID(x86_64): Xeon-Gold-5115 ... libvirt: CPU Driver error : XML error: failed to parse xml document '<https://ci.centos.org/job/libvirt-rpm/systems=libvirt-fedora-rawhide/ws/bui…'> FAILED 412) cpuTestGuestCPUID(x86_64): Xeon-Gold-5115 ... libvirt: CPU Driver error : XML error: failed to parse xml document '<https://ci.centos.org/job/libvirt-rpm/systems=libvirt-fedora-rawhide/ws/bui…'> FAILED 413) cpuTestCPUIDSignature(x86_64): Xeon-Gold-5115 ... OK 414) cpuTestGuestCPUID(x86_64): Xeon-Gold-5115 ... libvirt: CPU Driver error : XML error: failed to parse xml document '<https://ci.centos.org/job/libvirt-rpm/systems=libvirt-fedora-rawhide/ws/bui…'> FAILED 415) cpuTestJSONCPUID(x86_64): Xeon-Gold-5115 ... libvirt: CPU Driver error : XML error: failed to parse xml document '<https://ci.centos.org/job/libvirt-rpm/systems=libvirt-fedora-rawhide/ws/bui…'> FAILED 416) cpuTestJSONSignature(x86_64): Xeon-Gold-5115 ... libvirt: CPU Driver error : XML error: failed to parse xml document '<https://ci.centos.org/job/libvirt-rpm/systems=libvirt-fedora-rawhide/ws/bui…'> FAILED 417) cpuTestUpdateLive(x86_64): Xeon-Gold-5115 ... libvirt: CPU Driver error : XML error: failed to parse xml document '<https://ci.centos.org/job/libvirt-rpm/systems=libvirt-fedora-rawhide/ws/bui…'> FAILED 418) cpuTestHostCPUID(x86_64): Xeon-Gold-6130 ... libvirt: CPU Driver error : XML error: failed to parse xml document '<https://ci.centos.org/job/libvirt-rpm/systems=libvirt-fedora-rawhide/ws/bui…'> FAILED 419) cpuTestGuestCPUID(x86_64): Xeon-Gold-6130 ... libvirt: CPU Driver error : XML error: failed to parse xml document '<https://ci.centos.org/job/libvirt-rpm/systems=libvirt-fedora-rawhide/ws/bui…'> FAILED 420) cpuTestCPUIDSignature(x86_64): Xeon-Gold-6130 ... OK 421) cpuTestGuestCPUID(x86_64): Xeon-Gold-6130 ... libvirt: CPU Driver error : XML error: failed to parse xml document '<https://ci.centos.org/job/libvirt-rpm/systems=libvirt-fedora-rawhide/ws/bui…'> FAILED 422) cpuTestJSONCPUID(x86_64): Xeon-Gold-6130 ... libvirt: CPU Driver error : XML error: failed to parse xml document '<https://ci.centos.org/job/libvirt-rpm/systems=libvirt-fedora-rawhide/ws/bui…'> FAILED 423) cpuTestJSONSignature(x86_64): Xeon-Gold-6130 ... libvirt: CPU Driver error : XML error: failed to parse xml document '<https://ci.centos.org/job/libvirt-rpm/systems=libvirt-fedora-rawhide/ws/bui…'> FAILED 424) cpuTestUpdateLive(x86_64): Xeon-Gold-6130 ... libvirt: CPU Driver error : XML error: failed to parse xml document '<https://ci.centos.org/job/libvirt-rpm/systems=libvirt-fedora-rawhide/ws/bui…'> FAILED 425) cpuTestHostCPUID(x86_64): Xeon-Gold-6148 ... libvirt: CPU Driver error : XML error: failed to parse xml document '<https://ci.centos.org/job/libvirt-rpm/systems=libvirt-fedora-rawhide/ws/bui…'> FAILED 426) cpuTestGuestCPUID(x86_64): Xeon-Gold-6148 ... libvirt: CPU Driver error : XML error: failed to parse xml document '<https://ci.centos.org/job/libvirt-rpm/systems=libvirt-fedora-rawhide/ws/bui…'> FAILED 427) cpuTestCPUIDSignature(x86_64): Xeon-Gold-6148 ... OK 428) cpuTestJSONCPUID(x86_64): Xeon-Gold-6148 ... libvirt: CPU Driver error : XML error: failed to parse xml document '<https://ci.centos.org/job/libvirt-rpm/systems=libvirt-fedora-rawhide/ws/bui…'> FAILED 429) cpuTestJSONSignature(x86_64): Xeon-Gold-6148 ... libvirt: CPU Driver error : XML error: failed to parse xml document '<https://ci.centos.org/job/libvirt-rpm/systems=libvirt-fedora-rawhide/ws/bui…'> FAILED 430) cpuTestUpdateLive(x86_64): Xeon-Gold-6148 ... libvirt: CPU Driver error : XML error: failed to parse xml document '<https://ci.centos.org/job/libvirt-rpm/systems=libvirt-fedora-rawhide/ws/bui…'> FAILED 431) cpuTestHostCPUID(x86_64): Xeon-Platinum-8268 ... libvirt: CPU Driver error : XML error: failed to parse xml document '<https://ci.centos.org/job/libvirt-rpm/systems=libvirt-fedora-rawhide/ws/bui…'> FAILED 432) cpuTestGuestCPUID(x86_64): Xeon-Platinum-8268 ... libvirt: CPU Driver error : XML error: failed to parse xml document '<https://ci.centos.org/job/libvirt-rpm/systems=libvirt-fedora-rawhide/ws/bui…'> FAILED 433) cpuTestCPUIDSignature(x86_64): Xeon-Platinum-8268 ... OK 434) cpuTestJSONCPUID(x86_64): Xeon-Platinum-8268 ... libvirt: CPU Driver error : XML error: failed to parse xml document '<https://ci.centos.org/job/libvirt-rpm/systems=libvirt-fedora-rawhide/ws/bui…'> FAILED 435) cpuTestJSONSignature(x86_64): Xeon-Platinum-8268 ... libvirt: CPU Driver error : XML error: failed to parse xml document '<https://ci.centos.org/job/libvirt-rpm/systems=libvirt-fedora-rawhide/ws/bui…'> FAILED 436) cpuTestUpdateLive(x86_64): Xeon-Platinum-8268 ... libvirt: CPU Driver error : XML error: failed to parse xml document '<https://ci.centos.org/job/libvirt-rpm/systems=libvirt-fedora-rawhide/ws/bui…'> FAILED 437) cpuTestHostCPUID(x86_64): Xeon-Platinum-9242 ... libvirt: CPU Driver error : XML error: failed to parse xml document '<https://ci.centos.org/job/libvirt-rpm/systems=libvirt-fedora-rawhide/ws/bui…'> FAILED 438) cpuTestGuestCPUID(x86_64): Xeon-Platinum-9242 ... libvirt: CPU Driver error : XML error: failed to parse xml document '<https://ci.centos.org/job/libvirt-rpm/systems=libvirt-fedora-rawhide/ws/bui…'> FAILED 439) cpuTestCPUIDSignature(x86_64): Xeon-Platinum-9242 ... OK 440) cpuTestGuestCPUID(x86_64): Xeon-Platinum-9242 ... libvirt: CPU Driver error : XML error: failed to parse xml document '<https://ci.centos.org/job/libvirt-rpm/systems=libvirt-fedora-rawhide/ws/bui…'> FAILED 441) cpuTestJSONCPUID(x86_64): Xeon-Platinum-9242 ... libvirt: CPU Driver error : XML error: failed to parse xml document '<https://ci.centos.org/job/libvirt-rpm/systems=libvirt-fedora-rawhide/ws/bui…'> FAILED 442) cpuTestJSONSignature(x86_64): Xeon-Platinum-9242 ... libvirt: CPU Driver error : XML error: failed to parse xml document '<https://ci.centos.org/job/libvirt-rpm/systems=libvirt-fedora-rawhide/ws/bui…'> FAILED 443) cpuTestUpdateLive(x86_64): Xeon-Platinum-9242 ... libvirt: CPU Driver error : XML error: failed to parse xml document '<https://ci.centos.org/job/libvirt-rpm/systems=libvirt-fedora-rawhide/ws/bui…'> FAILED 444) cpuTestHostCPUID(x86_64): Xeon-W3520 ... libvirt: CPU Driver error : XML error: failed to parse xml document '<https://ci.centos.org/job/libvirt-rpm/systems=libvirt-fedora-rawhide/ws/bui…'> FAILED 445) cpuTestGuestCPUID(x86_64): Xeon-W3520 ... libvirt: CPU Driver error : XML error: failed to parse xml document '<https://ci.centos.org/job/libvirt-rpm/systems=libvirt-fedora-rawhide/ws/bui…'> FAILED 446) cpuTestCPUIDSignature(x86_64): Xeon-W3520 ... OK 447) cpuTestJSONCPUID(x86_64): Xeon-W3520 ... libvirt: CPU Driver error : XML error: failed to parse xml document '<https://ci.centos.org/job/libvirt-rpm/systems=libvirt-fedora-rawhide/ws/bui…'> FAILED 448) cpuTestJSONSignature(x86_64): Xeon-W3520 ... libvirt: CPU Driver error : XML error: failed to parse xml document '<https://ci.centos.org/job/libvirt-rpm/systems=libvirt-fedora-rawhide/ws/bui…'> FAILED 449) cpuTestUpdateLive(x86_64): Xeon-W3520 ... libvirt: CPU Driver error : XML error: failed to parse xml document '<https://ci.centos.org/job/libvirt-rpm/systems=libvirt-fedora-rawhide/ws/bui…'> FAILED 450) cpuTestHostCPUID(x86_64): Xeon-X5460 ... libvirt: CPU Driver error : XML error: failed to parse xml document '<https://ci.centos.org/job/libvirt-rpm/systems=libvirt-fedora-rawhide/ws/bui…'> FAILED 451) cpuTestGuestCPUID(x86_64): Xeon-X5460 ... libvirt: CPU Driver error : XML error: failed to parse xml document '<https://ci.centos.org/job/libvirt-rpm/systems=libvirt-fedora-rawhide/ws/bui…'> FAILED 452) cpuTestCPUIDSignature(x86_64): Xeon-X5460 ... OK 453) cpuTestHostCPUID(x86_64): Ice-Lake-Server ... libvirt: CPU Driver error : XML error: failed to parse xml document '<https://ci.centos.org/job/libvirt-rpm/systems=libvirt-fedora-rawhide/ws/bui…'> FAILED 454) cpuTestGuestCPUID(x86_64): Ice-Lake-Server ... libvirt: CPU Driver error : XML error: failed to parse xml document '<https://ci.centos.org/job/libvirt-rpm/systems=libvirt-fedora-rawhide/ws/bui…'> FAILED 455) cpuTestCPUIDSignature(x86_64): Ice-Lake-Server ... OK 456) cpuTestGuestCPUID(x86_64): Ice-Lake-Server ... libvirt: CPU Driver error : XML error: failed to parse xml document '<https://ci.centos.org/job/libvirt-rpm/systems=libvirt-fedora-rawhide/ws/bui…'> FAILED 457) cpuTestJSONCPUID(x86_64): Ice-Lake-Server ... libvirt: CPU Driver error : XML error: failed to parse xml document '<https://ci.centos.org/job/libvirt-rpm/systems=libvirt-fedora-rawhide/ws/bui…'> FAILED 458) cpuTestJSONSignature(x86_64): Ice-Lake-Server ... libvirt: CPU Driver error : XML error: failed to parse xml document '<https://ci.centos.org/job/libvirt-rpm/systems=libvirt-fedora-rawhide/ws/bui…'> FAILED 459) cpuTestUpdateLive(x86_64): Ice-Lake-Server ... libvirt: CPU Driver error : XML error: failed to parse xml document '<https://ci.centos.org/job/libvirt-rpm/systems=libvirt-fedora-rawhide/ws/bui…'> FAILED 460) cpuTestHostCPUID(x86_64): Cooperlake ... libvirt: CPU Driver error : XML error: failed to parse xml document '<https://ci.centos.org/job/libvirt-rpm/systems=libvirt-fedora-rawhide/ws/bui…'> FAILED 461) cpuTestGuestCPUID(x86_64): Cooperlake ... libvirt: CPU Driver error : XML error: failed to parse xml document '<https://ci.centos.org/job/libvirt-rpm/systems=libvirt-fedora-rawhide/ws/bui…'> FAILED 462) cpuTestCPUIDSignature(x86_64): Cooperlake ... OK 463) cpuTestGuestCPUID(x86_64): Cooperlake ... libvirt: CPU Driver error : XML error: failed to parse xml document '<https://ci.centos.org/job/libvirt-rpm/systems=libvirt-fedora-rawhide/ws/bui…'> FAILED 464) cpuTestJSONCPUID(x86_64): Cooperlake ... libvirt: CPU Driver error : XML error: failed to parse xml document '<https://ci.centos.org/job/libvirt-rpm/systems=libvirt-fedora-rawhide/ws/bui…'> FAILED 465) cpuTestJSONSignature(x86_64): Cooperlake ... libvirt: CPU Driver error : XML error: failed to parse xml document '<https://ci.centos.org/job/libvirt-rpm/systems=libvirt-fedora-rawhide/ws/bui…'> FAILED 466) cpuTestUpdateLive(x86_64): Cooperlake ... libvirt: CPU Driver error : XML error: failed to parse xml document '<https://ci.centos.org/job/libvirt-rpm/systems=libvirt-fedora-rawhide/ws/bui…'> FAILED Some tests failed. Run them using: VIR_TEST_DEBUG=1 VIR_TEST_RANGE=1-3,6,16-31,33-35,45-58,78-91,97-109,112,114-115,117,123-124,126-130,132-133,135-136,138-142,144-148,150-155,157-161,163-167,169-173,175-179,181-182,184-188,190-194,196-200,202-206,208-212,214-218,220-224,226-231,233-238,240-245,247-252,254-258,260-261,263-267,269-273,275-279,281-282,284-285,287-291,293-297,299-300,302-303,305-309,311-315,317-322,324-325,327-332,334-339,341-346,348-353,355-359,361-366,368-373,375-379,381-386,388-392,394-398,400-405,407-412,414-419,421-426,428-432,434-438,440-445,447-451,453-454,456-461,463-466 <https://ci.centos.org/job/libvirt-rpm/systems=libvirt-fedora-rawhide/ws/bui…> FAIL cputest (exit status: 1) + exit 1 error: Bad exit status from /var/tmp/rpm-tmp.chR0gU (%check) RPM build errors: Found bdb Packages database while attempting sqlite backend: using bdb backend. Bad exit status from /var/tmp/rpm-tmp.chR0gU (%check) Build step 'Execute shell' marked build as failure
1 2
0 0
Build failed in Jenkins: libvirt-rpm » libvirt-fedora-32 #1093
by ci@centos.org 26 May '20

26 May '20
See <https://ci.centos.org/job/libvirt-rpm/systems=libvirt-fedora-32/1093/displa…> ------------------------------------------ [...truncated 7.37 MB...] 338) cpuTestHostCPUID(x86_64): Xeon-E5-2609-v3 ... libvirt: CPU Driver error : XML error: failed to parse xml document '<https://ci.centos.org/job/libvirt-rpm/systems=libvirt-fedora-32/ws/build/rp…'> FAILED 339) cpuTestGuestCPUID(x86_64): Xeon-E5-2609-v3 ... libvirt: CPU Driver error : XML error: failed to parse xml document '<https://ci.centos.org/job/libvirt-rpm/systems=libvirt-fedora-32/ws/build/rp…'> FAILED 340) cpuTestCPUIDSignature(x86_64): Xeon-E5-2609-v3 ... OK 341) cpuTestGuestCPUID(x86_64): Xeon-E5-2609-v3 ... libvirt: CPU Driver error : XML error: failed to parse xml document '<https://ci.centos.org/job/libvirt-rpm/systems=libvirt-fedora-32/ws/build/rp…'> FAILED 342) cpuTestJSONCPUID(x86_64): Xeon-E5-2609-v3 ... libvirt: CPU Driver error : XML error: failed to parse xml document '<https://ci.centos.org/job/libvirt-rpm/systems=libvirt-fedora-32/ws/build/rp…'> FAILED 343) cpuTestJSONSignature(x86_64): Xeon-E5-2609-v3 ... libvirt: CPU Driver error : XML error: failed to parse xml document '<https://ci.centos.org/job/libvirt-rpm/systems=libvirt-fedora-32/ws/build/rp…'> FAILED 344) cpuTestUpdateLive(x86_64): Xeon-E5-2609-v3 ... libvirt: CPU Driver error : XML error: failed to parse xml document '<https://ci.centos.org/job/libvirt-rpm/systems=libvirt-fedora-32/ws/build/rp…'> FAILED 345) cpuTestHostCPUID(x86_64): Xeon-E5-2623-v4 ... libvirt: CPU Driver error : XML error: failed to parse xml document '<https://ci.centos.org/job/libvirt-rpm/systems=libvirt-fedora-32/ws/build/rp…'> FAILED 346) cpuTestGuestCPUID(x86_64): Xeon-E5-2623-v4 ... libvirt: CPU Driver error : XML error: failed to parse xml document '<https://ci.centos.org/job/libvirt-rpm/systems=libvirt-fedora-32/ws/build/rp…'> FAILED 347) cpuTestCPUIDSignature(x86_64): Xeon-E5-2623-v4 ... OK 348) cpuTestGuestCPUID(x86_64): Xeon-E5-2623-v4 ... libvirt: CPU Driver error : XML error: failed to parse xml document '<https://ci.centos.org/job/libvirt-rpm/systems=libvirt-fedora-32/ws/build/rp…'> FAILED 349) cpuTestJSONCPUID(x86_64): Xeon-E5-2623-v4 ... libvirt: CPU Driver error : XML error: failed to parse xml document '<https://ci.centos.org/job/libvirt-rpm/systems=libvirt-fedora-32/ws/build/rp…'> FAILED 350) cpuTestJSONSignature(x86_64): Xeon-E5-2623-v4 ... libvirt: CPU Driver error : XML error: failed to parse xml document '<https://ci.centos.org/job/libvirt-rpm/systems=libvirt-fedora-32/ws/build/rp…'> FAILED 351) cpuTestUpdateLive(x86_64): Xeon-E5-2623-v4 ... libvirt: CPU Driver error : XML error: failed to parse xml document '<https://ci.centos.org/job/libvirt-rpm/systems=libvirt-fedora-32/ws/build/rp…'> FAILED 352) cpuTestHostCPUID(x86_64): Xeon-E5-2630-v3 ... libvirt: CPU Driver error : XML error: failed to parse xml document '<https://ci.centos.org/job/libvirt-rpm/systems=libvirt-fedora-32/ws/build/rp…'> FAILED 353) cpuTestGuestCPUID(x86_64): Xeon-E5-2630-v3 ... libvirt: CPU Driver error : XML error: failed to parse xml document '<https://ci.centos.org/job/libvirt-rpm/systems=libvirt-fedora-32/ws/build/rp…'> FAILED 354) cpuTestCPUIDSignature(x86_64): Xeon-E5-2630-v3 ... OK 355) cpuTestJSONCPUID(x86_64): Xeon-E5-2630-v3 ... libvirt: CPU Driver error : XML error: failed to parse xml document '<https://ci.centos.org/job/libvirt-rpm/systems=libvirt-fedora-32/ws/build/rp…'> FAILED 356) cpuTestJSONSignature(x86_64): Xeon-E5-2630-v3 ... libvirt: CPU Driver error : XML error: failed to parse xml document '<https://ci.centos.org/job/libvirt-rpm/systems=libvirt-fedora-32/ws/build/rp…'> FAILED 357) cpuTestUpdateLive(x86_64): Xeon-E5-2630-v3 ... libvirt: CPU Driver error : XML error: failed to parse xml document '<https://ci.centos.org/job/libvirt-rpm/systems=libvirt-fedora-32/ws/build/rp…'> FAILED 358) cpuTestHostCPUID(x86_64): Xeon-E5-2630-v4 ... libvirt: CPU Driver error : XML error: failed to parse xml document '<https://ci.centos.org/job/libvirt-rpm/systems=libvirt-fedora-32/ws/build/rp…'> FAILED 359) cpuTestGuestCPUID(x86_64): Xeon-E5-2630-v4 ... libvirt: CPU Driver error : XML error: failed to parse xml document '<https://ci.centos.org/job/libvirt-rpm/systems=libvirt-fedora-32/ws/build/rp…'> FAILED 360) cpuTestCPUIDSignature(x86_64): Xeon-E5-2630-v4 ... OK 361) cpuTestGuestCPUID(x86_64): Xeon-E5-2630-v4 ... libvirt: CPU Driver error : XML error: failed to parse xml document '<https://ci.centos.org/job/libvirt-rpm/systems=libvirt-fedora-32/ws/build/rp…'> FAILED 362) cpuTestJSONCPUID(x86_64): Xeon-E5-2630-v4 ... libvirt: CPU Driver error : XML error: failed to parse xml document '<https://ci.centos.org/job/libvirt-rpm/systems=libvirt-fedora-32/ws/build/rp…'> FAILED 363) cpuTestJSONSignature(x86_64): Xeon-E5-2630-v4 ... libvirt: CPU Driver error : XML error: failed to parse xml document '<https://ci.centos.org/job/libvirt-rpm/systems=libvirt-fedora-32/ws/build/rp…'> FAILED 364) cpuTestUpdateLive(x86_64): Xeon-E5-2630-v4 ... libvirt: CPU Driver error : XML error: failed to parse xml document '<https://ci.centos.org/job/libvirt-rpm/systems=libvirt-fedora-32/ws/build/rp…'> FAILED 365) cpuTestHostCPUID(x86_64): Xeon-E5-2650 ... libvirt: CPU Driver error : XML error: failed to parse xml document '<https://ci.centos.org/job/libvirt-rpm/systems=libvirt-fedora-32/ws/build/rp…'> FAILED 366) cpuTestGuestCPUID(x86_64): Xeon-E5-2650 ... libvirt: CPU Driver error : XML error: failed to parse xml document '<https://ci.centos.org/job/libvirt-rpm/systems=libvirt-fedora-32/ws/build/rp…'> FAILED 367) cpuTestCPUIDSignature(x86_64): Xeon-E5-2650 ... OK 368) cpuTestGuestCPUID(x86_64): Xeon-E5-2650 ... libvirt: CPU Driver error : XML error: failed to parse xml document '<https://ci.centos.org/job/libvirt-rpm/systems=libvirt-fedora-32/ws/build/rp…'> FAILED 369) cpuTestJSONCPUID(x86_64): Xeon-E5-2650 ... libvirt: CPU Driver error : XML error: failed to parse xml document '<https://ci.centos.org/job/libvirt-rpm/systems=libvirt-fedora-32/ws/build/rp…'> FAILED 370) cpuTestJSONSignature(x86_64): Xeon-E5-2650 ... libvirt: CPU Driver error : XML error: failed to parse xml document '<https://ci.centos.org/job/libvirt-rpm/systems=libvirt-fedora-32/ws/build/rp…'> FAILED 371) cpuTestUpdateLive(x86_64): Xeon-E5-2650 ... libvirt: CPU Driver error : XML error: failed to parse xml document '<https://ci.centos.org/job/libvirt-rpm/systems=libvirt-fedora-32/ws/build/rp…'> FAILED 372) cpuTestHostCPUID(x86_64): Xeon-E5-2650-v3 ... libvirt: CPU Driver error : XML error: failed to parse xml document '<https://ci.centos.org/job/libvirt-rpm/systems=libvirt-fedora-32/ws/build/rp…'> FAILED 373) cpuTestGuestCPUID(x86_64): Xeon-E5-2650-v3 ... libvirt: CPU Driver error : XML error: failed to parse xml document '<https://ci.centos.org/job/libvirt-rpm/systems=libvirt-fedora-32/ws/build/rp…'> FAILED 374) cpuTestCPUIDSignature(x86_64): Xeon-E5-2650-v3 ... OK 375) cpuTestJSONCPUID(x86_64): Xeon-E5-2650-v3 ... libvirt: CPU Driver error : XML error: failed to parse xml document '<https://ci.centos.org/job/libvirt-rpm/systems=libvirt-fedora-32/ws/build/rp…'> FAILED 376) cpuTestJSONSignature(x86_64): Xeon-E5-2650-v3 ... libvirt: CPU Driver error : XML error: failed to parse xml document '<https://ci.centos.org/job/libvirt-rpm/systems=libvirt-fedora-32/ws/build/rp…'> FAILED 377) cpuTestUpdateLive(x86_64): Xeon-E5-2650-v3 ... libvirt: CPU Driver error : XML error: failed to parse xml document '<https://ci.centos.org/job/libvirt-rpm/systems=libvirt-fedora-32/ws/build/rp…'> FAILED 378) cpuTestHostCPUID(x86_64): Xeon-E5-2650-v4 ... libvirt: CPU Driver error : XML error: failed to parse xml document '<https://ci.centos.org/job/libvirt-rpm/systems=libvirt-fedora-32/ws/build/rp…'> FAILED 379) cpuTestGuestCPUID(x86_64): Xeon-E5-2650-v4 ... libvirt: CPU Driver error : XML error: failed to parse xml document '<https://ci.centos.org/job/libvirt-rpm/systems=libvirt-fedora-32/ws/build/rp…'> FAILED 380) cpuTestCPUIDSignature(x86_64): Xeon-E5-2650-v4 ... OK 381) cpuTestGuestCPUID(x86_64): Xeon-E5-2650-v4 ... libvirt: CPU Driver error : XML error: failed to parse xml document '<https://ci.centos.org/job/libvirt-rpm/systems=libvirt-fedora-32/ws/build/rp…'> FAILED 382) cpuTestJSONCPUID(x86_64): Xeon-E5-2650-v4 ... libvirt: CPU Driver error : XML error: failed to parse xml document '<https://ci.centos.org/job/libvirt-rpm/systems=libvirt-fedora-32/ws/build/rp…'> FAILED 383) cpuTestJSONSignature(x86_64): Xeon-E5-2650-v4 ... libvirt: CPU Driver error : XML error: failed to parse xml document '<https://ci.centos.org/job/libvirt-rpm/systems=libvirt-fedora-32/ws/build/rp…'> FAILED 384) cpuTestUpdateLive(x86_64): Xeon-E5-2650-v4 ... libvirt: CPU Driver error : XML error: failed to parse xml document '<https://ci.centos.org/job/libvirt-rpm/systems=libvirt-fedora-32/ws/build/rp…'> FAILED 385) cpuTestHostCPUID(x86_64): Xeon-E7-4820 ... libvirt: CPU Driver error : XML error: failed to parse xml document '<https://ci.centos.org/job/libvirt-rpm/systems=libvirt-fedora-32/ws/build/rp…'> FAILED 386) cpuTestGuestCPUID(x86_64): Xeon-E7-4820 ... libvirt: CPU Driver error : XML error: failed to parse xml document '<https://ci.centos.org/job/libvirt-rpm/systems=libvirt-fedora-32/ws/build/rp…'> FAILED 387) cpuTestCPUIDSignature(x86_64): Xeon-E7-4820 ... OK 388) cpuTestJSONCPUID(x86_64): Xeon-E7-4820 ... libvirt: CPU Driver error : XML error: failed to parse xml document '<https://ci.centos.org/job/libvirt-rpm/systems=libvirt-fedora-32/ws/build/rp…'> FAILED 389) cpuTestJSONSignature(x86_64): Xeon-E7-4820 ... libvirt: CPU Driver error : XML error: failed to parse xml document '<https://ci.centos.org/job/libvirt-rpm/systems=libvirt-fedora-32/ws/build/rp…'> FAILED 390) cpuTestUpdateLive(x86_64): Xeon-E7-4820 ... libvirt: CPU Driver error : XML error: failed to parse xml document '<https://ci.centos.org/job/libvirt-rpm/systems=libvirt-fedora-32/ws/build/rp…'> FAILED 391) cpuTestHostCPUID(x86_64): Xeon-E7-4830 ... libvirt: CPU Driver error : XML error: failed to parse xml document '<https://ci.centos.org/job/libvirt-rpm/systems=libvirt-fedora-32/ws/build/rp…'> FAILED 392) cpuTestGuestCPUID(x86_64): Xeon-E7-4830 ... libvirt: CPU Driver error : XML error: failed to parse xml document '<https://ci.centos.org/job/libvirt-rpm/systems=libvirt-fedora-32/ws/build/rp…'> FAILED 393) cpuTestCPUIDSignature(x86_64): Xeon-E7-4830 ... OK 394) cpuTestJSONCPUID(x86_64): Xeon-E7-4830 ... libvirt: CPU Driver error : XML error: failed to parse xml document '<https://ci.centos.org/job/libvirt-rpm/systems=libvirt-fedora-32/ws/build/rp…'> FAILED 395) cpuTestJSONSignature(x86_64): Xeon-E7-4830 ... libvirt: CPU Driver error : XML error: failed to parse xml document '<https://ci.centos.org/job/libvirt-rpm/systems=libvirt-fedora-32/ws/build/rp…'> FAILED 396) cpuTestUpdateLive(x86_64): Xeon-E7-4830 ... libvirt: CPU Driver error : XML error: failed to parse xml document '<https://ci.centos.org/job/libvirt-rpm/systems=libvirt-fedora-32/ws/build/rp…'> FAILED 397) cpuTestHostCPUID(x86_64): Xeon-E7-8890-v3 ... libvirt: CPU Driver error : XML error: failed to parse xml document '<https://ci.centos.org/job/libvirt-rpm/systems=libvirt-fedora-32/ws/build/rp…'> FAILED 398) cpuTestGuestCPUID(x86_64): Xeon-E7-8890-v3 ... libvirt: CPU Driver error : XML error: failed to parse xml document '<https://ci.centos.org/job/libvirt-rpm/systems=libvirt-fedora-32/ws/build/rp…'> FAILED 399) cpuTestCPUIDSignature(x86_64): Xeon-E7-8890-v3 ... OK 400) cpuTestGuestCPUID(x86_64): Xeon-E7-8890-v3 ... libvirt: CPU Driver error : XML error: failed to parse xml document '<https://ci.centos.org/job/libvirt-rpm/systems=libvirt-fedora-32/ws/build/rp…'> FAILED 401) cpuTestJSONCPUID(x86_64): Xeon-E7-8890-v3 ... libvirt: CPU Driver error : XML error: failed to parse xml document '<https://ci.centos.org/job/libvirt-rpm/systems=libvirt-fedora-32/ws/build/rp…'> FAILED 402) cpuTestJSONSignature(x86_64): Xeon-E7-8890-v3 ... libvirt: CPU Driver error : XML error: failed to parse xml document '<https://ci.centos.org/job/libvirt-rpm/systems=libvirt-fedora-32/ws/build/rp…'> FAILED 403) cpuTestUpdateLive(x86_64): Xeon-E7-8890-v3 ... libvirt: CPU Driver error : XML error: failed to parse xml document '<https://ci.centos.org/job/libvirt-rpm/systems=libvirt-fedora-32/ws/build/rp…'> FAILED 404) cpuTestHostCPUID(x86_64): Xeon-E7540 ... libvirt: CPU Driver error : XML error: failed to parse xml document '<https://ci.centos.org/job/libvirt-rpm/systems=libvirt-fedora-32/ws/build/rp…'> FAILED 405) cpuTestGuestCPUID(x86_64): Xeon-E7540 ... libvirt: CPU Driver error : XML error: failed to parse xml document '<https://ci.centos.org/job/libvirt-rpm/systems=libvirt-fedora-32/ws/build/rp…'> FAILED 406) cpuTestCPUIDSignature(x86_64): Xeon-E7540 ... OK 407) cpuTestGuestCPUID(x86_64): Xeon-E7540 ... libvirt: CPU Driver error : XML error: failed to parse xml document '<https://ci.centos.org/job/libvirt-rpm/systems=libvirt-fedora-32/ws/build/rp…'> FAILED 408) cpuTestJSONCPUID(x86_64): Xeon-E7540 ... libvirt: CPU Driver error : XML error: failed to parse xml document '<https://ci.centos.org/job/libvirt-rpm/systems=libvirt-fedora-32/ws/build/rp…'> FAILED 409) cpuTestJSONSignature(x86_64): Xeon-E7540 ... libvirt: CPU Driver error : XML error: failed to parse xml document '<https://ci.centos.org/job/libvirt-rpm/systems=libvirt-fedora-32/ws/build/rp…'> FAILED 410) cpuTestUpdateLive(x86_64): Xeon-E7540 ... libvirt: CPU Driver error : XML error: failed to parse xml document '<https://ci.centos.org/job/libvirt-rpm/systems=libvirt-fedora-32/ws/build/rp…'> FAILED 411) cpuTestHostCPUID(x86_64): Xeon-Gold-5115 ... libvirt: CPU Driver error : XML error: failed to parse xml document '<https://ci.centos.org/job/libvirt-rpm/systems=libvirt-fedora-32/ws/build/rp…'> FAILED 412) cpuTestGuestCPUID(x86_64): Xeon-Gold-5115 ... libvirt: CPU Driver error : XML error: failed to parse xml document '<https://ci.centos.org/job/libvirt-rpm/systems=libvirt-fedora-32/ws/build/rp…'> FAILED 413) cpuTestCPUIDSignature(x86_64): Xeon-Gold-5115 ... OK 414) cpuTestGuestCPUID(x86_64): Xeon-Gold-5115 ... libvirt: CPU Driver error : XML error: failed to parse xml document '<https://ci.centos.org/job/libvirt-rpm/systems=libvirt-fedora-32/ws/build/rp…'> FAILED 415) cpuTestJSONCPUID(x86_64): Xeon-Gold-5115 ... libvirt: CPU Driver error : XML error: failed to parse xml document '<https://ci.centos.org/job/libvirt-rpm/systems=libvirt-fedora-32/ws/build/rp…'> FAILED 416) cpuTestJSONSignature(x86_64): Xeon-Gold-5115 ... libvirt: CPU Driver error : XML error: failed to parse xml document '<https://ci.centos.org/job/libvirt-rpm/systems=libvirt-fedora-32/ws/build/rp…'> FAILED 417) cpuTestUpdateLive(x86_64): Xeon-Gold-5115 ... libvirt: CPU Driver error : XML error: failed to parse xml document '<https://ci.centos.org/job/libvirt-rpm/systems=libvirt-fedora-32/ws/build/rp…'> FAILED 418) cpuTestHostCPUID(x86_64): Xeon-Gold-6130 ... libvirt: CPU Driver error : XML error: failed to parse xml document '<https://ci.centos.org/job/libvirt-rpm/systems=libvirt-fedora-32/ws/build/rp…'> FAILED 419) cpuTestGuestCPUID(x86_64): Xeon-Gold-6130 ... libvirt: CPU Driver error : XML error: failed to parse xml document '<https://ci.centos.org/job/libvirt-rpm/systems=libvirt-fedora-32/ws/build/rp…'> FAILED 420) cpuTestCPUIDSignature(x86_64): Xeon-Gold-6130 ... OK 421) cpuTestGuestCPUID(x86_64): Xeon-Gold-6130 ... libvirt: CPU Driver error : XML error: failed to parse xml document '<https://ci.centos.org/job/libvirt-rpm/systems=libvirt-fedora-32/ws/build/rp…'> FAILED 422) cpuTestJSONCPUID(x86_64): Xeon-Gold-6130 ... libvirt: CPU Driver error : XML error: failed to parse xml document '<https://ci.centos.org/job/libvirt-rpm/systems=libvirt-fedora-32/ws/build/rp…'> FAILED 423) cpuTestJSONSignature(x86_64): Xeon-Gold-6130 ... libvirt: CPU Driver error : XML error: failed to parse xml document '<https://ci.centos.org/job/libvirt-rpm/systems=libvirt-fedora-32/ws/build/rp…'> FAILED 424) cpuTestUpdateLive(x86_64): Xeon-Gold-6130 ... libvirt: CPU Driver error : XML error: failed to parse xml document '<https://ci.centos.org/job/libvirt-rpm/systems=libvirt-fedora-32/ws/build/rp…'> FAILED 425) cpuTestHostCPUID(x86_64): Xeon-Gold-6148 ... libvirt: CPU Driver error : XML error: failed to parse xml document '<https://ci.centos.org/job/libvirt-rpm/systems=libvirt-fedora-32/ws/build/rp…'> FAILED 426) cpuTestGuestCPUID(x86_64): Xeon-Gold-6148 ... libvirt: CPU Driver error : XML error: failed to parse xml document '<https://ci.centos.org/job/libvirt-rpm/systems=libvirt-fedora-32/ws/build/rp…'> FAILED 427) cpuTestCPUIDSignature(x86_64): Xeon-Gold-6148 ... OK 428) cpuTestJSONCPUID(x86_64): Xeon-Gold-6148 ... libvirt: CPU Driver error : XML error: failed to parse xml document '<https://ci.centos.org/job/libvirt-rpm/systems=libvirt-fedora-32/ws/build/rp…'> FAILED 429) cpuTestJSONSignature(x86_64): Xeon-Gold-6148 ... libvirt: CPU Driver error : XML error: failed to parse xml document '<https://ci.centos.org/job/libvirt-rpm/systems=libvirt-fedora-32/ws/build/rp…'> FAILED 430) cpuTestUpdateLive(x86_64): Xeon-Gold-6148 ... libvirt: CPU Driver error : XML error: failed to parse xml document '<https://ci.centos.org/job/libvirt-rpm/systems=libvirt-fedora-32/ws/build/rp…'> FAILED 431) cpuTestHostCPUID(x86_64): Xeon-Platinum-8268 ... libvirt: CPU Driver error : XML error: failed to parse xml document '<https://ci.centos.org/job/libvirt-rpm/systems=libvirt-fedora-32/ws/build/rp…'> FAILED 432) cpuTestGuestCPUID(x86_64): Xeon-Platinum-8268 ... libvirt: CPU Driver error : XML error: failed to parse xml document '<https://ci.centos.org/job/libvirt-rpm/systems=libvirt-fedora-32/ws/build/rp…'> FAILED 433) cpuTestCPUIDSignature(x86_64): Xeon-Platinum-8268 ... OK 434) cpuTestJSONCPUID(x86_64): Xeon-Platinum-8268 ... libvirt: CPU Driver error : XML error: failed to parse xml document '<https://ci.centos.org/job/libvirt-rpm/systems=libvirt-fedora-32/ws/build/rp…'> FAILED 435) cpuTestJSONSignature(x86_64): Xeon-Platinum-8268 ... libvirt: CPU Driver error : XML error: failed to parse xml document '<https://ci.centos.org/job/libvirt-rpm/systems=libvirt-fedora-32/ws/build/rp…'> FAILED 436) cpuTestUpdateLive(x86_64): Xeon-Platinum-8268 ... libvirt: CPU Driver error : XML error: failed to parse xml document '<https://ci.centos.org/job/libvirt-rpm/systems=libvirt-fedora-32/ws/build/rp…'> FAILED 437) cpuTestHostCPUID(x86_64): Xeon-Platinum-9242 ... libvirt: CPU Driver error : XML error: failed to parse xml document '<https://ci.centos.org/job/libvirt-rpm/systems=libvirt-fedora-32/ws/build/rp…'> FAILED 438) cpuTestGuestCPUID(x86_64): Xeon-Platinum-9242 ... libvirt: CPU Driver error : XML error: failed to parse xml document '<https://ci.centos.org/job/libvirt-rpm/systems=libvirt-fedora-32/ws/build/rp…'> FAILED 439) cpuTestCPUIDSignature(x86_64): Xeon-Platinum-9242 ... OK 440) cpuTestGuestCPUID(x86_64): Xeon-Platinum-9242 ... libvirt: CPU Driver error : XML error: failed to parse xml document '<https://ci.centos.org/job/libvirt-rpm/systems=libvirt-fedora-32/ws/build/rp…'> FAILED 441) cpuTestJSONCPUID(x86_64): Xeon-Platinum-9242 ... libvirt: CPU Driver error : XML error: failed to parse xml document '<https://ci.centos.org/job/libvirt-rpm/systems=libvirt-fedora-32/ws/build/rp…'> FAILED 442) cpuTestJSONSignature(x86_64): Xeon-Platinum-9242 ... libvirt: CPU Driver error : XML error: failed to parse xml document '<https://ci.centos.org/job/libvirt-rpm/systems=libvirt-fedora-32/ws/build/rp…'> FAILED 443) cpuTestUpdateLive(x86_64): Xeon-Platinum-9242 ... libvirt: CPU Driver error : XML error: failed to parse xml document '<https://ci.centos.org/job/libvirt-rpm/systems=libvirt-fedora-32/ws/build/rp…'> FAILED 444) cpuTestHostCPUID(x86_64): Xeon-W3520 ... libvirt: CPU Driver error : XML error: failed to parse xml document '<https://ci.centos.org/job/libvirt-rpm/systems=libvirt-fedora-32/ws/build/rp…'> FAILED 445) cpuTestGuestCPUID(x86_64): Xeon-W3520 ... libvirt: CPU Driver error : XML error: failed to parse xml document '<https://ci.centos.org/job/libvirt-rpm/systems=libvirt-fedora-32/ws/build/rp…'> FAILED 446) cpuTestCPUIDSignature(x86_64): Xeon-W3520 ... OK 447) cpuTestJSONCPUID(x86_64): Xeon-W3520 ... libvirt: CPU Driver error : XML error: failed to parse xml document '<https://ci.centos.org/job/libvirt-rpm/systems=libvirt-fedora-32/ws/build/rp…'> FAILED 448) cpuTestJSONSignature(x86_64): Xeon-W3520 ... libvirt: CPU Driver error : XML error: failed to parse xml document '<https://ci.centos.org/job/libvirt-rpm/systems=libvirt-fedora-32/ws/build/rp…'> FAILED 449) cpuTestUpdateLive(x86_64): Xeon-W3520 ... libvirt: CPU Driver error : XML error: failed to parse xml document '<https://ci.centos.org/job/libvirt-rpm/systems=libvirt-fedora-32/ws/build/rp…'> FAILED 450) cpuTestHostCPUID(x86_64): Xeon-X5460 ... libvirt: CPU Driver error : XML error: failed to parse xml document '<https://ci.centos.org/job/libvirt-rpm/systems=libvirt-fedora-32/ws/build/rp…'> FAILED 451) cpuTestGuestCPUID(x86_64): Xeon-X5460 ... libvirt: CPU Driver error : XML error: failed to parse xml document '<https://ci.centos.org/job/libvirt-rpm/systems=libvirt-fedora-32/ws/build/rp…'> FAILED 452) cpuTestCPUIDSignature(x86_64): Xeon-X5460 ... OK 453) cpuTestHostCPUID(x86_64): Ice-Lake-Server ... libvirt: CPU Driver error : XML error: failed to parse xml document '<https://ci.centos.org/job/libvirt-rpm/systems=libvirt-fedora-32/ws/build/rp…'> FAILED 454) cpuTestGuestCPUID(x86_64): Ice-Lake-Server ... libvirt: CPU Driver error : XML error: failed to parse xml document '<https://ci.centos.org/job/libvirt-rpm/systems=libvirt-fedora-32/ws/build/rp…'> FAILED 455) cpuTestCPUIDSignature(x86_64): Ice-Lake-Server ... OK 456) cpuTestGuestCPUID(x86_64): Ice-Lake-Server ... libvirt: CPU Driver error : XML error: failed to parse xml document '<https://ci.centos.org/job/libvirt-rpm/systems=libvirt-fedora-32/ws/build/rp…'> FAILED 457) cpuTestJSONCPUID(x86_64): Ice-Lake-Server ... libvirt: CPU Driver error : XML error: failed to parse xml document '<https://ci.centos.org/job/libvirt-rpm/systems=libvirt-fedora-32/ws/build/rp…'> FAILED 458) cpuTestJSONSignature(x86_64): Ice-Lake-Server ... libvirt: CPU Driver error : XML error: failed to parse xml document '<https://ci.centos.org/job/libvirt-rpm/systems=libvirt-fedora-32/ws/build/rp…'> FAILED 459) cpuTestUpdateLive(x86_64): Ice-Lake-Server ... libvirt: CPU Driver error : XML error: failed to parse xml document '<https://ci.centos.org/job/libvirt-rpm/systems=libvirt-fedora-32/ws/build/rp…'> FAILED 460) cpuTestHostCPUID(x86_64): Cooperlake ... libvirt: CPU Driver error : XML error: failed to parse xml document '<https://ci.centos.org/job/libvirt-rpm/systems=libvirt-fedora-32/ws/build/rp…'> FAILED 461) cpuTestGuestCPUID(x86_64): Cooperlake ... libvirt: CPU Driver error : XML error: failed to parse xml document '<https://ci.centos.org/job/libvirt-rpm/systems=libvirt-fedora-32/ws/build/rp…'> FAILED 462) cpuTestCPUIDSignature(x86_64): Cooperlake ... OK 463) cpuTestGuestCPUID(x86_64): Cooperlake ... libvirt: CPU Driver error : XML error: failed to parse xml document '<https://ci.centos.org/job/libvirt-rpm/systems=libvirt-fedora-32/ws/build/rp…'> FAILED 464) cpuTestJSONCPUID(x86_64): Cooperlake ... libvirt: CPU Driver error : XML error: failed to parse xml document '<https://ci.centos.org/job/libvirt-rpm/systems=libvirt-fedora-32/ws/build/rp…'> FAILED 465) cpuTestJSONSignature(x86_64): Cooperlake ... libvirt: CPU Driver error : XML error: failed to parse xml document '<https://ci.centos.org/job/libvirt-rpm/systems=libvirt-fedora-32/ws/build/rp…'> FAILED 466) cpuTestUpdateLive(x86_64): Cooperlake ... libvirt: CPU Driver error : XML error: failed to parse xml document '<https://ci.centos.org/job/libvirt-rpm/systems=libvirt-fedora-32/ws/build/rp…'> FAILED Some tests failed. Run them using: VIR_TEST_DEBUG=1 VIR_TEST_RANGE=1-3,6,16-31,33-35,45-58,78-91,97-109,112,114-115,117,123-124,126-130,132-133,135-136,138-142,144-148,150-155,157-161,163-167,169-173,175-179,181-182,184-188,190-194,196-200,202-206,208-212,214-218,220-224,226-231,233-238,240-245,247-252,254-258,260-261,263-267,269-273,275-279,281-282,284-285,287-291,293-297,299-300,302-303,305-309,311-315,317-322,324-325,327-332,334-339,341-346,348-353,355-359,361-366,368-373,375-379,381-386,388-392,394-398,400-405,407-412,414-419,421-426,428-432,434-438,440-445,447-451,453-454,456-461,463-466 <https://ci.centos.org/job/libvirt-rpm/systems=libvirt-fedora-32/ws/build/rp…> FAIL cputest (exit status: 1) + exit 1 error: Bad exit status from /var/tmp/rpm-tmp.IKxbar (%check) RPM build errors: Bad exit status from /var/tmp/rpm-tmp.IKxbar (%check) Build step 'Execute shell' marked build as failure
1 2
0 0
Build failed in Jenkins: libvirt-rpm » libvirt-fedora-31 #1093
by ci@centos.org 26 May '20

26 May '20
See <https://ci.centos.org/job/libvirt-rpm/systems=libvirt-fedora-31/1093/displa…> ------------------------------------------ [...truncated 7.37 MB...] 338) cpuTestHostCPUID(x86_64): Xeon-E5-2609-v3 ... libvirt: CPU Driver error : XML error: failed to parse xml document '<https://ci.centos.org/job/libvirt-rpm/systems=libvirt-fedora-31/ws/build/rp…'> FAILED 339) cpuTestGuestCPUID(x86_64): Xeon-E5-2609-v3 ... libvirt: CPU Driver error : XML error: failed to parse xml document '<https://ci.centos.org/job/libvirt-rpm/systems=libvirt-fedora-31/ws/build/rp…'> FAILED 340) cpuTestCPUIDSignature(x86_64): Xeon-E5-2609-v3 ... OK 341) cpuTestGuestCPUID(x86_64): Xeon-E5-2609-v3 ... libvirt: CPU Driver error : XML error: failed to parse xml document '<https://ci.centos.org/job/libvirt-rpm/systems=libvirt-fedora-31/ws/build/rp…'> FAILED 342) cpuTestJSONCPUID(x86_64): Xeon-E5-2609-v3 ... libvirt: CPU Driver error : XML error: failed to parse xml document '<https://ci.centos.org/job/libvirt-rpm/systems=libvirt-fedora-31/ws/build/rp…'> FAILED 343) cpuTestJSONSignature(x86_64): Xeon-E5-2609-v3 ... libvirt: CPU Driver error : XML error: failed to parse xml document '<https://ci.centos.org/job/libvirt-rpm/systems=libvirt-fedora-31/ws/build/rp…'> FAILED 344) cpuTestUpdateLive(x86_64): Xeon-E5-2609-v3 ... libvirt: CPU Driver error : XML error: failed to parse xml document '<https://ci.centos.org/job/libvirt-rpm/systems=libvirt-fedora-31/ws/build/rp…'> FAILED 345) cpuTestHostCPUID(x86_64): Xeon-E5-2623-v4 ... libvirt: CPU Driver error : XML error: failed to parse xml document '<https://ci.centos.org/job/libvirt-rpm/systems=libvirt-fedora-31/ws/build/rp…'> FAILED 346) cpuTestGuestCPUID(x86_64): Xeon-E5-2623-v4 ... libvirt: CPU Driver error : XML error: failed to parse xml document '<https://ci.centos.org/job/libvirt-rpm/systems=libvirt-fedora-31/ws/build/rp…'> FAILED 347) cpuTestCPUIDSignature(x86_64): Xeon-E5-2623-v4 ... OK 348) cpuTestGuestCPUID(x86_64): Xeon-E5-2623-v4 ... libvirt: CPU Driver error : XML error: failed to parse xml document '<https://ci.centos.org/job/libvirt-rpm/systems=libvirt-fedora-31/ws/build/rp…'> FAILED 349) cpuTestJSONCPUID(x86_64): Xeon-E5-2623-v4 ... libvirt: CPU Driver error : XML error: failed to parse xml document '<https://ci.centos.org/job/libvirt-rpm/systems=libvirt-fedora-31/ws/build/rp…'> FAILED 350) cpuTestJSONSignature(x86_64): Xeon-E5-2623-v4 ... libvirt: CPU Driver error : XML error: failed to parse xml document '<https://ci.centos.org/job/libvirt-rpm/systems=libvirt-fedora-31/ws/build/rp…'> FAILED 351) cpuTestUpdateLive(x86_64): Xeon-E5-2623-v4 ... libvirt: CPU Driver error : XML error: failed to parse xml document '<https://ci.centos.org/job/libvirt-rpm/systems=libvirt-fedora-31/ws/build/rp…'> FAILED 352) cpuTestHostCPUID(x86_64): Xeon-E5-2630-v3 ... libvirt: CPU Driver error : XML error: failed to parse xml document '<https://ci.centos.org/job/libvirt-rpm/systems=libvirt-fedora-31/ws/build/rp…'> FAILED 353) cpuTestGuestCPUID(x86_64): Xeon-E5-2630-v3 ... libvirt: CPU Driver error : XML error: failed to parse xml document '<https://ci.centos.org/job/libvirt-rpm/systems=libvirt-fedora-31/ws/build/rp…'> FAILED 354) cpuTestCPUIDSignature(x86_64): Xeon-E5-2630-v3 ... OK 355) cpuTestJSONCPUID(x86_64): Xeon-E5-2630-v3 ... libvirt: CPU Driver error : XML error: failed to parse xml document '<https://ci.centos.org/job/libvirt-rpm/systems=libvirt-fedora-31/ws/build/rp…'> FAILED 356) cpuTestJSONSignature(x86_64): Xeon-E5-2630-v3 ... libvirt: CPU Driver error : XML error: failed to parse xml document '<https://ci.centos.org/job/libvirt-rpm/systems=libvirt-fedora-31/ws/build/rp…'> FAILED 357) cpuTestUpdateLive(x86_64): Xeon-E5-2630-v3 ... libvirt: CPU Driver error : XML error: failed to parse xml document '<https://ci.centos.org/job/libvirt-rpm/systems=libvirt-fedora-31/ws/build/rp…'> FAILED 358) cpuTestHostCPUID(x86_64): Xeon-E5-2630-v4 ... libvirt: CPU Driver error : XML error: failed to parse xml document '<https://ci.centos.org/job/libvirt-rpm/systems=libvirt-fedora-31/ws/build/rp…'> FAILED 359) cpuTestGuestCPUID(x86_64): Xeon-E5-2630-v4 ... libvirt: CPU Driver error : XML error: failed to parse xml document '<https://ci.centos.org/job/libvirt-rpm/systems=libvirt-fedora-31/ws/build/rp…'> FAILED 360) cpuTestCPUIDSignature(x86_64): Xeon-E5-2630-v4 ... OK 361) cpuTestGuestCPUID(x86_64): Xeon-E5-2630-v4 ... libvirt: CPU Driver error : XML error: failed to parse xml document '<https://ci.centos.org/job/libvirt-rpm/systems=libvirt-fedora-31/ws/build/rp…'> FAILED 362) cpuTestJSONCPUID(x86_64): Xeon-E5-2630-v4 ... libvirt: CPU Driver error : XML error: failed to parse xml document '<https://ci.centos.org/job/libvirt-rpm/systems=libvirt-fedora-31/ws/build/rp…'> FAILED 363) cpuTestJSONSignature(x86_64): Xeon-E5-2630-v4 ... libvirt: CPU Driver error : XML error: failed to parse xml document '<https://ci.centos.org/job/libvirt-rpm/systems=libvirt-fedora-31/ws/build/rp…'> FAILED 364) cpuTestUpdateLive(x86_64): Xeon-E5-2630-v4 ... libvirt: CPU Driver error : XML error: failed to parse xml document '<https://ci.centos.org/job/libvirt-rpm/systems=libvirt-fedora-31/ws/build/rp…'> FAILED 365) cpuTestHostCPUID(x86_64): Xeon-E5-2650 ... libvirt: CPU Driver error : XML error: failed to parse xml document '<https://ci.centos.org/job/libvirt-rpm/systems=libvirt-fedora-31/ws/build/rp…'> FAILED 366) cpuTestGuestCPUID(x86_64): Xeon-E5-2650 ... libvirt: CPU Driver error : XML error: failed to parse xml document '<https://ci.centos.org/job/libvirt-rpm/systems=libvirt-fedora-31/ws/build/rp…'> FAILED 367) cpuTestCPUIDSignature(x86_64): Xeon-E5-2650 ... OK 368) cpuTestGuestCPUID(x86_64): Xeon-E5-2650 ... libvirt: CPU Driver error : XML error: failed to parse xml document '<https://ci.centos.org/job/libvirt-rpm/systems=libvirt-fedora-31/ws/build/rp…'> FAILED 369) cpuTestJSONCPUID(x86_64): Xeon-E5-2650 ... libvirt: CPU Driver error : XML error: failed to parse xml document '<https://ci.centos.org/job/libvirt-rpm/systems=libvirt-fedora-31/ws/build/rp…'> FAILED 370) cpuTestJSONSignature(x86_64): Xeon-E5-2650 ... libvirt: CPU Driver error : XML error: failed to parse xml document '<https://ci.centos.org/job/libvirt-rpm/systems=libvirt-fedora-31/ws/build/rp…'> FAILED 371) cpuTestUpdateLive(x86_64): Xeon-E5-2650 ... libvirt: CPU Driver error : XML error: failed to parse xml document '<https://ci.centos.org/job/libvirt-rpm/systems=libvirt-fedora-31/ws/build/rp…'> FAILED 372) cpuTestHostCPUID(x86_64): Xeon-E5-2650-v3 ... libvirt: CPU Driver error : XML error: failed to parse xml document '<https://ci.centos.org/job/libvirt-rpm/systems=libvirt-fedora-31/ws/build/rp…'> FAILED 373) cpuTestGuestCPUID(x86_64): Xeon-E5-2650-v3 ... libvirt: CPU Driver error : XML error: failed to parse xml document '<https://ci.centos.org/job/libvirt-rpm/systems=libvirt-fedora-31/ws/build/rp…'> FAILED 374) cpuTestCPUIDSignature(x86_64): Xeon-E5-2650-v3 ... OK 375) cpuTestJSONCPUID(x86_64): Xeon-E5-2650-v3 ... libvirt: CPU Driver error : XML error: failed to parse xml document '<https://ci.centos.org/job/libvirt-rpm/systems=libvirt-fedora-31/ws/build/rp…'> FAILED 376) cpuTestJSONSignature(x86_64): Xeon-E5-2650-v3 ... libvirt: CPU Driver error : XML error: failed to parse xml document '<https://ci.centos.org/job/libvirt-rpm/systems=libvirt-fedora-31/ws/build/rp…'> FAILED 377) cpuTestUpdateLive(x86_64): Xeon-E5-2650-v3 ... libvirt: CPU Driver error : XML error: failed to parse xml document '<https://ci.centos.org/job/libvirt-rpm/systems=libvirt-fedora-31/ws/build/rp…'> FAILED 378) cpuTestHostCPUID(x86_64): Xeon-E5-2650-v4 ... libvirt: CPU Driver error : XML error: failed to parse xml document '<https://ci.centos.org/job/libvirt-rpm/systems=libvirt-fedora-31/ws/build/rp…'> FAILED 379) cpuTestGuestCPUID(x86_64): Xeon-E5-2650-v4 ... libvirt: CPU Driver error : XML error: failed to parse xml document '<https://ci.centos.org/job/libvirt-rpm/systems=libvirt-fedora-31/ws/build/rp…'> FAILED 380) cpuTestCPUIDSignature(x86_64): Xeon-E5-2650-v4 ... OK 381) cpuTestGuestCPUID(x86_64): Xeon-E5-2650-v4 ... libvirt: CPU Driver error : XML error: failed to parse xml document '<https://ci.centos.org/job/libvirt-rpm/systems=libvirt-fedora-31/ws/build/rp…'> FAILED 382) cpuTestJSONCPUID(x86_64): Xeon-E5-2650-v4 ... libvirt: CPU Driver error : XML error: failed to parse xml document '<https://ci.centos.org/job/libvirt-rpm/systems=libvirt-fedora-31/ws/build/rp…'> FAILED 383) cpuTestJSONSignature(x86_64): Xeon-E5-2650-v4 ... libvirt: CPU Driver error : XML error: failed to parse xml document '<https://ci.centos.org/job/libvirt-rpm/systems=libvirt-fedora-31/ws/build/rp…'> FAILED 384) cpuTestUpdateLive(x86_64): Xeon-E5-2650-v4 ... libvirt: CPU Driver error : XML error: failed to parse xml document '<https://ci.centos.org/job/libvirt-rpm/systems=libvirt-fedora-31/ws/build/rp…'> FAILED 385) cpuTestHostCPUID(x86_64): Xeon-E7-4820 ... libvirt: CPU Driver error : XML error: failed to parse xml document '<https://ci.centos.org/job/libvirt-rpm/systems=libvirt-fedora-31/ws/build/rp…'> FAILED 386) cpuTestGuestCPUID(x86_64): Xeon-E7-4820 ... libvirt: CPU Driver error : XML error: failed to parse xml document '<https://ci.centos.org/job/libvirt-rpm/systems=libvirt-fedora-31/ws/build/rp…'> FAILED 387) cpuTestCPUIDSignature(x86_64): Xeon-E7-4820 ... OK 388) cpuTestJSONCPUID(x86_64): Xeon-E7-4820 ... libvirt: CPU Driver error : XML error: failed to parse xml document '<https://ci.centos.org/job/libvirt-rpm/systems=libvirt-fedora-31/ws/build/rp…'> FAILED 389) cpuTestJSONSignature(x86_64): Xeon-E7-4820 ... libvirt: CPU Driver error : XML error: failed to parse xml document '<https://ci.centos.org/job/libvirt-rpm/systems=libvirt-fedora-31/ws/build/rp…'> FAILED 390) cpuTestUpdateLive(x86_64): Xeon-E7-4820 ... libvirt: CPU Driver error : XML error: failed to parse xml document '<https://ci.centos.org/job/libvirt-rpm/systems=libvirt-fedora-31/ws/build/rp…'> FAILED 391) cpuTestHostCPUID(x86_64): Xeon-E7-4830 ... libvirt: CPU Driver error : XML error: failed to parse xml document '<https://ci.centos.org/job/libvirt-rpm/systems=libvirt-fedora-31/ws/build/rp…'> FAILED 392) cpuTestGuestCPUID(x86_64): Xeon-E7-4830 ... libvirt: CPU Driver error : XML error: failed to parse xml document '<https://ci.centos.org/job/libvirt-rpm/systems=libvirt-fedora-31/ws/build/rp…'> FAILED 393) cpuTestCPUIDSignature(x86_64): Xeon-E7-4830 ... OK 394) cpuTestJSONCPUID(x86_64): Xeon-E7-4830 ... libvirt: CPU Driver error : XML error: failed to parse xml document '<https://ci.centos.org/job/libvirt-rpm/systems=libvirt-fedora-31/ws/build/rp…'> FAILED 395) cpuTestJSONSignature(x86_64): Xeon-E7-4830 ... libvirt: CPU Driver error : XML error: failed to parse xml document '<https://ci.centos.org/job/libvirt-rpm/systems=libvirt-fedora-31/ws/build/rp…'> FAILED 396) cpuTestUpdateLive(x86_64): Xeon-E7-4830 ... libvirt: CPU Driver error : XML error: failed to parse xml document '<https://ci.centos.org/job/libvirt-rpm/systems=libvirt-fedora-31/ws/build/rp…'> FAILED 397) cpuTestHostCPUID(x86_64): Xeon-E7-8890-v3 ... libvirt: CPU Driver error : XML error: failed to parse xml document '<https://ci.centos.org/job/libvirt-rpm/systems=libvirt-fedora-31/ws/build/rp…'> FAILED 398) cpuTestGuestCPUID(x86_64): Xeon-E7-8890-v3 ... libvirt: CPU Driver error : XML error: failed to parse xml document '<https://ci.centos.org/job/libvirt-rpm/systems=libvirt-fedora-31/ws/build/rp…'> FAILED 399) cpuTestCPUIDSignature(x86_64): Xeon-E7-8890-v3 ... OK 400) cpuTestGuestCPUID(x86_64): Xeon-E7-8890-v3 ... libvirt: CPU Driver error : XML error: failed to parse xml document '<https://ci.centos.org/job/libvirt-rpm/systems=libvirt-fedora-31/ws/build/rp…'> FAILED 401) cpuTestJSONCPUID(x86_64): Xeon-E7-8890-v3 ... libvirt: CPU Driver error : XML error: failed to parse xml document '<https://ci.centos.org/job/libvirt-rpm/systems=libvirt-fedora-31/ws/build/rp…'> FAILED 402) cpuTestJSONSignature(x86_64): Xeon-E7-8890-v3 ... libvirt: CPU Driver error : XML error: failed to parse xml document '<https://ci.centos.org/job/libvirt-rpm/systems=libvirt-fedora-31/ws/build/rp…'> FAILED 403) cpuTestUpdateLive(x86_64): Xeon-E7-8890-v3 ... libvirt: CPU Driver error : XML error: failed to parse xml document '<https://ci.centos.org/job/libvirt-rpm/systems=libvirt-fedora-31/ws/build/rp…'> FAILED 404) cpuTestHostCPUID(x86_64): Xeon-E7540 ... libvirt: CPU Driver error : XML error: failed to parse xml document '<https://ci.centos.org/job/libvirt-rpm/systems=libvirt-fedora-31/ws/build/rp…'> FAILED 405) cpuTestGuestCPUID(x86_64): Xeon-E7540 ... libvirt: CPU Driver error : XML error: failed to parse xml document '<https://ci.centos.org/job/libvirt-rpm/systems=libvirt-fedora-31/ws/build/rp…'> FAILED 406) cpuTestCPUIDSignature(x86_64): Xeon-E7540 ... OK 407) cpuTestGuestCPUID(x86_64): Xeon-E7540 ... libvirt: CPU Driver error : XML error: failed to parse xml document '<https://ci.centos.org/job/libvirt-rpm/systems=libvirt-fedora-31/ws/build/rp…'> FAILED 408) cpuTestJSONCPUID(x86_64): Xeon-E7540 ... libvirt: CPU Driver error : XML error: failed to parse xml document '<https://ci.centos.org/job/libvirt-rpm/systems=libvirt-fedora-31/ws/build/rp…'> FAILED 409) cpuTestJSONSignature(x86_64): Xeon-E7540 ... libvirt: CPU Driver error : XML error: failed to parse xml document '<https://ci.centos.org/job/libvirt-rpm/systems=libvirt-fedora-31/ws/build/rp…'> FAILED 410) cpuTestUpdateLive(x86_64): Xeon-E7540 ... libvirt: CPU Driver error : XML error: failed to parse xml document '<https://ci.centos.org/job/libvirt-rpm/systems=libvirt-fedora-31/ws/build/rp…'> FAILED 411) cpuTestHostCPUID(x86_64): Xeon-Gold-5115 ... libvirt: CPU Driver error : XML error: failed to parse xml document '<https://ci.centos.org/job/libvirt-rpm/systems=libvirt-fedora-31/ws/build/rp…'> FAILED 412) cpuTestGuestCPUID(x86_64): Xeon-Gold-5115 ... libvirt: CPU Driver error : XML error: failed to parse xml document '<https://ci.centos.org/job/libvirt-rpm/systems=libvirt-fedora-31/ws/build/rp…'> FAILED 413) cpuTestCPUIDSignature(x86_64): Xeon-Gold-5115 ... OK 414) cpuTestGuestCPUID(x86_64): Xeon-Gold-5115 ... libvirt: CPU Driver error : XML error: failed to parse xml document '<https://ci.centos.org/job/libvirt-rpm/systems=libvirt-fedora-31/ws/build/rp…'> FAILED 415) cpuTestJSONCPUID(x86_64): Xeon-Gold-5115 ... libvirt: CPU Driver error : XML error: failed to parse xml document '<https://ci.centos.org/job/libvirt-rpm/systems=libvirt-fedora-31/ws/build/rp…'> FAILED 416) cpuTestJSONSignature(x86_64): Xeon-Gold-5115 ... libvirt: CPU Driver error : XML error: failed to parse xml document '<https://ci.centos.org/job/libvirt-rpm/systems=libvirt-fedora-31/ws/build/rp…'> FAILED 417) cpuTestUpdateLive(x86_64): Xeon-Gold-5115 ... libvirt: CPU Driver error : XML error: failed to parse xml document '<https://ci.centos.org/job/libvirt-rpm/systems=libvirt-fedora-31/ws/build/rp…'> FAILED 418) cpuTestHostCPUID(x86_64): Xeon-Gold-6130 ... libvirt: CPU Driver error : XML error: failed to parse xml document '<https://ci.centos.org/job/libvirt-rpm/systems=libvirt-fedora-31/ws/build/rp…'> FAILED 419) cpuTestGuestCPUID(x86_64): Xeon-Gold-6130 ... libvirt: CPU Driver error : XML error: failed to parse xml document '<https://ci.centos.org/job/libvirt-rpm/systems=libvirt-fedora-31/ws/build/rp…'> FAILED 420) cpuTestCPUIDSignature(x86_64): Xeon-Gold-6130 ... OK 421) cpuTestGuestCPUID(x86_64): Xeon-Gold-6130 ... libvirt: CPU Driver error : XML error: failed to parse xml document '<https://ci.centos.org/job/libvirt-rpm/systems=libvirt-fedora-31/ws/build/rp…'> FAILED 422) cpuTestJSONCPUID(x86_64): Xeon-Gold-6130 ... libvirt: CPU Driver error : XML error: failed to parse xml document '<https://ci.centos.org/job/libvirt-rpm/systems=libvirt-fedora-31/ws/build/rp…'> FAILED 423) cpuTestJSONSignature(x86_64): Xeon-Gold-6130 ... libvirt: CPU Driver error : XML error: failed to parse xml document '<https://ci.centos.org/job/libvirt-rpm/systems=libvirt-fedora-31/ws/build/rp…'> FAILED 424) cpuTestUpdateLive(x86_64): Xeon-Gold-6130 ... libvirt: CPU Driver error : XML error: failed to parse xml document '<https://ci.centos.org/job/libvirt-rpm/systems=libvirt-fedora-31/ws/build/rp…'> FAILED 425) cpuTestHostCPUID(x86_64): Xeon-Gold-6148 ... libvirt: CPU Driver error : XML error: failed to parse xml document '<https://ci.centos.org/job/libvirt-rpm/systems=libvirt-fedora-31/ws/build/rp…'> FAILED 426) cpuTestGuestCPUID(x86_64): Xeon-Gold-6148 ... libvirt: CPU Driver error : XML error: failed to parse xml document '<https://ci.centos.org/job/libvirt-rpm/systems=libvirt-fedora-31/ws/build/rp…'> FAILED 427) cpuTestCPUIDSignature(x86_64): Xeon-Gold-6148 ... OK 428) cpuTestJSONCPUID(x86_64): Xeon-Gold-6148 ... libvirt: CPU Driver error : XML error: failed to parse xml document '<https://ci.centos.org/job/libvirt-rpm/systems=libvirt-fedora-31/ws/build/rp…'> FAILED 429) cpuTestJSONSignature(x86_64): Xeon-Gold-6148 ... libvirt: CPU Driver error : XML error: failed to parse xml document '<https://ci.centos.org/job/libvirt-rpm/systems=libvirt-fedora-31/ws/build/rp…'> FAILED 430) cpuTestUpdateLive(x86_64): Xeon-Gold-6148 ... libvirt: CPU Driver error : XML error: failed to parse xml document '<https://ci.centos.org/job/libvirt-rpm/systems=libvirt-fedora-31/ws/build/rp…'> FAILED 431) cpuTestHostCPUID(x86_64): Xeon-Platinum-8268 ... libvirt: CPU Driver error : XML error: failed to parse xml document '<https://ci.centos.org/job/libvirt-rpm/systems=libvirt-fedora-31/ws/build/rp…'> FAILED 432) cpuTestGuestCPUID(x86_64): Xeon-Platinum-8268 ... libvirt: CPU Driver error : XML error: failed to parse xml document '<https://ci.centos.org/job/libvirt-rpm/systems=libvirt-fedora-31/ws/build/rp…'> FAILED 433) cpuTestCPUIDSignature(x86_64): Xeon-Platinum-8268 ... OK 434) cpuTestJSONCPUID(x86_64): Xeon-Platinum-8268 ... libvirt: CPU Driver error : XML error: failed to parse xml document '<https://ci.centos.org/job/libvirt-rpm/systems=libvirt-fedora-31/ws/build/rp…'> FAILED 435) cpuTestJSONSignature(x86_64): Xeon-Platinum-8268 ... libvirt: CPU Driver error : XML error: failed to parse xml document '<https://ci.centos.org/job/libvirt-rpm/systems=libvirt-fedora-31/ws/build/rp…'> FAILED 436) cpuTestUpdateLive(x86_64): Xeon-Platinum-8268 ... libvirt: CPU Driver error : XML error: failed to parse xml document '<https://ci.centos.org/job/libvirt-rpm/systems=libvirt-fedora-31/ws/build/rp…'> FAILED 437) cpuTestHostCPUID(x86_64): Xeon-Platinum-9242 ... libvirt: CPU Driver error : XML error: failed to parse xml document '<https://ci.centos.org/job/libvirt-rpm/systems=libvirt-fedora-31/ws/build/rp…'> FAILED 438) cpuTestGuestCPUID(x86_64): Xeon-Platinum-9242 ... libvirt: CPU Driver error : XML error: failed to parse xml document '<https://ci.centos.org/job/libvirt-rpm/systems=libvirt-fedora-31/ws/build/rp…'> FAILED 439) cpuTestCPUIDSignature(x86_64): Xeon-Platinum-9242 ... OK 440) cpuTestGuestCPUID(x86_64): Xeon-Platinum-9242 ... libvirt: CPU Driver error : XML error: failed to parse xml document '<https://ci.centos.org/job/libvirt-rpm/systems=libvirt-fedora-31/ws/build/rp…'> FAILED 441) cpuTestJSONCPUID(x86_64): Xeon-Platinum-9242 ... libvirt: CPU Driver error : XML error: failed to parse xml document '<https://ci.centos.org/job/libvirt-rpm/systems=libvirt-fedora-31/ws/build/rp…'> FAILED 442) cpuTestJSONSignature(x86_64): Xeon-Platinum-9242 ... libvirt: CPU Driver error : XML error: failed to parse xml document '<https://ci.centos.org/job/libvirt-rpm/systems=libvirt-fedora-31/ws/build/rp…'> FAILED 443) cpuTestUpdateLive(x86_64): Xeon-Platinum-9242 ... libvirt: CPU Driver error : XML error: failed to parse xml document '<https://ci.centos.org/job/libvirt-rpm/systems=libvirt-fedora-31/ws/build/rp…'> FAILED 444) cpuTestHostCPUID(x86_64): Xeon-W3520 ... libvirt: CPU Driver error : XML error: failed to parse xml document '<https://ci.centos.org/job/libvirt-rpm/systems=libvirt-fedora-31/ws/build/rp…'> FAILED 445) cpuTestGuestCPUID(x86_64): Xeon-W3520 ... libvirt: CPU Driver error : XML error: failed to parse xml document '<https://ci.centos.org/job/libvirt-rpm/systems=libvirt-fedora-31/ws/build/rp…'> FAILED 446) cpuTestCPUIDSignature(x86_64): Xeon-W3520 ... OK 447) cpuTestJSONCPUID(x86_64): Xeon-W3520 ... libvirt: CPU Driver error : XML error: failed to parse xml document '<https://ci.centos.org/job/libvirt-rpm/systems=libvirt-fedora-31/ws/build/rp…'> FAILED 448) cpuTestJSONSignature(x86_64): Xeon-W3520 ... libvirt: CPU Driver error : XML error: failed to parse xml document '<https://ci.centos.org/job/libvirt-rpm/systems=libvirt-fedora-31/ws/build/rp…'> FAILED 449) cpuTestUpdateLive(x86_64): Xeon-W3520 ... libvirt: CPU Driver error : XML error: failed to parse xml document '<https://ci.centos.org/job/libvirt-rpm/systems=libvirt-fedora-31/ws/build/rp…'> FAILED 450) cpuTestHostCPUID(x86_64): Xeon-X5460 ... libvirt: CPU Driver error : XML error: failed to parse xml document '<https://ci.centos.org/job/libvirt-rpm/systems=libvirt-fedora-31/ws/build/rp…'> FAILED 451) cpuTestGuestCPUID(x86_64): Xeon-X5460 ... libvirt: CPU Driver error : XML error: failed to parse xml document '<https://ci.centos.org/job/libvirt-rpm/systems=libvirt-fedora-31/ws/build/rp…'> FAILED 452) cpuTestCPUIDSignature(x86_64): Xeon-X5460 ... OK 453) cpuTestHostCPUID(x86_64): Ice-Lake-Server ... libvirt: CPU Driver error : XML error: failed to parse xml document '<https://ci.centos.org/job/libvirt-rpm/systems=libvirt-fedora-31/ws/build/rp…'> FAILED 454) cpuTestGuestCPUID(x86_64): Ice-Lake-Server ... libvirt: CPU Driver error : XML error: failed to parse xml document '<https://ci.centos.org/job/libvirt-rpm/systems=libvirt-fedora-31/ws/build/rp…'> FAILED 455) cpuTestCPUIDSignature(x86_64): Ice-Lake-Server ... OK 456) cpuTestGuestCPUID(x86_64): Ice-Lake-Server ... libvirt: CPU Driver error : XML error: failed to parse xml document '<https://ci.centos.org/job/libvirt-rpm/systems=libvirt-fedora-31/ws/build/rp…'> FAILED 457) cpuTestJSONCPUID(x86_64): Ice-Lake-Server ... libvirt: CPU Driver error : XML error: failed to parse xml document '<https://ci.centos.org/job/libvirt-rpm/systems=libvirt-fedora-31/ws/build/rp…'> FAILED 458) cpuTestJSONSignature(x86_64): Ice-Lake-Server ... libvirt: CPU Driver error : XML error: failed to parse xml document '<https://ci.centos.org/job/libvirt-rpm/systems=libvirt-fedora-31/ws/build/rp…'> FAILED 459) cpuTestUpdateLive(x86_64): Ice-Lake-Server ... libvirt: CPU Driver error : XML error: failed to parse xml document '<https://ci.centos.org/job/libvirt-rpm/systems=libvirt-fedora-31/ws/build/rp…'> FAILED 460) cpuTestHostCPUID(x86_64): Cooperlake ... libvirt: CPU Driver error : XML error: failed to parse xml document '<https://ci.centos.org/job/libvirt-rpm/systems=libvirt-fedora-31/ws/build/rp…'> FAILED 461) cpuTestGuestCPUID(x86_64): Cooperlake ... libvirt: CPU Driver error : XML error: failed to parse xml document '<https://ci.centos.org/job/libvirt-rpm/systems=libvirt-fedora-31/ws/build/rp…'> FAILED 462) cpuTestCPUIDSignature(x86_64): Cooperlake ... OK 463) cpuTestGuestCPUID(x86_64): Cooperlake ... libvirt: CPU Driver error : XML error: failed to parse xml document '<https://ci.centos.org/job/libvirt-rpm/systems=libvirt-fedora-31/ws/build/rp…'> FAILED 464) cpuTestJSONCPUID(x86_64): Cooperlake ... libvirt: CPU Driver error : XML error: failed to parse xml document '<https://ci.centos.org/job/libvirt-rpm/systems=libvirt-fedora-31/ws/build/rp…'> FAILED 465) cpuTestJSONSignature(x86_64): Cooperlake ... libvirt: CPU Driver error : XML error: failed to parse xml document '<https://ci.centos.org/job/libvirt-rpm/systems=libvirt-fedora-31/ws/build/rp…'> FAILED 466) cpuTestUpdateLive(x86_64): Cooperlake ... libvirt: CPU Driver error : XML error: failed to parse xml document '<https://ci.centos.org/job/libvirt-rpm/systems=libvirt-fedora-31/ws/build/rp…'> FAILED Some tests failed. Run them using: VIR_TEST_DEBUG=1 VIR_TEST_RANGE=1-3,6,16-31,33-35,45-58,78-91,97-109,112,114-115,117,123-124,126-130,132-133,135-136,138-142,144-148,150-155,157-161,163-167,169-173,175-179,181-182,184-188,190-194,196-200,202-206,208-212,214-218,220-224,226-231,233-238,240-245,247-252,254-258,260-261,263-267,269-273,275-279,281-282,284-285,287-291,293-297,299-300,302-303,305-309,311-315,317-322,324-325,327-332,334-339,341-346,348-353,355-359,361-366,368-373,375-379,381-386,388-392,394-398,400-405,407-412,414-419,421-426,428-432,434-438,440-445,447-451,453-454,456-461,463-466 <https://ci.centos.org/job/libvirt-rpm/systems=libvirt-fedora-31/ws/build/rp…> FAIL cputest (exit status: 1) + exit 1 error: Bad exit status from /var/tmp/rpm-tmp.w4KDS5 (%check) RPM build errors: Bad exit status from /var/tmp/rpm-tmp.w4KDS5 (%check) Build step 'Execute shell' marked build as failure
1 2
0 0
  • ← Newer
  • 1
  • 2
  • 3
  • 4
  • 5
  • 6
  • 7
  • 8
  • Older →

HyperKitty Powered by HyperKitty version 1.3.12.