libvirt List Archives
Sign In Sign Up
Manage this list Sign In Sign Up

Keyboard Shortcuts

Thread View

  • j: Next unread message
  • k: Previous unread message
  • j a: Jump to all threads
  • j l: Jump to MailingList overview

CI

Thread Start a new thread
Download
Threads by month
  • ----- 2025 -----
  • August
  • July
  • June
  • May
  • April
  • March
  • February
  • January
  • ----- 2024 -----
  • December
  • November
  • October
  • September
  • August
  • July
  • June
  • May
  • April
  • March
  • February
  • January
  • ----- 2023 -----
  • December
  • November
  • October
  • September
  • August
  • July
  • June
  • May
  • April
  • March
  • February
  • January
  • ----- 2022 -----
  • December
  • November
  • October
  • September
  • August
  • July
  • June
  • May
  • April
  • March
  • February
  • January
  • ----- 2021 -----
  • December
  • November
  • October
  • September
  • August
  • July
  • June
  • May
  • April
  • March
  • February
  • January
  • ----- 2020 -----
  • December
  • November
  • October
  • September
  • August
  • July
  • June
  • May
  • April
  • March
  • February
  • January
  • ----- 2019 -----
  • December
  • November
  • October
  • September
  • August
  • July
  • June
  • May
  • April
  • March
  • February
  • January
  • ----- 2018 -----
  • December
  • November
  • October
  • September
  • August
  • July
  • June
  • May
  • April
  • March
  • February
  • January
  • ----- 2017 -----
  • December
  • November
  • October
  • September
  • August
  • July
  • June
  • May
  • April
  • March
  • February
  • January
  • ----- 2016 -----
  • December
  • November
  • October
  • September
  • August
  • July
ci@lists.libvirt.org

May 2020

  • 3 participants
  • 80 discussions
Build failed in Jenkins: libvirt-rpm » libvirt-centos-7 #1093
by ci@centos.org 26 May '20

26 May '20
See <https://ci.centos.org/job/libvirt-rpm/systems=libvirt-centos-7/1093/display…> ------------------------------------------ [...truncated 4.75 MB...] FAILED 338) cpuTestHostCPUID(x86_64): Xeon-E5-2609-v3 ... libvirt: CPU Driver error : XML error: failed to parse xml document '<https://ci.centos.org/job/libvirt-rpm/systems=libvirt-centos-7/ws/build/rpm…'> FAILED 339) cpuTestGuestCPUID(x86_64): Xeon-E5-2609-v3 ... libvirt: CPU Driver error : XML error: failed to parse xml document '<https://ci.centos.org/job/libvirt-rpm/systems=libvirt-centos-7/ws/build/rpm…'> FAILED 340) cpuTestCPUIDSignature(x86_64): Xeon-E5-2609-v3 ... OK 341) cpuTestGuestCPUID(x86_64): Xeon-E5-2609-v3 ... libvirt: CPU Driver error : XML error: failed to parse xml document '<https://ci.centos.org/job/libvirt-rpm/systems=libvirt-centos-7/ws/build/rpm…'> FAILED 342) cpuTestJSONCPUID(x86_64): Xeon-E5-2609-v3 ... libvirt: CPU Driver error : XML error: failed to parse xml document '<https://ci.centos.org/job/libvirt-rpm/systems=libvirt-centos-7/ws/build/rpm…'> FAILED 343) cpuTestJSONSignature(x86_64): Xeon-E5-2609-v3 ... libvirt: CPU Driver error : XML error: failed to parse xml document '<https://ci.centos.org/job/libvirt-rpm/systems=libvirt-centos-7/ws/build/rpm…'> FAILED 344) cpuTestUpdateLive(x86_64): Xeon-E5-2609-v3 ... libvirt: CPU Driver error : XML error: failed to parse xml document '<https://ci.centos.org/job/libvirt-rpm/systems=libvirt-centos-7/ws/build/rpm…'> FAILED 345) cpuTestHostCPUID(x86_64): Xeon-E5-2623-v4 ... libvirt: CPU Driver error : XML error: failed to parse xml document '<https://ci.centos.org/job/libvirt-rpm/systems=libvirt-centos-7/ws/build/rpm…'> FAILED 346) cpuTestGuestCPUID(x86_64): Xeon-E5-2623-v4 ... libvirt: CPU Driver error : XML error: failed to parse xml document '<https://ci.centos.org/job/libvirt-rpm/systems=libvirt-centos-7/ws/build/rpm…'> FAILED 347) cpuTestCPUIDSignature(x86_64): Xeon-E5-2623-v4 ... OK 348) cpuTestGuestCPUID(x86_64): Xeon-E5-2623-v4 ... libvirt: CPU Driver error : XML error: failed to parse xml document '<https://ci.centos.org/job/libvirt-rpm/systems=libvirt-centos-7/ws/build/rpm…'> FAILED 349) cpuTestJSONCPUID(x86_64): Xeon-E5-2623-v4 ... libvirt: CPU Driver error : XML error: failed to parse xml document '<https://ci.centos.org/job/libvirt-rpm/systems=libvirt-centos-7/ws/build/rpm…'> FAILED 350) cpuTestJSONSignature(x86_64): Xeon-E5-2623-v4 ... libvirt: CPU Driver error : XML error: failed to parse xml document '<https://ci.centos.org/job/libvirt-rpm/systems=libvirt-centos-7/ws/build/rpm…'> FAILED 351) cpuTestUpdateLive(x86_64): Xeon-E5-2623-v4 ... libvirt: CPU Driver error : XML error: failed to parse xml document '<https://ci.centos.org/job/libvirt-rpm/systems=libvirt-centos-7/ws/build/rpm…'> FAILED 352) cpuTestHostCPUID(x86_64): Xeon-E5-2630-v3 ... libvirt: CPU Driver error : XML error: failed to parse xml document '<https://ci.centos.org/job/libvirt-rpm/systems=libvirt-centos-7/ws/build/rpm…'> FAILED 353) cpuTestGuestCPUID(x86_64): Xeon-E5-2630-v3 ... libvirt: CPU Driver error : XML error: failed to parse xml document '<https://ci.centos.org/job/libvirt-rpm/systems=libvirt-centos-7/ws/build/rpm…'> FAILED 354) cpuTestCPUIDSignature(x86_64): Xeon-E5-2630-v3 ... OK 355) cpuTestJSONCPUID(x86_64): Xeon-E5-2630-v3 ... libvirt: CPU Driver error : XML error: failed to parse xml document '<https://ci.centos.org/job/libvirt-rpm/systems=libvirt-centos-7/ws/build/rpm…'> FAILED 356) cpuTestJSONSignature(x86_64): Xeon-E5-2630-v3 ... libvirt: CPU Driver error : XML error: failed to parse xml document '<https://ci.centos.org/job/libvirt-rpm/systems=libvirt-centos-7/ws/build/rpm…'> FAILED 357) cpuTestUpdateLive(x86_64): Xeon-E5-2630-v3 ... libvirt: CPU Driver error : XML error: failed to parse xml document '<https://ci.centos.org/job/libvirt-rpm/systems=libvirt-centos-7/ws/build/rpm…'> FAILED 358) cpuTestHostCPUID(x86_64): Xeon-E5-2630-v4 ... libvirt: CPU Driver error : XML error: failed to parse xml document '<https://ci.centos.org/job/libvirt-rpm/systems=libvirt-centos-7/ws/build/rpm…'> FAILED 359) cpuTestGuestCPUID(x86_64): Xeon-E5-2630-v4 ... libvirt: CPU Driver error : XML error: failed to parse xml document '<https://ci.centos.org/job/libvirt-rpm/systems=libvirt-centos-7/ws/build/rpm…'> FAILED 360) cpuTestCPUIDSignature(x86_64): Xeon-E5-2630-v4 ... OK 361) cpuTestGuestCPUID(x86_64): Xeon-E5-2630-v4 ... libvirt: CPU Driver error : XML error: failed to parse xml document '<https://ci.centos.org/job/libvirt-rpm/systems=libvirt-centos-7/ws/build/rpm…'> FAILED 362) cpuTestJSONCPUID(x86_64): Xeon-E5-2630-v4 ... libvirt: CPU Driver error : XML error: failed to parse xml document '<https://ci.centos.org/job/libvirt-rpm/systems=libvirt-centos-7/ws/build/rpm…'> FAILED 363) cpuTestJSONSignature(x86_64): Xeon-E5-2630-v4 ... libvirt: CPU Driver error : XML error: failed to parse xml document '<https://ci.centos.org/job/libvirt-rpm/systems=libvirt-centos-7/ws/build/rpm…'> FAILED 364) cpuTestUpdateLive(x86_64): Xeon-E5-2630-v4 ... libvirt: CPU Driver error : XML error: failed to parse xml document '<https://ci.centos.org/job/libvirt-rpm/systems=libvirt-centos-7/ws/build/rpm…'> FAILED 365) cpuTestHostCPUID(x86_64): Xeon-E5-2650 ... libvirt: CPU Driver error : XML error: failed to parse xml document '<https://ci.centos.org/job/libvirt-rpm/systems=libvirt-centos-7/ws/build/rpm…'> FAILED 366) cpuTestGuestCPUID(x86_64): Xeon-E5-2650 ... libvirt: CPU Driver error : XML error: failed to parse xml document '<https://ci.centos.org/job/libvirt-rpm/systems=libvirt-centos-7/ws/build/rpm…'> FAILED 367) cpuTestCPUIDSignature(x86_64): Xeon-E5-2650 ... OK 368) cpuTestGuestCPUID(x86_64): Xeon-E5-2650 ... libvirt: CPU Driver error : XML error: failed to parse xml document '<https://ci.centos.org/job/libvirt-rpm/systems=libvirt-centos-7/ws/build/rpm…'> FAILED 369) cpuTestJSONCPUID(x86_64): Xeon-E5-2650 ... libvirt: CPU Driver error : XML error: failed to parse xml document '<https://ci.centos.org/job/libvirt-rpm/systems=libvirt-centos-7/ws/build/rpm…'> FAILED 370) cpuTestJSONSignature(x86_64): Xeon-E5-2650 ... libvirt: CPU Driver error : XML error: failed to parse xml document '<https://ci.centos.org/job/libvirt-rpm/systems=libvirt-centos-7/ws/build/rpm…'> FAILED 371) cpuTestUpdateLive(x86_64): Xeon-E5-2650 ... libvirt: CPU Driver error : XML error: failed to parse xml document '<https://ci.centos.org/job/libvirt-rpm/systems=libvirt-centos-7/ws/build/rpm…'> FAILED 372) cpuTestHostCPUID(x86_64): Xeon-E5-2650-v3 ... libvirt: CPU Driver error : XML error: failed to parse xml document '<https://ci.centos.org/job/libvirt-rpm/systems=libvirt-centos-7/ws/build/rpm…'> FAILED 373) cpuTestGuestCPUID(x86_64): Xeon-E5-2650-v3 ... libvirt: CPU Driver error : XML error: failed to parse xml document '<https://ci.centos.org/job/libvirt-rpm/systems=libvirt-centos-7/ws/build/rpm…'> FAILED 374) cpuTestCPUIDSignature(x86_64): Xeon-E5-2650-v3 ... OK 375) cpuTestJSONCPUID(x86_64): Xeon-E5-2650-v3 ... libvirt: CPU Driver error : XML error: failed to parse xml document '<https://ci.centos.org/job/libvirt-rpm/systems=libvirt-centos-7/ws/build/rpm…'> FAILED 376) cpuTestJSONSignature(x86_64): Xeon-E5-2650-v3 ... libvirt: CPU Driver error : XML error: failed to parse xml document '<https://ci.centos.org/job/libvirt-rpm/systems=libvirt-centos-7/ws/build/rpm…'> FAILED 377) cpuTestUpdateLive(x86_64): Xeon-E5-2650-v3 ... libvirt: CPU Driver error : XML error: failed to parse xml document '<https://ci.centos.org/job/libvirt-rpm/systems=libvirt-centos-7/ws/build/rpm…'> FAILED 378) cpuTestHostCPUID(x86_64): Xeon-E5-2650-v4 ... libvirt: CPU Driver error : XML error: failed to parse xml document '<https://ci.centos.org/job/libvirt-rpm/systems=libvirt-centos-7/ws/build/rpm…'> FAILED 379) cpuTestGuestCPUID(x86_64): Xeon-E5-2650-v4 ... libvirt: CPU Driver error : XML error: failed to parse xml document '<https://ci.centos.org/job/libvirt-rpm/systems=libvirt-centos-7/ws/build/rpm…'> FAILED 380) cpuTestCPUIDSignature(x86_64): Xeon-E5-2650-v4 ... OK 381) cpuTestGuestCPUID(x86_64): Xeon-E5-2650-v4 ... libvirt: CPU Driver error : XML error: failed to parse xml document '<https://ci.centos.org/job/libvirt-rpm/systems=libvirt-centos-7/ws/build/rpm…'> FAILED 382) cpuTestJSONCPUID(x86_64): Xeon-E5-2650-v4 ... libvirt: CPU Driver error : XML error: failed to parse xml document '<https://ci.centos.org/job/libvirt-rpm/systems=libvirt-centos-7/ws/build/rpm…'> FAILED 383) cpuTestJSONSignature(x86_64): Xeon-E5-2650-v4 ... libvirt: CPU Driver error : XML error: failed to parse xml document '<https://ci.centos.org/job/libvirt-rpm/systems=libvirt-centos-7/ws/build/rpm…'> FAILED 384) cpuTestUpdateLive(x86_64): Xeon-E5-2650-v4 ... libvirt: CPU Driver error : XML error: failed to parse xml document '<https://ci.centos.org/job/libvirt-rpm/systems=libvirt-centos-7/ws/build/rpm…'> FAILED 385) cpuTestHostCPUID(x86_64): Xeon-E7-4820 ... libvirt: CPU Driver error : XML error: failed to parse xml document '<https://ci.centos.org/job/libvirt-rpm/systems=libvirt-centos-7/ws/build/rpm…'> FAILED 386) cpuTestGuestCPUID(x86_64): Xeon-E7-4820 ... libvirt: CPU Driver error : XML error: failed to parse xml document '<https://ci.centos.org/job/libvirt-rpm/systems=libvirt-centos-7/ws/build/rpm…'> FAILED 387) cpuTestCPUIDSignature(x86_64): Xeon-E7-4820 ... OK 388) cpuTestJSONCPUID(x86_64): Xeon-E7-4820 ... libvirt: CPU Driver error : XML error: failed to parse xml document '<https://ci.centos.org/job/libvirt-rpm/systems=libvirt-centos-7/ws/build/rpm…'> FAILED 389) cpuTestJSONSignature(x86_64): Xeon-E7-4820 ... libvirt: CPU Driver error : XML error: failed to parse xml document '<https://ci.centos.org/job/libvirt-rpm/systems=libvirt-centos-7/ws/build/rpm…'> FAILED 390) cpuTestUpdateLive(x86_64): Xeon-E7-4820 ... libvirt: CPU Driver error : XML error: failed to parse xml document '<https://ci.centos.org/job/libvirt-rpm/systems=libvirt-centos-7/ws/build/rpm…'> FAILED 391) cpuTestHostCPUID(x86_64): Xeon-E7-4830 ... libvirt: CPU Driver error : XML error: failed to parse xml document '<https://ci.centos.org/job/libvirt-rpm/systems=libvirt-centos-7/ws/build/rpm…'> FAILED 392) cpuTestGuestCPUID(x86_64): Xeon-E7-4830 ... libvirt: CPU Driver error : XML error: failed to parse xml document '<https://ci.centos.org/job/libvirt-rpm/systems=libvirt-centos-7/ws/build/rpm…'> FAILED 393) cpuTestCPUIDSignature(x86_64): Xeon-E7-4830 ... OK 394) cpuTestJSONCPUID(x86_64): Xeon-E7-4830 ... libvirt: CPU Driver error : XML error: failed to parse xml document '<https://ci.centos.org/job/libvirt-rpm/systems=libvirt-centos-7/ws/build/rpm…'> FAILED 395) cpuTestJSONSignature(x86_64): Xeon-E7-4830 ... libvirt: CPU Driver error : XML error: failed to parse xml document '<https://ci.centos.org/job/libvirt-rpm/systems=libvirt-centos-7/ws/build/rpm…'> FAILED 396) cpuTestUpdateLive(x86_64): Xeon-E7-4830 ... libvirt: CPU Driver error : XML error: failed to parse xml document '<https://ci.centos.org/job/libvirt-rpm/systems=libvirt-centos-7/ws/build/rpm…'> FAILED 397) cpuTestHostCPUID(x86_64): Xeon-E7-8890-v3 ... libvirt: CPU Driver error : XML error: failed to parse xml document '<https://ci.centos.org/job/libvirt-rpm/systems=libvirt-centos-7/ws/build/rpm…'> FAILED 398) cpuTestGuestCPUID(x86_64): Xeon-E7-8890-v3 ... libvirt: CPU Driver error : XML error: failed to parse xml document '<https://ci.centos.org/job/libvirt-rpm/systems=libvirt-centos-7/ws/build/rpm…'> FAILED 399) cpuTestCPUIDSignature(x86_64): Xeon-E7-8890-v3 ... OK 400) cpuTestGuestCPUID(x86_64): Xeon-E7-8890-v3 ... libvirt: CPU Driver error : XML error: failed to parse xml document '<https://ci.centos.org/job/libvirt-rpm/systems=libvirt-centos-7/ws/build/rpm…'> FAILED 401) cpuTestJSONCPUID(x86_64): Xeon-E7-8890-v3 ... libvirt: CPU Driver error : XML error: failed to parse xml document '<https://ci.centos.org/job/libvirt-rpm/systems=libvirt-centos-7/ws/build/rpm…'> FAILED 402) cpuTestJSONSignature(x86_64): Xeon-E7-8890-v3 ... libvirt: CPU Driver error : XML error: failed to parse xml document '<https://ci.centos.org/job/libvirt-rpm/systems=libvirt-centos-7/ws/build/rpm…'> FAILED 403) cpuTestUpdateLive(x86_64): Xeon-E7-8890-v3 ... libvirt: CPU Driver error : XML error: failed to parse xml document '<https://ci.centos.org/job/libvirt-rpm/systems=libvirt-centos-7/ws/build/rpm…'> FAILED 404) cpuTestHostCPUID(x86_64): Xeon-E7540 ... libvirt: CPU Driver error : XML error: failed to parse xml document '<https://ci.centos.org/job/libvirt-rpm/systems=libvirt-centos-7/ws/build/rpm…'> FAILED 405) cpuTestGuestCPUID(x86_64): Xeon-E7540 ... libvirt: CPU Driver error : XML error: failed to parse xml document '<https://ci.centos.org/job/libvirt-rpm/systems=libvirt-centos-7/ws/build/rpm…'> FAILED 406) cpuTestCPUIDSignature(x86_64): Xeon-E7540 ... OK 407) cpuTestGuestCPUID(x86_64): Xeon-E7540 ... libvirt: CPU Driver error : XML error: failed to parse xml document '<https://ci.centos.org/job/libvirt-rpm/systems=libvirt-centos-7/ws/build/rpm…'> FAILED 408) cpuTestJSONCPUID(x86_64): Xeon-E7540 ... libvirt: CPU Driver error : XML error: failed to parse xml document '<https://ci.centos.org/job/libvirt-rpm/systems=libvirt-centos-7/ws/build/rpm…'> FAILED 409) cpuTestJSONSignature(x86_64): Xeon-E7540 ... libvirt: CPU Driver error : XML error: failed to parse xml document '<https://ci.centos.org/job/libvirt-rpm/systems=libvirt-centos-7/ws/build/rpm…'> FAILED 410) cpuTestUpdateLive(x86_64): Xeon-E7540 ... libvirt: CPU Driver error : XML error: failed to parse xml document '<https://ci.centos.org/job/libvirt-rpm/systems=libvirt-centos-7/ws/build/rpm…'> FAILED 411) cpuTestHostCPUID(x86_64): Xeon-Gold-5115 ... libvirt: CPU Driver error : XML error: failed to parse xml document '<https://ci.centos.org/job/libvirt-rpm/systems=libvirt-centos-7/ws/build/rpm…'> FAILED 412) cpuTestGuestCPUID(x86_64): Xeon-Gold-5115 ... libvirt: CPU Driver error : XML error: failed to parse xml document '<https://ci.centos.org/job/libvirt-rpm/systems=libvirt-centos-7/ws/build/rpm…'> FAILED 413) cpuTestCPUIDSignature(x86_64): Xeon-Gold-5115 ... OK 414) cpuTestGuestCPUID(x86_64): Xeon-Gold-5115 ... libvirt: CPU Driver error : XML error: failed to parse xml document '<https://ci.centos.org/job/libvirt-rpm/systems=libvirt-centos-7/ws/build/rpm…'> FAILED 415) cpuTestJSONCPUID(x86_64): Xeon-Gold-5115 ... libvirt: CPU Driver error : XML error: failed to parse xml document '<https://ci.centos.org/job/libvirt-rpm/systems=libvirt-centos-7/ws/build/rpm…'> FAILED 416) cpuTestJSONSignature(x86_64): Xeon-Gold-5115 ... libvirt: CPU Driver error : XML error: failed to parse xml document '<https://ci.centos.org/job/libvirt-rpm/systems=libvirt-centos-7/ws/build/rpm…'> FAILED 417) cpuTestUpdateLive(x86_64): Xeon-Gold-5115 ... libvirt: CPU Driver error : XML error: failed to parse xml document '<https://ci.centos.org/job/libvirt-rpm/systems=libvirt-centos-7/ws/build/rpm…'> FAILED 418) cpuTestHostCPUID(x86_64): Xeon-Gold-6130 ... libvirt: CPU Driver error : XML error: failed to parse xml document '<https://ci.centos.org/job/libvirt-rpm/systems=libvirt-centos-7/ws/build/rpm…'> FAILED 419) cpuTestGuestCPUID(x86_64): Xeon-Gold-6130 ... libvirt: CPU Driver error : XML error: failed to parse xml document '<https://ci.centos.org/job/libvirt-rpm/systems=libvirt-centos-7/ws/build/rpm…'> FAILED 420) cpuTestCPUIDSignature(x86_64): Xeon-Gold-6130 ... OK 421) cpuTestGuestCPUID(x86_64): Xeon-Gold-6130 ... libvirt: CPU Driver error : XML error: failed to parse xml document '<https://ci.centos.org/job/libvirt-rpm/systems=libvirt-centos-7/ws/build/rpm…'> FAILED 422) cpuTestJSONCPUID(x86_64): Xeon-Gold-6130 ... libvirt: CPU Driver error : XML error: failed to parse xml document '<https://ci.centos.org/job/libvirt-rpm/systems=libvirt-centos-7/ws/build/rpm…'> FAILED 423) cpuTestJSONSignature(x86_64): Xeon-Gold-6130 ... libvirt: CPU Driver error : XML error: failed to parse xml document '<https://ci.centos.org/job/libvirt-rpm/systems=libvirt-centos-7/ws/build/rpm…'> FAILED 424) cpuTestUpdateLive(x86_64): Xeon-Gold-6130 ... libvirt: CPU Driver error : XML error: failed to parse xml document '<https://ci.centos.org/job/libvirt-rpm/systems=libvirt-centos-7/ws/build/rpm…'> FAILED 425) cpuTestHostCPUID(x86_64): Xeon-Gold-6148 ... libvirt: CPU Driver error : XML error: failed to parse xml document '<https://ci.centos.org/job/libvirt-rpm/systems=libvirt-centos-7/ws/build/rpm…'> FAILED 426) cpuTestGuestCPUID(x86_64): Xeon-Gold-6148 ... libvirt: CPU Driver error : XML error: failed to parse xml document '<https://ci.centos.org/job/libvirt-rpm/systems=libvirt-centos-7/ws/build/rpm…'> FAILED 427) cpuTestCPUIDSignature(x86_64): Xeon-Gold-6148 ... OK 428) cpuTestJSONCPUID(x86_64): Xeon-Gold-6148 ... libvirt: CPU Driver error : XML error: failed to parse xml document '<https://ci.centos.org/job/libvirt-rpm/systems=libvirt-centos-7/ws/build/rpm…'> FAILED 429) cpuTestJSONSignature(x86_64): Xeon-Gold-6148 ... libvirt: CPU Driver error : XML error: failed to parse xml document '<https://ci.centos.org/job/libvirt-rpm/systems=libvirt-centos-7/ws/build/rpm…'> FAILED 430) cpuTestUpdateLive(x86_64): Xeon-Gold-6148 ... libvirt: CPU Driver error : XML error: failed to parse xml document '<https://ci.centos.org/job/libvirt-rpm/systems=libvirt-centos-7/ws/build/rpm…'> FAILED 431) cpuTestHostCPUID(x86_64): Xeon-Platinum-8268 ... libvirt: CPU Driver error : XML error: failed to parse xml document '<https://ci.centos.org/job/libvirt-rpm/systems=libvirt-centos-7/ws/build/rpm…'> FAILED 432) cpuTestGuestCPUID(x86_64): Xeon-Platinum-8268 ... libvirt: CPU Driver error : XML error: failed to parse xml document '<https://ci.centos.org/job/libvirt-rpm/systems=libvirt-centos-7/ws/build/rpm…'> FAILED 433) cpuTestCPUIDSignature(x86_64): Xeon-Platinum-8268 ... OK 434) cpuTestJSONCPUID(x86_64): Xeon-Platinum-8268 ... libvirt: CPU Driver error : XML error: failed to parse xml document '<https://ci.centos.org/job/libvirt-rpm/systems=libvirt-centos-7/ws/build/rpm…'> FAILED 435) cpuTestJSONSignature(x86_64): Xeon-Platinum-8268 ... libvirt: CPU Driver error : XML error: failed to parse xml document '<https://ci.centos.org/job/libvirt-rpm/systems=libvirt-centos-7/ws/build/rpm…'> FAILED 436) cpuTestUpdateLive(x86_64): Xeon-Platinum-8268 ... libvirt: CPU Driver error : XML error: failed to parse xml document '<https://ci.centos.org/job/libvirt-rpm/systems=libvirt-centos-7/ws/build/rpm…'> FAILED 437) cpuTestHostCPUID(x86_64): Xeon-Platinum-9242 ... libvirt: CPU Driver error : XML error: failed to parse xml document '<https://ci.centos.org/job/libvirt-rpm/systems=libvirt-centos-7/ws/build/rpm…'> FAILED 438) cpuTestGuestCPUID(x86_64): Xeon-Platinum-9242 ... libvirt: CPU Driver error : XML error: failed to parse xml document '<https://ci.centos.org/job/libvirt-rpm/systems=libvirt-centos-7/ws/build/rpm…'> FAILED 439) cpuTestCPUIDSignature(x86_64): Xeon-Platinum-9242 ... OK 440) cpuTestGuestCPUID(x86_64): Xeon-Platinum-9242 ... libvirt: CPU Driver error : XML error: failed to parse xml document '<https://ci.centos.org/job/libvirt-rpm/systems=libvirt-centos-7/ws/build/rpm…'> FAILED 441) cpuTestJSONCPUID(x86_64): Xeon-Platinum-9242 ... libvirt: CPU Driver error : XML error: failed to parse xml document '<https://ci.centos.org/job/libvirt-rpm/systems=libvirt-centos-7/ws/build/rpm…'> FAILED 442) cpuTestJSONSignature(x86_64): Xeon-Platinum-9242 ... libvirt: CPU Driver error : XML error: failed to parse xml document '<https://ci.centos.org/job/libvirt-rpm/systems=libvirt-centos-7/ws/build/rpm…'> FAILED 443) cpuTestUpdateLive(x86_64): Xeon-Platinum-9242 ... libvirt: CPU Driver error : XML error: failed to parse xml document '<https://ci.centos.org/job/libvirt-rpm/systems=libvirt-centos-7/ws/build/rpm…'> FAILED 444) cpuTestHostCPUID(x86_64): Xeon-W3520 ... libvirt: CPU Driver error : XML error: failed to parse xml document '<https://ci.centos.org/job/libvirt-rpm/systems=libvirt-centos-7/ws/build/rpm…'> FAILED 445) cpuTestGuestCPUID(x86_64): Xeon-W3520 ... libvirt: CPU Driver error : XML error: failed to parse xml document '<https://ci.centos.org/job/libvirt-rpm/systems=libvirt-centos-7/ws/build/rpm…'> FAILED 446) cpuTestCPUIDSignature(x86_64): Xeon-W3520 ... OK 447) cpuTestJSONCPUID(x86_64): Xeon-W3520 ... libvirt: CPU Driver error : XML error: failed to parse xml document '<https://ci.centos.org/job/libvirt-rpm/systems=libvirt-centos-7/ws/build/rpm…'> FAILED 448) cpuTestJSONSignature(x86_64): Xeon-W3520 ... libvirt: CPU Driver error : XML error: failed to parse xml document '<https://ci.centos.org/job/libvirt-rpm/systems=libvirt-centos-7/ws/build/rpm…'> FAILED 449) cpuTestUpdateLive(x86_64): Xeon-W3520 ... libvirt: CPU Driver error : XML error: failed to parse xml document '<https://ci.centos.org/job/libvirt-rpm/systems=libvirt-centos-7/ws/build/rpm…'> FAILED 450) cpuTestHostCPUID(x86_64): Xeon-X5460 ... libvirt: CPU Driver error : XML error: failed to parse xml document '<https://ci.centos.org/job/libvirt-rpm/systems=libvirt-centos-7/ws/build/rpm…'> FAILED 451) cpuTestGuestCPUID(x86_64): Xeon-X5460 ... libvirt: CPU Driver error : XML error: failed to parse xml document '<https://ci.centos.org/job/libvirt-rpm/systems=libvirt-centos-7/ws/build/rpm…'> FAILED 452) cpuTestCPUIDSignature(x86_64): Xeon-X5460 ... OK 453) cpuTestHostCPUID(x86_64): Ice-Lake-Server ... libvirt: CPU Driver error : XML error: failed to parse xml document '<https://ci.centos.org/job/libvirt-rpm/systems=libvirt-centos-7/ws/build/rpm…'> FAILED 454) cpuTestGuestCPUID(x86_64): Ice-Lake-Server ... libvirt: CPU Driver error : XML error: failed to parse xml document '<https://ci.centos.org/job/libvirt-rpm/systems=libvirt-centos-7/ws/build/rpm…'> FAILED 455) cpuTestCPUIDSignature(x86_64): Ice-Lake-Server ... OK 456) cpuTestGuestCPUID(x86_64): Ice-Lake-Server ... libvirt: CPU Driver error : XML error: failed to parse xml document '<https://ci.centos.org/job/libvirt-rpm/systems=libvirt-centos-7/ws/build/rpm…'> FAILED 457) cpuTestJSONCPUID(x86_64): Ice-Lake-Server ... libvirt: CPU Driver error : XML error: failed to parse xml document '<https://ci.centos.org/job/libvirt-rpm/systems=libvirt-centos-7/ws/build/rpm…'> FAILED 458) cpuTestJSONSignature(x86_64): Ice-Lake-Server ... libvirt: CPU Driver error : XML error: failed to parse xml document '<https://ci.centos.org/job/libvirt-rpm/systems=libvirt-centos-7/ws/build/rpm…'> FAILED 459) cpuTestUpdateLive(x86_64): Ice-Lake-Server ... libvirt: CPU Driver error : XML error: failed to parse xml document '<https://ci.centos.org/job/libvirt-rpm/systems=libvirt-centos-7/ws/build/rpm…'> FAILED 460) cpuTestHostCPUID(x86_64): Cooperlake ... libvirt: CPU Driver error : XML error: failed to parse xml document '<https://ci.centos.org/job/libvirt-rpm/systems=libvirt-centos-7/ws/build/rpm…'> FAILED 461) cpuTestGuestCPUID(x86_64): Cooperlake ... libvirt: CPU Driver error : XML error: failed to parse xml document '<https://ci.centos.org/job/libvirt-rpm/systems=libvirt-centos-7/ws/build/rpm…'> FAILED 462) cpuTestCPUIDSignature(x86_64): Cooperlake ... OK 463) cpuTestGuestCPUID(x86_64): Cooperlake ... libvirt: CPU Driver error : XML error: failed to parse xml document '<https://ci.centos.org/job/libvirt-rpm/systems=libvirt-centos-7/ws/build/rpm…'> FAILED 464) cpuTestJSONCPUID(x86_64): Cooperlake ... libvirt: CPU Driver error : XML error: failed to parse xml document '<https://ci.centos.org/job/libvirt-rpm/systems=libvirt-centos-7/ws/build/rpm…'> FAILED 465) cpuTestJSONSignature(x86_64): Cooperlake ... libvirt: CPU Driver error : XML error: failed to parse xml document '<https://ci.centos.org/job/libvirt-rpm/systems=libvirt-centos-7/ws/build/rpm…'> FAILED 466) cpuTestUpdateLive(x86_64): Cooperlake ... libvirt: CPU Driver error : XML error: failed to parse xml document '<https://ci.centos.org/job/libvirt-rpm/systems=libvirt-centos-7/ws/build/rpm…'> FAILED Some tests failed. Run them using: VIR_TEST_DEBUG=1 VIR_TEST_RANGE=1-3,6,16-31,33-35,45-58,78-91,97-109,112,114-115,117,123-124,126-130,132-133,135-136,138-142,144-148,150-155,157-161,163-167,169-173,175-179,181-182,184-188,190-194,196-200,202-206,208-212,214-218,220-224,226-231,233-238,240-245,247-252,254-258,260-261,263-267,269-273,275-279,281-282,284-285,287-291,293-297,299-300,302-303,305-309,311-315,317-322,324-325,327-332,334-339,341-346,348-353,355-359,361-366,368-373,375-379,381-386,388-392,394-398,400-405,407-412,414-419,421-426,428-432,434-438,440-445,447-451,453-454,456-461,463-466 <https://ci.centos.org/job/libvirt-rpm/systems=libvirt-centos-7/ws/build/rpm…> + exit 1 error: Bad exit status from /var/tmp/rpm-tmp.0P2Trs (%check) RPM build errors: Bad exit status from /var/tmp/rpm-tmp.0P2Trs (%check) Build step 'Execute shell' marked build as failure
1 2
0 0
Build failed in Jenkins: libvirt-dbus-check » libvirt-fedora-32 #1157
by ci@centos.org 26 May '20

26 May '20
See <https://ci.centos.org/job/libvirt-dbus-check/systems=libvirt-fedora-32/1157…> ------------------------------------------ [...truncated 5.45 KB...] kwargs = {}, get_args_opts = {'byte_arrays': False} message = <dbus.lowlevel.MethodCallMessage path: /org/libvirt/Test, iface: org.libvirt.Connect, member: GetCPUModelNames dest: :1.19> def call_blocking(self, bus_name, object_path, dbus_interface, method, signature, args, timeout=-1.0, byte_arrays=False, **kwargs): """Call the given method, synchronously. :Since: 0.81.0 """ if object_path == LOCAL_PATH: raise DBusException('Methods may not be called on the reserved ' 'path %s' % LOCAL_PATH) if dbus_interface == LOCAL_IFACE: raise DBusException('Methods may not be called on the reserved ' 'interface %s' % LOCAL_IFACE) # no need to validate other args - MethodCallMessage ctor will do get_args_opts = dict(byte_arrays=byte_arrays) if is_py2: get_args_opts['utf8_strings'] = kwargs.get('utf8_strings', False) elif 'utf8_strings' in kwargs: raise TypeError("unexpected keyword argument 'utf8_strings'") message = MethodCallMessage(destination=bus_name, path=object_path, interface=dbus_interface, method=method) # Add the arguments to the function try: message.append(signature=signature, *args) except Exception as e: logging.basicConfig() _logger.error('Unable to set arguments %r according to ' 'signature %r: %s: %s', args, signature, e.__class__, e) raise # make a blocking call > reply_message = self.send_message_with_reply_and_block( message, timeout) E dbus.exceptions.DBusException: org.libvirt.Error: XML error: failed to parse xml document '/home/jenkins/build/libvirt/share/libvirt/cpu_map/x86_Cooperlake.xml' /usr/lib64/python3.8/site-packages/dbus/connection.py:652: DBusException ----------------------------- Captured stderr call ----------------------------- I/O warning : failed to load external entity "/home/jenkins/build/libvirt/share/libvirt/cpu_map/x86_Cooperlake.xml" ===================== 1 failed, 34 passed in 9.05 seconds ====================== ------- Full log written to <https://ci.centos.org/job/libvirt-dbus-check/systems=libvirt-fedora-32/ws/b…> FAILED: meson-test /usr/bin/meson test --no-rebuild --print-errorlogs ninja: build stopped: subcommand failed. + cat meson-logs/testlog.txt Log of Meson test suite run on 2020-05-25T22:23:59.311059 Inherited environment: SHELL='/bin/bash' ROOT_BUILD_CAUSE_SCMTRIGGER='true' HISTCONTROL='ignoredups' CCACHE_MAXSIZE='2G' OSINFO_SYSTEM_DIR='/home/jenkins/build/libvirt/share/osinfo' PKG_CONFIG_PATH='/home/jenkins/build/libvirt/lib64/pkgconfig:/home/jenkins/build/libvirt/lib/pkgconfig' HISTSIZE='1000' HOSTNAME='libvirt-fedora-32' JENKINS_SERVER_COOKIE='f4d3a7a925dabf8a' BUILD_CAUSE='UPSTREAMTRIGGER' RUN_CHANGES_DISPLAY_URL='https://ci.centos.org/job/libvirt-dbus-check/systems=libvirt-fedora-32/1157…' HUDSON_HOME='/var/lib/jenkins' PWD='<https://ci.centos.org/job/libvirt-dbus-check/systems=libvirt-fedora-32/ws/b…'> LOGNAME='jenkins' BUILD_URL='https://ci.centos.org/job/libvirt-dbus-check/systems=libvirt-fedora-32/1157/' BUILD_CAUSE_UPSTREAMTRIGGER='true' JOB_URL='https://ci.centos.org/job/libvirt-dbus-check/systems=libvirt-fedora-32/' BUILD_NUMBER='1157' _='/usr/bin/meson' BUILD_DISPLAY_NAME='#1157' GI_TYPELIB_PATH='/home/jenkins/build/libvirt/lib64/girepository-1.0:/home/jenkins/build/libvirt/lib/girepository-1.0' HOME='/home/jenkins' LANG='en_US.UTF-8' JENKINS_URL='https://ci.centos.org/' JOB_BASE_NAME='systems=libvirt-fedora-32' JOB_NAME='libvirt-dbus-check/systems=libvirt-fedora-32' PERL5LIB='/home/jenkins/build/libvirt/lib/perl5/x86_64-linux-thread-multi' INVOCATION_ID='4e0e2ac70edf42ee9910d1754a0d7bb3' RUN_DISPLAY_URL='https://ci.centos.org/job/libvirt-dbus-check/systems=libvirt-fedora-32/1157…' VIRT_PREFIX='/home/jenkins/build/libvirt' JOB_DISPLAY_URL='https://ci.centos.org/job/libvirt-dbus-check/systems=libvirt-fedora-32/disp…' WORKSPACE='<https://ci.centos.org/job/libvirt-dbus-check/systems=libvirt-fedora-32/ws/'> HUDSON_URL='https://ci.centos.org/' MAKEFLAGS='-j3' PYTHONPATH='/home/jenkins/build/libvirt/lib64/python3.8/site-packages' NODE_NAME='libvirt-fedora-32' LESSOPEN='||/usr/bin/lesspipe.sh %s' USER='jenkins' PYTHON='/usr/bin/python3' HUDSON_SERVER_COOKIE='f4d3a7a925dabf8a' SHLVL='1' BUILD_TAG='jenkins-libvirt-dbus-check-systems=libvirt-fedora-32-1157' EXECUTOR_NUMBER='2' HUDSON_COOKIE='5b2656cb-f058-4608-ac42-58fadf1f580c' CCACHE_WRAPPERSDIR='/usr/libexec/ccache-wrappers' JENKINS_HOME='/var/lib/jenkins' systems='libvirt-fedora-32' LD_LIBRARY_PATH='/home/jenkins/build/libvirt/lib64:/home/jenkins/build/libvirt/lib' ROOT_BUILD_CAUSE='SCMTRIGGER' MAKE='/usr/bin/make' NODE_LABELS='libvirt libvirt-fedora-32' JOURNAL_STREAM='9:19050' XDG_DATA_DIRS='/home/jenkins/build/libvirt/share:/usr/share:/usr/local/share' PATH='/usr/libexec/ccache-wrappers:/home/jenkins/build/libvirt/bin:/usr/lib64/ccache:/usr/local/sbin:/usr/local/bin:/usr/sbin:/usr/bin' C_INCLUDE_PATH='/home/jenkins/build/libvirt/include' MAIL='/var/spool/mail/jenkins' BUILD_ID='1157' NINJA='/usr/bin/ninja' OLDPWD='<https://ci.centos.org/job/libvirt-dbus-check/systems=libvirt-fedora-32/ws/'> 1/9 libvirt-dbus:unit / test_util OK 0.15s --- command --- 22:23:59 <https://ci.centos.org/job/libvirt-dbus-check/systems=libvirt-fedora-32/ws/b…> ------- 2/9 libvirt-dbus:unit / test_connect.py FAIL 10.92s (exit status 1) --- command --- 22:23:59 abs_top_builddir='<https://ci.centos.org/job/libvirt-dbus-check/systems=libvirt-fedora-32/ws/b…'> VIRT_DBUS_INTERFACES_DIR='<https://ci.centos.org/job/libvirt-dbus-check/systems=libvirt-fedora-32/ws/d…'> <https://ci.centos.org/job/libvirt-dbus-check/systems=libvirt-fedora-32/ws/t…> --- stdout --- ============================= test session starts ============================== platform linux -- Python 3.8.2, pytest-4.6.9, py-1.8.0, pluggy-0.13.0 rootdir: <https://ci.centos.org/job/libvirt-dbus-check/systems=libvirt-fedora-32/ws/> collected 35 items ../tests/test_connect.py ..................F................ [100%] =================================== FAILURES =================================== _________________ TestConnect.test_connect_get_cpu_model_names _________________ self = <test_connect.TestConnect object at 0x7fa2366c2460> def test_connect_get_cpu_model_names(self): arch = "x86_64" > assert isinstance(self.connect.GetCPUModelNames(arch, 0), dbus.Array) ../tests/test_connect.py:122: _ _ _ _ _ _ _ _ _ _ _ _ _ _ _ _ _ _ _ _ _ _ _ _ _ _ _ _ _ _ _ _ _ _ _ _ _ _ _ _ /usr/lib64/python3.8/site-packages/dbus/proxies.py:72: in __call__ return self._proxy_method(*args, **keywords) /usr/lib64/python3.8/site-packages/dbus/proxies.py:141: in __call__ return self._connection.call_blocking(self._named_service, _ _ _ _ _ _ _ _ _ _ _ _ _ _ _ _ _ _ _ _ _ _ _ _ _ _ _ _ _ _ _ _ _ _ _ _ _ _ _ _ self = <dbus._dbus.SessionBus (session) at 0x7fa2366b0ea0> bus_name = dbus.String(':1.19'), object_path = '/org/libvirt/Test' dbus_interface = 'org.libvirt.Connect', method = 'GetCPUModelNames' signature = 'su', args = ('x86_64', 0), timeout = -1.0, byte_arrays = False kwargs = {}, get_args_opts = {'byte_arrays': False} message = <dbus.lowlevel.MethodCallMessage path: /org/libvirt/Test, iface: org.libvirt.Connect, member: GetCPUModelNames dest: :1.19> def call_blocking(self, bus_name, object_path, dbus_interface, method, signature, args, timeout=-1.0, byte_arrays=False, **kwargs): """Call the given method, synchronously. :Since: 0.81.0 """ if object_path == LOCAL_PATH: raise DBusException('Methods may not be called on the reserved ' 'path %s' % LOCAL_PATH) if dbus_interface == LOCAL_IFACE: raise DBusException('Methods may not be called on the reserved ' 'interface %s' % LOCAL_IFACE) # no need to validate other args - MethodCallMessage ctor will do get_args_opts = dict(byte_arrays=byte_arrays) if is_py2: get_args_opts['utf8_strings'] = kwargs.get('utf8_strings', False) elif 'utf8_strings' in kwargs: raise TypeError("unexpected keyword argument 'utf8_strings'") message = MethodCallMessage(destination=bus_name, path=object_path, interface=dbus_interface, method=method) # Add the arguments to the function try: message.append(signature=signature, *args) except Exception as e: logging.basicConfig() _logger.error('Unable to set arguments %r according to ' 'signature %r: %s: %s', args, signature, e.__class__, e) raise # make a blocking call > reply_message = self.send_message_with_reply_and_block( message, timeout) E dbus.exceptions.DBusException: org.libvirt.Error: XML error: failed to parse xml document '/home/jenkins/build/libvirt/share/libvirt/cpu_map/x86_Cooperlake.xml' /usr/lib64/python3.8/site-packages/dbus/connection.py:652: DBusException ----------------------------- Captured stderr call ----------------------------- I/O warning : failed to load external entity "/home/jenkins/build/libvirt/share/libvirt/cpu_map/x86_Cooperlake.xml" ===================== 1 failed, 34 passed in 9.05 seconds ====================== ------- 3/9 libvirt-dbus:unit / test_domain.py OK 4.42s --- command --- 22:23:59 abs_top_builddir='<https://ci.centos.org/job/libvirt-dbus-check/systems=libvirt-fedora-32/ws/b…'> VIRT_DBUS_INTERFACES_DIR='<https://ci.centos.org/job/libvirt-dbus-check/systems=libvirt-fedora-32/ws/d…'> <https://ci.centos.org/job/libvirt-dbus-check/systems=libvirt-fedora-32/ws/t…> --- stdout --- ============================= test session starts ============================== platform linux -- Python 3.8.2, pytest-4.6.9, py-1.8.0, pluggy-0.13.0 rootdir: <https://ci.centos.org/job/libvirt-dbus-check/systems=libvirt-fedora-32/ws/> collected 11 items ../tests/test_domain.py ........... [100%] ========================== 11 passed in 2.72 seconds =========================== ------- 4/9 libvirt-dbus:unit / test_snapshot.py OK 3.30s --- command --- 22:24:03 abs_top_builddir='<https://ci.centos.org/job/libvirt-dbus-check/systems=libvirt-fedora-32/ws/b…'> VIRT_DBUS_INTERFACES_DIR='<https://ci.centos.org/job/libvirt-dbus-check/systems=libvirt-fedora-32/ws/d…'> <https://ci.centos.org/job/libvirt-dbus-check/systems=libvirt-fedora-32/ws/t…> --- stdout --- ============================= test session starts ============================== platform linux -- Python 3.8.2, pytest-4.6.9, py-1.8.0, pluggy-0.13.0 rootdir: <https://ci.centos.org/job/libvirt-dbus-check/systems=libvirt-fedora-32/ws/> collected 6 items ../tests/test_snapshot.py ...... [100%] =========================== 6 passed in 1.81 seconds =========================== ------- 5/9 libvirt-dbus:unit / test_interface.py OK 2.90s --- command --- 22:24:07 abs_top_builddir='<https://ci.centos.org/job/libvirt-dbus-check/systems=libvirt-fedora-32/ws/b…'> VIRT_DBUS_INTERFACES_DIR='<https://ci.centos.org/job/libvirt-dbus-check/systems=libvirt-fedora-32/ws/d…'> <https://ci.centos.org/job/libvirt-dbus-check/systems=libvirt-fedora-32/ws/t…> --- stdout --- ============================= test session starts ============================== platform linux -- Python 3.8.2, pytest-4.6.9, py-1.8.0, pluggy-0.13.0 rootdir: <https://ci.centos.org/job/libvirt-dbus-check/systems=libvirt-fedora-32/ws/> collected 5 items ../tests/test_interface.py ..... [100%] =========================== 5 passed in 1.17 seconds =========================== ------- 6/9 libvirt-dbus:unit / test_network.py OK 3.96s --- command --- 22:24:10 abs_top_builddir='<https://ci.centos.org/job/libvirt-dbus-check/systems=libvirt-fedora-32/ws/b…'> VIRT_DBUS_INTERFACES_DIR='<https://ci.centos.org/job/libvirt-dbus-check/systems=libvirt-fedora-32/ws/d…'> <https://ci.centos.org/job/libvirt-dbus-check/systems=libvirt-fedora-32/ws/t…> --- stdout --- ============================= test session starts ============================== platform linux -- Python 3.8.2, pytest-4.6.9, py-1.8.0, pluggy-0.13.0 rootdir: <https://ci.centos.org/job/libvirt-dbus-check/systems=libvirt-fedora-32/ws/> collected 7 items ../tests/test_network.py ....... [100%] =========================== 7 passed in 1.99 seconds =========================== ------- 7/9 libvirt-dbus:unit / test_nodedev.py OK 3.07s --- command --- 22:24:10 abs_top_builddir='<https://ci.centos.org/job/libvirt-dbus-check/systems=libvirt-fedora-32/ws/b…'> VIRT_DBUS_INTERFACES_DIR='<https://ci.centos.org/job/libvirt-dbus-check/systems=libvirt-fedora-32/ws/d…'> <https://ci.centos.org/job/libvirt-dbus-check/systems=libvirt-fedora-32/ws/t…> --- stdout --- ============================= test session starts ============================== platform linux -- Python 3.8.2, pytest-4.6.9, py-1.8.0, pluggy-0.13.0 rootdir: <https://ci.centos.org/job/libvirt-dbus-check/systems=libvirt-fedora-32/ws/> collected 4 items ../tests/test_nodedev.py .... [100%] =========================== 4 passed in 1.22 seconds =========================== ------- 8/9 libvirt-dbus:unit / test_storage.py OK 7.35s --- command --- 22:24:13 abs_top_builddir='<https://ci.centos.org/job/libvirt-dbus-check/systems=libvirt-fedora-32/ws/b…'> VIRT_DBUS_INTERFACES_DIR='<https://ci.centos.org/job/libvirt-dbus-check/systems=libvirt-fedora-32/ws/d…'> <https://ci.centos.org/job/libvirt-dbus-check/systems=libvirt-fedora-32/ws/t…> --- stdout --- ============================= test session starts ============================== platform linux -- Python 3.8.2, pytest-4.6.9, py-1.8.0, pluggy-0.13.0 rootdir: <https://ci.centos.org/job/libvirt-dbus-check/systems=libvirt-fedora-32/ws/> collected 16 items ../tests/test_storage.py ................ [100%] ========================== 16 passed in 5.07 seconds =========================== ------- 9/9 libvirt-dbus:style / flake8 OK 5.95s --- command --- 22:24:14 /usr/bin/flake8 --show-source --ignore=E501 <https://ci.centos.org/job/libvirt-dbus-check/systems=libvirt-fedora-32/ws/> ------- Ok: 8 Expected Fail: 0 Fail: 1 Unexpected Pass: 0 Skipped: 0 Timeout: 0 + exit 1 Build step 'Execute shell' marked build as failure
1 2
0 0
Build failed in Jenkins: libvirt-dbus-check » libvirt-fedora-31 #1157
by ci@centos.org 26 May '20

26 May '20
See <https://ci.centos.org/job/libvirt-dbus-check/systems=libvirt-fedora-31/1157…> ------------------------------------------ [...truncated 5.38 KB...] kwargs = {}, get_args_opts = {'byte_arrays': False} message = <dbus.lowlevel.MethodCallMessage path: /org/libvirt/Test, iface: org.libvirt.Connect, member: GetCPUModelNames dest: :1.19> def call_blocking(self, bus_name, object_path, dbus_interface, method, signature, args, timeout=-1.0, byte_arrays=False, **kwargs): """Call the given method, synchronously. :Since: 0.81.0 """ if object_path == LOCAL_PATH: raise DBusException('Methods may not be called on the reserved ' 'path %s' % LOCAL_PATH) if dbus_interface == LOCAL_IFACE: raise DBusException('Methods may not be called on the reserved ' 'interface %s' % LOCAL_IFACE) # no need to validate other args - MethodCallMessage ctor will do get_args_opts = dict(byte_arrays=byte_arrays) if is_py2: get_args_opts['utf8_strings'] = kwargs.get('utf8_strings', False) elif 'utf8_strings' in kwargs: raise TypeError("unexpected keyword argument 'utf8_strings'") message = MethodCallMessage(destination=bus_name, path=object_path, interface=dbus_interface, method=method) # Add the arguments to the function try: message.append(signature=signature, *args) except Exception as e: logging.basicConfig() _logger.error('Unable to set arguments %r according to ' 'signature %r: %s: %s', args, signature, e.__class__, e) raise # make a blocking call reply_message = self.send_message_with_reply_and_block( > message, timeout) E dbus.exceptions.DBusException: org.libvirt.Error: XML error: failed to parse xml document '/home/jenkins/build/libvirt/share/libvirt/cpu_map/x86_Cooperlake.xml' /usr/lib64/python3.7/site-packages/dbus/connection.py:651: DBusException ----------------------------- Captured stderr call ----------------------------- I/O warning : failed to load external entity "/home/jenkins/build/libvirt/share/libvirt/cpu_map/x86_Cooperlake.xml" ===================== 1 failed, 34 passed in 8.26 seconds ====================== ------- Full log written to <https://ci.centos.org/job/libvirt-dbus-check/systems=libvirt-fedora-31/ws/b…> FAILED: meson-test /usr/bin/meson test --no-rebuild --print-errorlogs ninja: build stopped: subcommand failed. + cat meson-logs/testlog.txt Log of Meson test suite run on 2020-05-25T22:24:00.232029 Inherited environment: SHELL='/bin/bash' ROOT_BUILD_CAUSE_SCMTRIGGER='true' HISTCONTROL='ignoredups' CCACHE_MAXSIZE='2G' OSINFO_SYSTEM_DIR='/home/jenkins/build/libvirt/share/osinfo' PKG_CONFIG_PATH='/home/jenkins/build/libvirt/lib64/pkgconfig:/home/jenkins/build/libvirt/lib/pkgconfig' HISTSIZE='1000' HOSTNAME='libvirt-fedora-31' JENKINS_SERVER_COOKIE='f4d3a7a925dabf8a' BUILD_CAUSE='UPSTREAMTRIGGER' RUN_CHANGES_DISPLAY_URL='https://ci.centos.org/job/libvirt-dbus-check/systems=libvirt-fedora-31/1157…' HUDSON_HOME='/var/lib/jenkins' PWD='<https://ci.centos.org/job/libvirt-dbus-check/systems=libvirt-fedora-31/ws/b…'> LOGNAME='jenkins' BUILD_URL='https://ci.centos.org/job/libvirt-dbus-check/systems=libvirt-fedora-31/1157/' BUILD_CAUSE_UPSTREAMTRIGGER='true' JOB_URL='https://ci.centos.org/job/libvirt-dbus-check/systems=libvirt-fedora-31/' BUILD_NUMBER='1157' _='/usr/bin/meson' BUILD_DISPLAY_NAME='#1157' GI_TYPELIB_PATH='/home/jenkins/build/libvirt/lib64/girepository-1.0:/home/jenkins/build/libvirt/lib/girepository-1.0' HOME='/home/jenkins' LANG='en_US.UTF-8' JENKINS_URL='https://ci.centos.org/' JOB_BASE_NAME='systems=libvirt-fedora-31' JOB_NAME='libvirt-dbus-check/systems=libvirt-fedora-31' PERL5LIB='/home/jenkins/build/libvirt/lib/perl5/x86_64-linux-thread-multi' INVOCATION_ID='2609158b0d834d11b45854211f9f50ba' RUN_DISPLAY_URL='https://ci.centos.org/job/libvirt-dbus-check/systems=libvirt-fedora-31/1157…' VIRT_PREFIX='/home/jenkins/build/libvirt' JOB_DISPLAY_URL='https://ci.centos.org/job/libvirt-dbus-check/systems=libvirt-fedora-31/disp…' WORKSPACE='<https://ci.centos.org/job/libvirt-dbus-check/systems=libvirt-fedora-31/ws/'> HUDSON_URL='https://ci.centos.org/' MAKEFLAGS='-j3' PYTHONPATH='/home/jenkins/build/libvirt/lib64/python3.7/site-packages' NODE_NAME='libvirt-fedora-31' LESSOPEN='||/usr/bin/lesspipe.sh %s' USER='jenkins' PYTHON='/usr/bin/python3' HUDSON_SERVER_COOKIE='f4d3a7a925dabf8a' SHLVL='1' BUILD_TAG='jenkins-libvirt-dbus-check-systems=libvirt-fedora-31-1157' EXECUTOR_NUMBER='1' HUDSON_COOKIE='960194bf-7a11-4935-92bc-ad03a974c576' CCACHE_WRAPPERSDIR='/usr/libexec/ccache-wrappers' JENKINS_HOME='/var/lib/jenkins' systems='libvirt-fedora-31' LD_LIBRARY_PATH='/home/jenkins/build/libvirt/lib64:/home/jenkins/build/libvirt/lib' ROOT_BUILD_CAUSE='SCMTRIGGER' MAKE='/usr/bin/make' NODE_LABELS='libvirt libvirt-fedora-31' JOURNAL_STREAM='9:19246' XDG_DATA_DIRS='/home/jenkins/build/libvirt/share:/usr/share:/usr/local/share' PATH='/usr/libexec/ccache-wrappers:/home/jenkins/build/libvirt/bin:/usr/lib64/ccache:/usr/local/sbin:/usr/local/bin:/usr/sbin:/usr/bin' C_INCLUDE_PATH='/home/jenkins/build/libvirt/include' MAIL='/var/spool/mail/jenkins' BUILD_ID='1157' NINJA='/usr/bin/ninja' OLDPWD='<https://ci.centos.org/job/libvirt-dbus-check/systems=libvirt-fedora-31/ws/'> 1/9 libvirt-dbus:unit / test_util OK 0.16 s --- command --- <https://ci.centos.org/job/libvirt-dbus-check/systems=libvirt-fedora-31/ws/b…> ------- 2/9 libvirt-dbus:unit / test_connect.py FAIL 10.57 s (exit status 1) --- command --- VIRT_DBUS_INTERFACES_DIR='<https://ci.centos.org/job/libvirt-dbus-check/systems=libvirt-fedora-31/ws/d…'> abs_top_builddir='<https://ci.centos.org/job/libvirt-dbus-check/systems=libvirt-fedora-31/ws/b…'> <https://ci.centos.org/job/libvirt-dbus-check/systems=libvirt-fedora-31/ws/t…> --- stdout --- ============================= test session starts ============================== platform linux -- Python 3.7.7, pytest-4.6.9, py-1.8.0, pluggy-0.12.0 rootdir: <https://ci.centos.org/job/libvirt-dbus-check/systems=libvirt-fedora-31/ws/> collected 35 items ../tests/test_connect.py ..................F................ [100%] =================================== FAILURES =================================== _________________ TestConnect.test_connect_get_cpu_model_names _________________ self = <test_connect.TestConnect object at 0x7f38d298f610> def test_connect_get_cpu_model_names(self): arch = "x86_64" > assert isinstance(self.connect.GetCPUModelNames(arch, 0), dbus.Array) ../tests/test_connect.py:122: _ _ _ _ _ _ _ _ _ _ _ _ _ _ _ _ _ _ _ _ _ _ _ _ _ _ _ _ _ _ _ _ _ _ _ _ _ _ _ _ /usr/lib64/python3.7/site-packages/dbus/proxies.py:70: in __call__ return self._proxy_method(*args, **keywords) /usr/lib64/python3.7/site-packages/dbus/proxies.py:145: in __call__ **keywords) _ _ _ _ _ _ _ _ _ _ _ _ _ _ _ _ _ _ _ _ _ _ _ _ _ _ _ _ _ _ _ _ _ _ _ _ _ _ _ _ self = <dbus._dbus.SessionBus (session) at 0x7f38d2a04470> bus_name = dbus.String(':1.19'), object_path = '/org/libvirt/Test' dbus_interface = 'org.libvirt.Connect', method = 'GetCPUModelNames' signature = 'su', args = ('x86_64', 0), timeout = -1.0, byte_arrays = False kwargs = {}, get_args_opts = {'byte_arrays': False} message = <dbus.lowlevel.MethodCallMessage path: /org/libvirt/Test, iface: org.libvirt.Connect, member: GetCPUModelNames dest: :1.19> def call_blocking(self, bus_name, object_path, dbus_interface, method, signature, args, timeout=-1.0, byte_arrays=False, **kwargs): """Call the given method, synchronously. :Since: 0.81.0 """ if object_path == LOCAL_PATH: raise DBusException('Methods may not be called on the reserved ' 'path %s' % LOCAL_PATH) if dbus_interface == LOCAL_IFACE: raise DBusException('Methods may not be called on the reserved ' 'interface %s' % LOCAL_IFACE) # no need to validate other args - MethodCallMessage ctor will do get_args_opts = dict(byte_arrays=byte_arrays) if is_py2: get_args_opts['utf8_strings'] = kwargs.get('utf8_strings', False) elif 'utf8_strings' in kwargs: raise TypeError("unexpected keyword argument 'utf8_strings'") message = MethodCallMessage(destination=bus_name, path=object_path, interface=dbus_interface, method=method) # Add the arguments to the function try: message.append(signature=signature, *args) except Exception as e: logging.basicConfig() _logger.error('Unable to set arguments %r according to ' 'signature %r: %s: %s', args, signature, e.__class__, e) raise # make a blocking call reply_message = self.send_message_with_reply_and_block( > message, timeout) E dbus.exceptions.DBusException: org.libvirt.Error: XML error: failed to parse xml document '/home/jenkins/build/libvirt/share/libvirt/cpu_map/x86_Cooperlake.xml' /usr/lib64/python3.7/site-packages/dbus/connection.py:651: DBusException ----------------------------- Captured stderr call ----------------------------- I/O warning : failed to load external entity "/home/jenkins/build/libvirt/share/libvirt/cpu_map/x86_Cooperlake.xml" ===================== 1 failed, 34 passed in 8.26 seconds ====================== ------- 3/9 libvirt-dbus:unit / test_domain.py OK 4.95 s --- command --- VIRT_DBUS_INTERFACES_DIR='<https://ci.centos.org/job/libvirt-dbus-check/systems=libvirt-fedora-31/ws/d…'> abs_top_builddir='<https://ci.centos.org/job/libvirt-dbus-check/systems=libvirt-fedora-31/ws/b…'> <https://ci.centos.org/job/libvirt-dbus-check/systems=libvirt-fedora-31/ws/t…> --- stdout --- ============================= test session starts ============================== platform linux -- Python 3.7.7, pytest-4.6.9, py-1.8.0, pluggy-0.12.0 rootdir: <https://ci.centos.org/job/libvirt-dbus-check/systems=libvirt-fedora-31/ws/> collected 11 items ../tests/test_domain.py ........... [100%] ========================== 11 passed in 2.72 seconds =========================== ------- 4/9 libvirt-dbus:unit / test_snapshot.py OK 2.87 s --- command --- VIRT_DBUS_INTERFACES_DIR='<https://ci.centos.org/job/libvirt-dbus-check/systems=libvirt-fedora-31/ws/d…'> abs_top_builddir='<https://ci.centos.org/job/libvirt-dbus-check/systems=libvirt-fedora-31/ws/b…'> <https://ci.centos.org/job/libvirt-dbus-check/systems=libvirt-fedora-31/ws/t…> --- stdout --- ============================= test session starts ============================== platform linux -- Python 3.7.7, pytest-4.6.9, py-1.8.0, pluggy-0.12.0 rootdir: <https://ci.centos.org/job/libvirt-dbus-check/systems=libvirt-fedora-31/ws/> collected 6 items ../tests/test_snapshot.py ...... [100%] =========================== 6 passed in 1.27 seconds =========================== ------- 5/9 libvirt-dbus:unit / test_interface.py OK 3.04 s --- command --- VIRT_DBUS_INTERFACES_DIR='<https://ci.centos.org/job/libvirt-dbus-check/systems=libvirt-fedora-31/ws/d…'> abs_top_builddir='<https://ci.centos.org/job/libvirt-dbus-check/systems=libvirt-fedora-31/ws/b…'> <https://ci.centos.org/job/libvirt-dbus-check/systems=libvirt-fedora-31/ws/t…> --- stdout --- ============================= test session starts ============================== platform linux -- Python 3.7.7, pytest-4.6.9, py-1.8.0, pluggy-0.12.0 rootdir: <https://ci.centos.org/job/libvirt-dbus-check/systems=libvirt-fedora-31/ws/> collected 5 items ../tests/test_interface.py ..... [100%] =========================== 5 passed in 1.31 seconds =========================== ------- 6/9 libvirt-dbus:unit / test_network.py OK 3.31 s --- command --- VIRT_DBUS_INTERFACES_DIR='<https://ci.centos.org/job/libvirt-dbus-check/systems=libvirt-fedora-31/ws/d…'> abs_top_builddir='<https://ci.centos.org/job/libvirt-dbus-check/systems=libvirt-fedora-31/ws/b…'> <https://ci.centos.org/job/libvirt-dbus-check/systems=libvirt-fedora-31/ws/t…> --- stdout --- ============================= test session starts ============================== platform linux -- Python 3.7.7, pytest-4.6.9, py-1.8.0, pluggy-0.12.0 rootdir: <https://ci.centos.org/job/libvirt-dbus-check/systems=libvirt-fedora-31/ws/> collected 7 items ../tests/test_network.py ....... [100%] =========================== 7 passed in 1.72 seconds =========================== ------- 7/9 libvirt-dbus:unit / test_nodedev.py OK 3.31 s --- command --- VIRT_DBUS_INTERFACES_DIR='<https://ci.centos.org/job/libvirt-dbus-check/systems=libvirt-fedora-31/ws/d…'> abs_top_builddir='<https://ci.centos.org/job/libvirt-dbus-check/systems=libvirt-fedora-31/ws/b…'> <https://ci.centos.org/job/libvirt-dbus-check/systems=libvirt-fedora-31/ws/t…> --- stdout --- ============================= test session starts ============================== platform linux -- Python 3.7.7, pytest-4.6.9, py-1.8.0, pluggy-0.12.0 rootdir: <https://ci.centos.org/job/libvirt-dbus-check/systems=libvirt-fedora-31/ws/> collected 4 items ../tests/test_nodedev.py .... [100%] =========================== 4 passed in 1.59 seconds =========================== ------- 8/9 libvirt-dbus:unit / test_storage.py OK 6.70 s --- command --- VIRT_DBUS_INTERFACES_DIR='<https://ci.centos.org/job/libvirt-dbus-check/systems=libvirt-fedora-31/ws/d…'> abs_top_builddir='<https://ci.centos.org/job/libvirt-dbus-check/systems=libvirt-fedora-31/ws/b…'> <https://ci.centos.org/job/libvirt-dbus-check/systems=libvirt-fedora-31/ws/t…> --- stdout --- ============================= test session starts ============================== platform linux -- Python 3.7.7, pytest-4.6.9, py-1.8.0, pluggy-0.12.0 rootdir: <https://ci.centos.org/job/libvirt-dbus-check/systems=libvirt-fedora-31/ws/> collected 16 items ../tests/test_storage.py ................ [100%] ========================== 16 passed in 4.15 seconds =========================== ------- 9/9 libvirt-dbus:style / flake8 OK 6.03 s --- command --- /usr/bin/flake8 --show-source --ignore=E501 <https://ci.centos.org/job/libvirt-dbus-check/systems=libvirt-fedora-31/ws/> ------- Ok: 8 Expected Fail: 0 Fail: 1 Unexpected Pass: 0 Skipped: 0 Timeout: 0 + exit 1 Build step 'Execute shell' marked build as failure
1 2
0 0
Build failed in Jenkins: libvirt-dbus-check » libvirt-fedora-rawhide #1157
by ci@centos.org 26 May '20

26 May '20
See <https://ci.centos.org/job/libvirt-dbus-check/systems=libvirt-fedora-rawhide…> ------------------------------------------ [...truncated 5.47 KB...] kwargs = {}, get_args_opts = {'byte_arrays': False} message = <dbus.lowlevel.MethodCallMessage path: /org/libvirt/Test, iface: org.libvirt.Connect, member: GetCPUModelNames dest: :1.19> def call_blocking(self, bus_name, object_path, dbus_interface, method, signature, args, timeout=-1.0, byte_arrays=False, **kwargs): """Call the given method, synchronously. :Since: 0.81.0 """ if object_path == LOCAL_PATH: raise DBusException('Methods may not be called on the reserved ' 'path %s' % LOCAL_PATH) if dbus_interface == LOCAL_IFACE: raise DBusException('Methods may not be called on the reserved ' 'interface %s' % LOCAL_IFACE) # no need to validate other args - MethodCallMessage ctor will do get_args_opts = dict(byte_arrays=byte_arrays) if is_py2: get_args_opts['utf8_strings'] = kwargs.get('utf8_strings', False) elif 'utf8_strings' in kwargs: raise TypeError("unexpected keyword argument 'utf8_strings'") message = MethodCallMessage(destination=bus_name, path=object_path, interface=dbus_interface, method=method) # Add the arguments to the function try: message.append(signature=signature, *args) except Exception as e: logging.basicConfig() _logger.error('Unable to set arguments %r according to ' 'signature %r: %s: %s', args, signature, e.__class__, e) raise # make a blocking call > reply_message = self.send_message_with_reply_and_block( message, timeout) E dbus.exceptions.DBusException: org.libvirt.Error: XML error: failed to parse xml document '/home/jenkins/build/libvirt/share/libvirt/cpu_map/x86_Cooperlake.xml' /usr/lib64/python3.8/site-packages/dbus/connection.py:652: DBusException ----------------------------- Captured stderr call ----------------------------- I/O warning : failed to load external entity "/home/jenkins/build/libvirt/share/libvirt/cpu_map/x86_Cooperlake.xml" ===================== 1 failed, 34 passed in 10.88 seconds ===================== ------- Full log written to <https://ci.centos.org/job/libvirt-dbus-check/systems=libvirt-fedora-rawhide…> FAILED: meson-test /usr/bin/meson test --no-rebuild --print-errorlogs ninja: build stopped: subcommand failed. + cat meson-logs/testlog.txt Log of Meson test suite run on 2020-05-25T22:24:08.396138 Inherited environment: SHELL='/bin/bash' ROOT_BUILD_CAUSE_SCMTRIGGER='true' HISTCONTROL='ignoredups' CCACHE_MAXSIZE='2G' OSINFO_SYSTEM_DIR='/home/jenkins/build/libvirt/share/osinfo' PKG_CONFIG_PATH='/home/jenkins/build/libvirt/lib64/pkgconfig:/home/jenkins/build/libvirt/lib/pkgconfig' HISTSIZE='1000' HOSTNAME='libvirt-fedora-rawhide' JENKINS_SERVER_COOKIE='f4d3a7a925dabf8a' BUILD_CAUSE='UPSTREAMTRIGGER' RUN_CHANGES_DISPLAY_URL='https://ci.centos.org/job/libvirt-dbus-check/systems=libvirt-fedora-rawhide…' HUDSON_HOME='/var/lib/jenkins' PWD='<https://ci.centos.org/job/libvirt-dbus-check/systems=libvirt-fedora-rawhide…'> LOGNAME='jenkins' BUILD_URL='https://ci.centos.org/job/libvirt-dbus-check/systems=libvirt-fedora-rawhide…' BUILD_CAUSE_UPSTREAMTRIGGER='true' JOB_URL='https://ci.centos.org/job/libvirt-dbus-check/systems=libvirt-fedora-rawhide/' BUILD_NUMBER='1157' _='/usr/bin/meson' BUILD_DISPLAY_NAME='#1157' GI_TYPELIB_PATH='/home/jenkins/build/libvirt/lib64/girepository-1.0:/home/jenkins/build/libvirt/lib/girepository-1.0' HOME='/home/jenkins' LANG='en_US.UTF-8' JENKINS_URL='https://ci.centos.org/' JOB_BASE_NAME='systems=libvirt-fedora-rawhide' JOB_NAME='libvirt-dbus-check/systems=libvirt-fedora-rawhide' PERL5LIB='/home/jenkins/build/libvirt/lib/perl5/x86_64-linux-thread-multi' INVOCATION_ID='67b1b1ac57ff4a68bba0270526ad0545' RUN_DISPLAY_URL='https://ci.centos.org/job/libvirt-dbus-check/systems=libvirt-fedora-rawhide…' VIRT_PREFIX='/home/jenkins/build/libvirt' JOB_DISPLAY_URL='https://ci.centos.org/job/libvirt-dbus-check/systems=libvirt-fedora-rawhide…' WORKSPACE='<https://ci.centos.org/job/libvirt-dbus-check/systems=libvirt-fedora-rawhide…'> HUDSON_URL='https://ci.centos.org/' MAKEFLAGS='-j3' PYTHONPATH='/home/jenkins/build/libvirt/lib64/python3.8/site-packages' NODE_NAME='libvirt-fedora-rawhide' LESSOPEN='||/usr/bin/lesspipe.sh %s' USER='jenkins' PYTHON='/usr/bin/python3' HUDSON_SERVER_COOKIE='f4d3a7a925dabf8a' SHLVL='1' BUILD_TAG='jenkins-libvirt-dbus-check-systems=libvirt-fedora-rawhide-1157' EXECUTOR_NUMBER='0' HUDSON_COOKIE='d0c9cbe3-eae5-4e7a-aa6f-e0027218e33c' CCACHE_WRAPPERSDIR='/usr/libexec/ccache-wrappers' JENKINS_HOME='/var/lib/jenkins' systems='libvirt-fedora-rawhide' LD_LIBRARY_PATH='/home/jenkins/build/libvirt/lib64:/home/jenkins/build/libvirt/lib' ROOT_BUILD_CAUSE='SCMTRIGGER' MAKE='/usr/bin/make' NODE_LABELS='libvirt libvirt-fedora-rawhide' JOURNAL_STREAM='9:20051' XDG_DATA_DIRS='/home/jenkins/build/libvirt/share:/usr/share:/usr/local/share' PATH='/usr/libexec/ccache-wrappers:/home/jenkins/build/libvirt/bin:/usr/lib64/ccache:/usr/local/sbin:/usr/local/bin:/usr/sbin:/usr/bin' C_INCLUDE_PATH='/home/jenkins/build/libvirt/include' MAIL='/var/spool/mail/jenkins' BUILD_ID='1157' NINJA='/usr/bin/ninja' OLDPWD='<https://ci.centos.org/job/libvirt-dbus-check/systems=libvirt-fedora-rawhide…'> 1/9 libvirt-dbus:unit / test_util OK 0.22s --- command --- 22:24:08 <https://ci.centos.org/job/libvirt-dbus-check/systems=libvirt-fedora-rawhide…> ------- 2/9 libvirt-dbus:unit / test_connect.py FAIL 13.32s (exit status 1) --- command --- 22:24:08 VIRT_DBUS_INTERFACES_DIR='<https://ci.centos.org/job/libvirt-dbus-check/systems=libvirt-fedora-rawhide…'> abs_top_builddir='<https://ci.centos.org/job/libvirt-dbus-check/systems=libvirt-fedora-rawhide…'> <https://ci.centos.org/job/libvirt-dbus-check/systems=libvirt-fedora-rawhide…> --- stdout --- ============================= test session starts ============================== platform linux -- Python 3.8.3, pytest-4.6.10, py-1.8.0, pluggy-0.13.0 rootdir: <https://ci.centos.org/job/libvirt-dbus-check/systems=libvirt-fedora-rawhide…> collected 35 items ../tests/test_connect.py ..................F................ [100%] =================================== FAILURES =================================== _________________ TestConnect.test_connect_get_cpu_model_names _________________ self = <test_connect.TestConnect object at 0x7f6b4d551ca0> def test_connect_get_cpu_model_names(self): arch = "x86_64" > assert isinstance(self.connect.GetCPUModelNames(arch, 0), dbus.Array) ../tests/test_connect.py:122: _ _ _ _ _ _ _ _ _ _ _ _ _ _ _ _ _ _ _ _ _ _ _ _ _ _ _ _ _ _ _ _ _ _ _ _ _ _ _ _ /usr/lib64/python3.8/site-packages/dbus/proxies.py:72: in __call__ return self._proxy_method(*args, **keywords) /usr/lib64/python3.8/site-packages/dbus/proxies.py:141: in __call__ return self._connection.call_blocking(self._named_service, _ _ _ _ _ _ _ _ _ _ _ _ _ _ _ _ _ _ _ _ _ _ _ _ _ _ _ _ _ _ _ _ _ _ _ _ _ _ _ _ self = <dbus._dbus.SessionBus (session) at 0x7f6b4d687720> bus_name = dbus.String(':1.19'), object_path = '/org/libvirt/Test' dbus_interface = 'org.libvirt.Connect', method = 'GetCPUModelNames' signature = 'su', args = ('x86_64', 0), timeout = -1.0, byte_arrays = False kwargs = {}, get_args_opts = {'byte_arrays': False} message = <dbus.lowlevel.MethodCallMessage path: /org/libvirt/Test, iface: org.libvirt.Connect, member: GetCPUModelNames dest: :1.19> def call_blocking(self, bus_name, object_path, dbus_interface, method, signature, args, timeout=-1.0, byte_arrays=False, **kwargs): """Call the given method, synchronously. :Since: 0.81.0 """ if object_path == LOCAL_PATH: raise DBusException('Methods may not be called on the reserved ' 'path %s' % LOCAL_PATH) if dbus_interface == LOCAL_IFACE: raise DBusException('Methods may not be called on the reserved ' 'interface %s' % LOCAL_IFACE) # no need to validate other args - MethodCallMessage ctor will do get_args_opts = dict(byte_arrays=byte_arrays) if is_py2: get_args_opts['utf8_strings'] = kwargs.get('utf8_strings', False) elif 'utf8_strings' in kwargs: raise TypeError("unexpected keyword argument 'utf8_strings'") message = MethodCallMessage(destination=bus_name, path=object_path, interface=dbus_interface, method=method) # Add the arguments to the function try: message.append(signature=signature, *args) except Exception as e: logging.basicConfig() _logger.error('Unable to set arguments %r according to ' 'signature %r: %s: %s', args, signature, e.__class__, e) raise # make a blocking call > reply_message = self.send_message_with_reply_and_block( message, timeout) E dbus.exceptions.DBusException: org.libvirt.Error: XML error: failed to parse xml document '/home/jenkins/build/libvirt/share/libvirt/cpu_map/x86_Cooperlake.xml' /usr/lib64/python3.8/site-packages/dbus/connection.py:652: DBusException ----------------------------- Captured stderr call ----------------------------- I/O warning : failed to load external entity "/home/jenkins/build/libvirt/share/libvirt/cpu_map/x86_Cooperlake.xml" ===================== 1 failed, 34 passed in 10.88 seconds ===================== ------- 3/9 libvirt-dbus:unit / test_domain.py OK 6.00s --- command --- 22:24:08 VIRT_DBUS_INTERFACES_DIR='<https://ci.centos.org/job/libvirt-dbus-check/systems=libvirt-fedora-rawhide…'> abs_top_builddir='<https://ci.centos.org/job/libvirt-dbus-check/systems=libvirt-fedora-rawhide…'> <https://ci.centos.org/job/libvirt-dbus-check/systems=libvirt-fedora-rawhide…> --- stdout --- ============================= test session starts ============================== platform linux -- Python 3.8.3, pytest-4.6.10, py-1.8.0, pluggy-0.13.0 rootdir: <https://ci.centos.org/job/libvirt-dbus-check/systems=libvirt-fedora-rawhide…> collected 11 items ../tests/test_domain.py ........... [100%] ========================== 11 passed in 3.63 seconds =========================== ------- 4/9 libvirt-dbus:unit / test_snapshot.py OK 4.85s --- command --- 22:24:14 VIRT_DBUS_INTERFACES_DIR='<https://ci.centos.org/job/libvirt-dbus-check/systems=libvirt-fedora-rawhide…'> abs_top_builddir='<https://ci.centos.org/job/libvirt-dbus-check/systems=libvirt-fedora-rawhide…'> <https://ci.centos.org/job/libvirt-dbus-check/systems=libvirt-fedora-rawhide…> --- stdout --- ============================= test session starts ============================== platform linux -- Python 3.8.3, pytest-4.6.10, py-1.8.0, pluggy-0.13.0 rootdir: <https://ci.centos.org/job/libvirt-dbus-check/systems=libvirt-fedora-rawhide…> collected 6 items ../tests/test_snapshot.py ...... [100%] =========================== 6 passed in 2.64 seconds =========================== ------- 5/9 libvirt-dbus:unit / test_interface.py OK 2.26s --- command --- 22:24:19 VIRT_DBUS_INTERFACES_DIR='<https://ci.centos.org/job/libvirt-dbus-check/systems=libvirt-fedora-rawhide…'> abs_top_builddir='<https://ci.centos.org/job/libvirt-dbus-check/systems=libvirt-fedora-rawhide…'> <https://ci.centos.org/job/libvirt-dbus-check/systems=libvirt-fedora-rawhide…> --- stdout --- ============================= test session starts ============================== platform linux -- Python 3.8.3, pytest-4.6.10, py-1.8.0, pluggy-0.13.0 rootdir: <https://ci.centos.org/job/libvirt-dbus-check/systems=libvirt-fedora-rawhide…> collected 5 items ../tests/test_interface.py ..... [100%] =========================== 5 passed in 0.95 seconds =========================== ------- 6/9 libvirt-dbus:unit / test_network.py OK 2.50s --- command --- 22:24:21 VIRT_DBUS_INTERFACES_DIR='<https://ci.centos.org/job/libvirt-dbus-check/systems=libvirt-fedora-rawhide…'> abs_top_builddir='<https://ci.centos.org/job/libvirt-dbus-check/systems=libvirt-fedora-rawhide…'> <https://ci.centos.org/job/libvirt-dbus-check/systems=libvirt-fedora-rawhide…> --- stdout --- ============================= test session starts ============================== platform linux -- Python 3.8.3, pytest-4.6.10, py-1.8.0, pluggy-0.13.0 rootdir: <https://ci.centos.org/job/libvirt-dbus-check/systems=libvirt-fedora-rawhide…> collected 7 items ../tests/test_network.py ....... [100%] =========================== 7 passed in 1.35 seconds =========================== ------- 7/9 libvirt-dbus:unit / test_nodedev.py OK 1.98s --- command --- 22:24:21 VIRT_DBUS_INTERFACES_DIR='<https://ci.centos.org/job/libvirt-dbus-check/systems=libvirt-fedora-rawhide…'> abs_top_builddir='<https://ci.centos.org/job/libvirt-dbus-check/systems=libvirt-fedora-rawhide…'> <https://ci.centos.org/job/libvirt-dbus-check/systems=libvirt-fedora-rawhide…> --- stdout --- ============================= test session starts ============================== platform linux -- Python 3.8.3, pytest-4.6.10, py-1.8.0, pluggy-0.13.0 rootdir: <https://ci.centos.org/job/libvirt-dbus-check/systems=libvirt-fedora-rawhide…> collected 4 items ../tests/test_nodedev.py .... [100%] =========================== 4 passed in 0.75 seconds =========================== ------- 8/9 libvirt-dbus:unit / test_storage.py OK 4.56s --- command --- 22:24:23 VIRT_DBUS_INTERFACES_DIR='<https://ci.centos.org/job/libvirt-dbus-check/systems=libvirt-fedora-rawhide…'> abs_top_builddir='<https://ci.centos.org/job/libvirt-dbus-check/systems=libvirt-fedora-rawhide…'> <https://ci.centos.org/job/libvirt-dbus-check/systems=libvirt-fedora-rawhide…> --- stdout --- ============================= test session starts ============================== platform linux -- Python 3.8.3, pytest-4.6.10, py-1.8.0, pluggy-0.13.0 rootdir: <https://ci.centos.org/job/libvirt-dbus-check/systems=libvirt-fedora-rawhide…> collected 16 items ../tests/test_storage.py ................ [100%] ========================== 16 passed in 3.37 seconds =========================== ------- 9/9 libvirt-dbus:style / flake8 OK 3.35s --- command --- 22:24:24 /usr/bin/flake8 --show-source --ignore=E501 <https://ci.centos.org/job/libvirt-dbus-check/systems=libvirt-fedora-rawhide…> ------- Ok: 8 Expected Fail: 0 Fail: 1 Unexpected Pass: 0 Skipped: 0 Timeout: 0 + exit 1 Build step 'Execute shell' marked build as failure
1 2
0 0
Build failed in Jenkins: virt-manager-check » libvirt-fedora-rawhide #1828
by ci@centos.org 26 May '20

26 May '20
See <https://ci.centos.org/job/virt-manager-check/systems=libvirt-fedora-rawhide…> ------------------------------------------ Started by upstream project "virt-manager-check" build number 1828 originally caused by: Started by upstream project "virt-manager-build" build number 1834 originally caused by: Started by upstream project "libvirt-python-build" build number 1268 originally caused by: Started by upstream project "libvirt-build" build number 1448 originally caused by: Started by an SCM change Running as SYSTEM [EnvInject] - Loading node environment variables. Building remotely on libvirt-fedora-rawhide (libvirt) in workspace <https://ci.centos.org/job/virt-manager-check/systems=libvirt-fedora-rawhide…> [virt-manager] $ /bin/sh -xe /tmp/jenkins15807203408325273749.sh + /usr/bin/python3 ./setup.py test running test ..........................................................................I/O warning : failed to load external entity "/home/jenkins/build/libvirt/share/libvirt/cpu_map/x86_Cooperlake.xml" F...............................................................F.......................................................................................................................................................................................................................................................................................................................................................F......................................................................................sssssssssssssssss ====================================================================== FAIL: testAlterCpuMode (tests.test_xmlparse.XMLParseTest) ---------------------------------------------------------------------- Traceback (most recent call last): File "<https://ci.centos.org/job/virt-manager-check/systems=libvirt-fedora-rawhide…",> line 379, in testAlterCpuMode check("secure", True) File "<https://ci.centos.org/job/virt-manager-check/systems=libvirt-fedora-rawhide…",> line 82, in check return self._set_and_check(obj, name, initval, *args) File "<https://ci.centos.org/job/virt-manager-check/systems=libvirt-fedora-rawhide…",> line 73, in _set_and_check self.assertEqual(initval, curval) AssertionError: True != False ====================================================================== FAIL: testCLI0020virt_install_cpu_rhel7_default (tests.test_cli.CLITests) ---------------------------------------------------------------------- Traceback (most recent call last): File "<https://ci.centos.org/job/virt-manager-check/systems=libvirt-fedora-rawhide…",> line 1462, in <lambda> return lambda s: cmdtemplate(s, cmd) File "<https://ci.centos.org/job/virt-manager-check/systems=libvirt-fedora-rawhide…",> line 1461, in cmdtemplate _cmdobj.run(self) File "<https://ci.centos.org/job/virt-manager-check/systems=libvirt-fedora-rawhide…",> line 352, in run tests.fail(err) AssertionError: ./virt-install --hvm --nographics --noautoconsole --nodisks --pxe --connect __virtinst_test__test://<https://ci.centos.org/job/virt-manager-check/systems=libvirt-fedora-rawhide…>:///system,domcaps=<https://ci.centos.org/job/virt-manager-check/systems=libvirt-fedora-rawhide…> --ram 64 --print-step all Conversion outputs did not match. --- tests/data/cli/compare/virt-install-cpu-rhel7-default.xml +++ Generated Output @@ -14,8 +14,6 @@ </features> <cpu mode="custom" match="exact"> <model>Skylake-Client-IBRS</model> - <feature policy="require" name="spec-ctrl"/> - <feature policy="require" name="ssbd"/> </cpu> <clock offset="utc"> <timer name="rtc" tickpolicy="catchup"/> @@ -63,8 +61,6 @@ </features> <cpu mode="custom" match="exact"> <model>Skylake-Client-IBRS</model> - <feature policy="require" name="spec-ctrl"/> - <feature policy="require" name="ssbd"/> </cpu> <clock offset="utc"> <timer name="rtc" tickpolicy="catchup"/> ====================================================================== FAIL: testCLI0364virt_xml_edit_cpu_host_copy (tests.test_cli.CLITests) ---------------------------------------------------------------------- Traceback (most recent call last): File "<https://ci.centos.org/job/virt-manager-check/systems=libvirt-fedora-rawhide…",> line 1462, in <lambda> return lambda s: cmdtemplate(s, cmd) File "<https://ci.centos.org/job/virt-manager-check/systems=libvirt-fedora-rawhide…",> line 1461, in cmdtemplate _cmdobj.run(self) File "<https://ci.centos.org/job/virt-manager-check/systems=libvirt-fedora-rawhide…",> line 352, in run tests.fail(err) AssertionError: ./virt-xml --connect __virtinst_test__test://<https://ci.centos.org/job/virt-manager-check/systems=libvirt-fedora-rawhide…>:///system,caps=<https://ci.centos.org/job/virt-manager-check/systems=libvirt-fedora-rawhide…> test-many-devices --edit --cpu host-copy Conversion outputs did not match. --- tests/data/cli/compare/virt-xml-edit-cpu-host-copy.xml +++ Generated Output @@ -1,2 +1,3 @@ +WARNING Failed to get expanded CPU XML: XML error: failed to parse xml document '/home/jenkins/build/libvirt/share/libvirt/cpu_map/x86_Cooperlake.xml' Domain 'test-many-devices' defined successfully. Changes will take effect after the domain is fully powered off. ---------------------------------------------------------------------- Ran 586 tests in 244.332s FAILED (failures=3, skipped=17) Build step 'Execute shell' marked build as failure
1 2
0 0
Build failed in Jenkins: virt-manager-check » libvirt-fedora-32 #1828
by ci@centos.org 26 May '20

26 May '20
See <https://ci.centos.org/job/virt-manager-check/systems=libvirt-fedora-32/1828…> ------------------------------------------ Started by upstream project "virt-manager-check" build number 1828 originally caused by: Started by upstream project "virt-manager-build" build number 1834 originally caused by: Started by upstream project "libvirt-python-build" build number 1268 originally caused by: Started by upstream project "libvirt-build" build number 1448 originally caused by: Started by an SCM change Running as SYSTEM [EnvInject] - Loading node environment variables. Building remotely on libvirt-fedora-32 (libvirt) in workspace <https://ci.centos.org/job/virt-manager-check/systems=libvirt-fedora-32/ws/> [virt-manager] $ /bin/sh -xe /tmp/jenkins2974229288830947760.sh + /usr/bin/python3 ./setup.py test running test ..........................................................................I/O warning : failed to load external entity "/home/jenkins/build/libvirt/share/libvirt/cpu_map/x86_Cooperlake.xml" F...............................................................F.......................................................................................................................................................................................................................................................................................................................................................F......................................................................................sssssssssssssssss ====================================================================== FAIL: testAlterCpuMode (tests.test_xmlparse.XMLParseTest) ---------------------------------------------------------------------- Traceback (most recent call last): File "<https://ci.centos.org/job/virt-manager-check/systems=libvirt-fedora-32/ws/t…",> line 379, in testAlterCpuMode check("secure", True) File "<https://ci.centos.org/job/virt-manager-check/systems=libvirt-fedora-32/ws/t…",> line 82, in check return self._set_and_check(obj, name, initval, *args) File "<https://ci.centos.org/job/virt-manager-check/systems=libvirt-fedora-32/ws/t…",> line 73, in _set_and_check self.assertEqual(initval, curval) AssertionError: True != False ====================================================================== FAIL: testCLI0020virt_install_cpu_rhel7_default (tests.test_cli.CLITests) ---------------------------------------------------------------------- Traceback (most recent call last): File "<https://ci.centos.org/job/virt-manager-check/systems=libvirt-fedora-32/ws/t…",> line 1462, in <lambda> return lambda s: cmdtemplate(s, cmd) File "<https://ci.centos.org/job/virt-manager-check/systems=libvirt-fedora-32/ws/t…",> line 1461, in cmdtemplate _cmdobj.run(self) File "<https://ci.centos.org/job/virt-manager-check/systems=libvirt-fedora-32/ws/t…",> line 352, in run tests.fail(err) AssertionError: ./virt-install --hvm --nographics --noautoconsole --nodisks --pxe --connect __virtinst_test__test://<https://ci.centos.org/job/virt-manager-check/systems=libvirt-fedora-32/ws/t…>:///system,domcaps=<https://ci.centos.org/job/virt-manager-check/systems=libvirt-fedora-32/ws/t…> --ram 64 --print-step all Conversion outputs did not match. --- tests/data/cli/compare/virt-install-cpu-rhel7-default.xml +++ Generated Output @@ -14,8 +14,6 @@ </features> <cpu mode="custom" match="exact"> <model>Skylake-Client-IBRS</model> - <feature policy="require" name="spec-ctrl"/> - <feature policy="require" name="ssbd"/> </cpu> <clock offset="utc"> <timer name="rtc" tickpolicy="catchup"/> @@ -63,8 +61,6 @@ </features> <cpu mode="custom" match="exact"> <model>Skylake-Client-IBRS</model> - <feature policy="require" name="spec-ctrl"/> - <feature policy="require" name="ssbd"/> </cpu> <clock offset="utc"> <timer name="rtc" tickpolicy="catchup"/> ====================================================================== FAIL: testCLI0364virt_xml_edit_cpu_host_copy (tests.test_cli.CLITests) ---------------------------------------------------------------------- Traceback (most recent call last): File "<https://ci.centos.org/job/virt-manager-check/systems=libvirt-fedora-32/ws/t…",> line 1462, in <lambda> return lambda s: cmdtemplate(s, cmd) File "<https://ci.centos.org/job/virt-manager-check/systems=libvirt-fedora-32/ws/t…",> line 1461, in cmdtemplate _cmdobj.run(self) File "<https://ci.centos.org/job/virt-manager-check/systems=libvirt-fedora-32/ws/t…",> line 352, in run tests.fail(err) AssertionError: ./virt-xml --connect __virtinst_test__test://<https://ci.centos.org/job/virt-manager-check/systems=libvirt-fedora-32/ws/t…>:///system,caps=<https://ci.centos.org/job/virt-manager-check/systems=libvirt-fedora-32/ws/t…> test-many-devices --edit --cpu host-copy Conversion outputs did not match. --- tests/data/cli/compare/virt-xml-edit-cpu-host-copy.xml +++ Generated Output @@ -1,2 +1,3 @@ +WARNING Failed to get expanded CPU XML: XML error: failed to parse xml document '/home/jenkins/build/libvirt/share/libvirt/cpu_map/x86_Cooperlake.xml' Domain 'test-many-devices' defined successfully. Changes will take effect after the domain is fully powered off. ---------------------------------------------------------------------- Ran 586 tests in 255.865s FAILED (failures=3, skipped=17) Build step 'Execute shell' marked build as failure
1 2
0 0
Build failed in Jenkins: libvirt-dbus-check » libvirt-debian-9 #1157
by ci@centos.org 26 May '20

26 May '20
See <https://ci.centos.org/job/libvirt-dbus-check/systems=libvirt-debian-9/1157/…> ------------------------------------------ [...truncated 5.36 KB...] kwargs = {}, get_args_opts = {'byte_arrays': False} message = <dbus.lowlevel.MethodCallMessage path: /org/libvirt/Test, iface: org.libvirt.Connect, member: GetCPUModelNames dest: :1.19> def call_blocking(self, bus_name, object_path, dbus_interface, method, signature, args, timeout=-1.0, byte_arrays=False, **kwargs): """Call the given method, synchronously. :Since: 0.81.0 """ if object_path == LOCAL_PATH: raise DBusException('Methods may not be called on the reserved ' 'path %s' % LOCAL_PATH) if dbus_interface == LOCAL_IFACE: raise DBusException('Methods may not be called on the reserved ' 'interface %s' % LOCAL_IFACE) # no need to validate other args - MethodCallMessage ctor will do get_args_opts = dict(byte_arrays=byte_arrays) if is_py2: get_args_opts['utf8_strings'] = kwargs.get('utf8_strings', False) elif 'utf8_strings' in kwargs: raise TypeError("unexpected keyword argument 'utf8_strings'") message = MethodCallMessage(destination=bus_name, path=object_path, interface=dbus_interface, method=method) # Add the arguments to the function try: message.append(signature=signature, *args) except Exception as e: logging.basicConfig() _logger.error('Unable to set arguments %r according to ' 'signature %r: %s: %s', args, signature, e.__class__, e) raise # make a blocking call reply_message = self.send_message_with_reply_and_block( > message, timeout) E dbus.exceptions.DBusException: org.libvirt.Error: XML error: failed to parse xml document '/home/jenkins/build/libvirt/share/libvirt/cpu_map/x86_Cooperlake.xml' /usr/lib/python3/dist-packages/dbus/connection.py:651: DBusException ----------------------------- Captured stderr call ----------------------------- I/O warning : failed to load external entity "/home/jenkins/build/libvirt/share/libvirt/cpu_map/x86_Cooperlake.xml" ===================== 1 failed, 34 passed in 7.84 seconds ====================== ------- Full log written to <https://ci.centos.org/job/libvirt-dbus-check/systems=libvirt-debian-9/ws/bu…> FAILED: meson-test /usr/local/bin/meson test --no-rebuild --print-errorlogs ninja: build stopped: subcommand failed. + cat meson-logs/testlog.txt Log of Meson test suite run on 2020-05-25T22:23:58.125637 Inherited environment: ROOT_BUILD_CAUSE_SCMTRIGGER='true' LANG='en_US.UTF-8' BUILD_TAG='jenkins-libvirt-dbus-check-systems=libvirt-debian-9-1157' RUN_DISPLAY_URL='https://ci.centos.org/job/libvirt-dbus-check/systems=libvirt-debian-9/1157/…' OSINFO_SYSTEM_DIR='/home/jenkins/build/libvirt/share/osinfo' PWD='<https://ci.centos.org/job/libvirt-dbus-check/systems=libvirt-debian-9/ws/bu…'> _='/usr/bin/java' JOB_DISPLAY_URL='https://ci.centos.org/job/libvirt-dbus-check/systems=libvirt-debian-9/displ…' JENKINS_SERVER_COOKIE='f4d3a7a925dabf8a' PERL5LIB='/home/jenkins/build/libvirt/lib/perl5/x86_64-linux-gnu-thread-multi' ROOT_BUILD_CAUSE='SCMTRIGGER' LOGNAME='jenkins' BUILD_DISPLAY_NAME='#1157' HUDSON_SERVER_COOKIE='f4d3a7a925dabf8a' JENKINS_URL='https://ci.centos.org/' HUDSON_URL='https://ci.centos.org/' BUILD_CAUSE='UPSTREAMTRIGGER' BUILD_NUMBER='1157' MAKE='/usr/bin/make' GI_TYPELIB_PATH='/home/jenkins/build/libvirt/lib/x86_64-linux-gnu/girepository-1.0:/home/jenkins/build/libvirt/lib/girepository-1.0' MAKEFLAGS='-j3' EXECUTOR_NUMBER='1' NINJA='/usr/bin/ninja' systems='libvirt-debian-9' SHLVL='1' JOB_BASE_NAME='systems=libvirt-debian-9' HOME='/home/jenkins' BUILD_CAUSE_UPSTREAMTRIGGER='true' CCACHE_WRAPPERSDIR='/usr/libexec/ccache-wrappers' HUDSON_HOME='/var/lib/jenkins' RUN_CHANGES_DISPLAY_URL='https://ci.centos.org/job/libvirt-dbus-check/systems=libvirt-debian-9/1157/…' HUDSON_COOKIE='a8a67f2e-9b2d-4b1a-b49d-794214ec46dc' WORKSPACE='<https://ci.centos.org/job/libvirt-dbus-check/systems=libvirt-debian-9/ws/'> PYTHON='/usr/bin/python3' PYTHONPATH='/home/jenkins/build/libvirt/lib/python3.5/site-packages' CCACHE_MAXSIZE='2G' NODE_NAME='libvirt-debian-9' LD_LIBRARY_PATH='/home/jenkins/build/libvirt/lib/x86_64-linux-gnu:/home/jenkins/build/libvirt/lib' NODE_LABELS='libvirt libvirt-debian-9' BUILD_URL='https://ci.centos.org/job/libvirt-dbus-check/systems=libvirt-debian-9/1157/' INVOCATION_ID='1c8b2751c2c44c8285c424fb405ae43f' JOURNAL_STREAM='8:11781' PATH='/usr/libexec/ccache-wrappers:/home/jenkins/build/libvirt/bin:/usr/local/bin:/usr/bin:/bin:/usr/local/games:/usr/games' SHELL='/bin/bash' JOB_NAME='libvirt-dbus-check/systems=libvirt-debian-9' JENKINS_HOME='/var/lib/jenkins' VIRT_PREFIX='/home/jenkins/build/libvirt' USER='jenkins' XDG_DATA_DIRS='/home/jenkins/build/libvirt/share:/usr/share:/usr/local/share' C_INCLUDE_PATH='/home/jenkins/build/libvirt/include' PKG_CONFIG_PATH='/home/jenkins/build/libvirt/lib/x86_64-linux-gnu/pkgconfig:/home/jenkins/build/libvirt/lib/pkgconfig' JOB_URL='https://ci.centos.org/job/libvirt-dbus-check/systems=libvirt-debian-9/' PS1='[\u@\h \w]$ ' OLDPWD='<https://ci.centos.org/job/libvirt-dbus-check/systems=libvirt-debian-9/ws/'> BUILD_ID='1157' 1/9 libvirt-dbus:unit / test_util OK 0.09 s --- command --- <https://ci.centos.org/job/libvirt-dbus-check/systems=libvirt-debian-9/ws/bu…> ------- 2/9 libvirt-dbus:unit / test_connect.py FAIL 9.11 s (exit status 1) --- command --- abs_top_builddir='<https://ci.centos.org/job/libvirt-dbus-check/systems=libvirt-debian-9/ws/bu…'> VIRT_DBUS_INTERFACES_DIR='<https://ci.centos.org/job/libvirt-dbus-check/systems=libvirt-debian-9/ws/da…'> <https://ci.centos.org/job/libvirt-dbus-check/systems=libvirt-debian-9/ws/te…> --- stdout --- ============================= test session starts ============================== platform linux -- Python 3.5.3, pytest-3.0.6, py-1.4.32, pluggy-0.4.0 rootdir: <https://ci.centos.org/job/libvirt-dbus-check/systems=libvirt-debian-9/ws/,> inifile: collected 35 items ../tests/test_connect.py ..................F................ =================================== FAILURES =================================== _________________ TestConnect.test_connect_get_cpu_model_names _________________ self = <test_connect.TestConnect object at 0x7f82fd5705f8> def test_connect_get_cpu_model_names(self): arch = "x86_64" > assert isinstance(self.connect.GetCPUModelNames(arch, 0), dbus.Array) ../tests/test_connect.py:122: _ _ _ _ _ _ _ _ _ _ _ _ _ _ _ _ _ _ _ _ _ _ _ _ _ _ _ _ _ _ _ _ _ _ _ _ _ _ _ _ /usr/lib/python3/dist-packages/dbus/proxies.py:70: in __call__ return self._proxy_method(*args, **keywords) /usr/lib/python3/dist-packages/dbus/proxies.py:145: in __call__ **keywords) _ _ _ _ _ _ _ _ _ _ _ _ _ _ _ _ _ _ _ _ _ _ _ _ _ _ _ _ _ _ _ _ _ _ _ _ _ _ _ _ self = <dbus._dbus.SessionBus (session) at 0x7f82fd4f9ca8> bus_name = dbus.String(':1.19'), object_path = '/org/libvirt/Test' dbus_interface = 'org.libvirt.Connect', method = 'GetCPUModelNames' signature = 'su', args = ('x86_64', 0), timeout = -1.0, byte_arrays = False kwargs = {}, get_args_opts = {'byte_arrays': False} message = <dbus.lowlevel.MethodCallMessage path: /org/libvirt/Test, iface: org.libvirt.Connect, member: GetCPUModelNames dest: :1.19> def call_blocking(self, bus_name, object_path, dbus_interface, method, signature, args, timeout=-1.0, byte_arrays=False, **kwargs): """Call the given method, synchronously. :Since: 0.81.0 """ if object_path == LOCAL_PATH: raise DBusException('Methods may not be called on the reserved ' 'path %s' % LOCAL_PATH) if dbus_interface == LOCAL_IFACE: raise DBusException('Methods may not be called on the reserved ' 'interface %s' % LOCAL_IFACE) # no need to validate other args - MethodCallMessage ctor will do get_args_opts = dict(byte_arrays=byte_arrays) if is_py2: get_args_opts['utf8_strings'] = kwargs.get('utf8_strings', False) elif 'utf8_strings' in kwargs: raise TypeError("unexpected keyword argument 'utf8_strings'") message = MethodCallMessage(destination=bus_name, path=object_path, interface=dbus_interface, method=method) # Add the arguments to the function try: message.append(signature=signature, *args) except Exception as e: logging.basicConfig() _logger.error('Unable to set arguments %r according to ' 'signature %r: %s: %s', args, signature, e.__class__, e) raise # make a blocking call reply_message = self.send_message_with_reply_and_block( > message, timeout) E dbus.exceptions.DBusException: org.libvirt.Error: XML error: failed to parse xml document '/home/jenkins/build/libvirt/share/libvirt/cpu_map/x86_Cooperlake.xml' /usr/lib/python3/dist-packages/dbus/connection.py:651: DBusException ----------------------------- Captured stderr call ----------------------------- I/O warning : failed to load external entity "/home/jenkins/build/libvirt/share/libvirt/cpu_map/x86_Cooperlake.xml" ===================== 1 failed, 34 passed in 7.84 seconds ====================== ------- 3/9 libvirt-dbus:unit / test_domain.py OK 3.92 s --- command --- abs_top_builddir='<https://ci.centos.org/job/libvirt-dbus-check/systems=libvirt-debian-9/ws/bu…'> VIRT_DBUS_INTERFACES_DIR='<https://ci.centos.org/job/libvirt-dbus-check/systems=libvirt-debian-9/ws/da…'> <https://ci.centos.org/job/libvirt-dbus-check/systems=libvirt-debian-9/ws/te…> --- stdout --- ============================= test session starts ============================== platform linux -- Python 3.5.3, pytest-3.0.6, py-1.4.32, pluggy-0.4.0 rootdir: <https://ci.centos.org/job/libvirt-dbus-check/systems=libvirt-debian-9/ws/,> inifile: collected 11 items ../tests/test_domain.py ........... ========================== 11 passed in 2.62 seconds =========================== ------- 4/9 libvirt-dbus:unit / test_snapshot.py OK 2.63 s --- command --- abs_top_builddir='<https://ci.centos.org/job/libvirt-dbus-check/systems=libvirt-debian-9/ws/bu…'> VIRT_DBUS_INTERFACES_DIR='<https://ci.centos.org/job/libvirt-dbus-check/systems=libvirt-debian-9/ws/da…'> <https://ci.centos.org/job/libvirt-dbus-check/systems=libvirt-debian-9/ws/te…> --- stdout --- ============================= test session starts ============================== platform linux -- Python 3.5.3, pytest-3.0.6, py-1.4.32, pluggy-0.4.0 rootdir: <https://ci.centos.org/job/libvirt-dbus-check/systems=libvirt-debian-9/ws/,> inifile: collected 6 items ../tests/test_snapshot.py ...... =========================== 6 passed in 1.50 seconds =========================== ------- 5/9 libvirt-dbus:unit / test_interface.py OK 2.38 s --- command --- abs_top_builddir='<https://ci.centos.org/job/libvirt-dbus-check/systems=libvirt-debian-9/ws/bu…'> VIRT_DBUS_INTERFACES_DIR='<https://ci.centos.org/job/libvirt-dbus-check/systems=libvirt-debian-9/ws/da…'> <https://ci.centos.org/job/libvirt-dbus-check/systems=libvirt-debian-9/ws/te…> --- stdout --- ============================= test session starts ============================== platform linux -- Python 3.5.3, pytest-3.0.6, py-1.4.32, pluggy-0.4.0 rootdir: <https://ci.centos.org/job/libvirt-dbus-check/systems=libvirt-debian-9/ws/,> inifile: collected 5 items ../tests/test_interface.py ..... =========================== 5 passed in 1.10 seconds =========================== ------- 6/9 libvirt-dbus:unit / test_network.py OK 3.13 s --- command --- abs_top_builddir='<https://ci.centos.org/job/libvirt-dbus-check/systems=libvirt-debian-9/ws/bu…'> VIRT_DBUS_INTERFACES_DIR='<https://ci.centos.org/job/libvirt-dbus-check/systems=libvirt-debian-9/ws/da…'> <https://ci.centos.org/job/libvirt-dbus-check/systems=libvirt-debian-9/ws/te…> --- stdout --- ============================= test session starts ============================== platform linux -- Python 3.5.3, pytest-3.0.6, py-1.4.32, pluggy-0.4.0 rootdir: <https://ci.centos.org/job/libvirt-dbus-check/systems=libvirt-debian-9/ws/,> inifile: collected 7 items ../tests/test_network.py ....... =========================== 7 passed in 1.43 seconds =========================== ------- 7/9 libvirt-dbus:unit / test_nodedev.py OK 2.28 s --- command --- abs_top_builddir='<https://ci.centos.org/job/libvirt-dbus-check/systems=libvirt-debian-9/ws/bu…'> VIRT_DBUS_INTERFACES_DIR='<https://ci.centos.org/job/libvirt-dbus-check/systems=libvirt-debian-9/ws/da…'> <https://ci.centos.org/job/libvirt-dbus-check/systems=libvirt-debian-9/ws/te…> --- stdout --- ============================= test session starts ============================== platform linux -- Python 3.5.3, pytest-3.0.6, py-1.4.32, pluggy-0.4.0 rootdir: <https://ci.centos.org/job/libvirt-dbus-check/systems=libvirt-debian-9/ws/,> inifile: collected 4 items ../tests/test_nodedev.py .... =========================== 4 passed in 0.92 seconds =========================== ------- 8/9 libvirt-dbus:unit / test_storage.py OK 5.50 s --- command --- abs_top_builddir='<https://ci.centos.org/job/libvirt-dbus-check/systems=libvirt-debian-9/ws/bu…'> VIRT_DBUS_INTERFACES_DIR='<https://ci.centos.org/job/libvirt-dbus-check/systems=libvirt-debian-9/ws/da…'> <https://ci.centos.org/job/libvirt-dbus-check/systems=libvirt-debian-9/ws/te…> --- stdout --- ============================= test session starts ============================== platform linux -- Python 3.5.3, pytest-3.0.6, py-1.4.32, pluggy-0.4.0 rootdir: <https://ci.centos.org/job/libvirt-dbus-check/systems=libvirt-debian-9/ws/,> inifile: collected 16 items ../tests/test_storage.py ................ ========================== 16 passed in 4.18 seconds =========================== ------- 9/9 libvirt-dbus:style / flake8 OK 3.37 s --- command --- /usr/bin/flake8 --show-source --ignore=E501 <https://ci.centos.org/job/libvirt-dbus-check/systems=libvirt-debian-9/ws/> ------- Ok: 8 Expected Fail: 0 Fail: 1 Unexpected Pass: 0 Skipped: 0 Timeout: 0 + exit 1 Build step 'Execute shell' marked build as failure
1 2
0 0
Build failed in Jenkins: virt-manager-check » libvirt-fedora-31 #1828
by ci@centos.org 26 May '20

26 May '20
See <https://ci.centos.org/job/virt-manager-check/systems=libvirt-fedora-31/1828…> ------------------------------------------ Started by upstream project "virt-manager-check" build number 1828 originally caused by: Started by upstream project "virt-manager-build" build number 1834 originally caused by: Started by upstream project "libvirt-python-build" build number 1268 originally caused by: Started by upstream project "libvirt-build" build number 1448 originally caused by: Started by an SCM change Running as SYSTEM [EnvInject] - Loading node environment variables. Building remotely on libvirt-fedora-31 (libvirt) in workspace <https://ci.centos.org/job/virt-manager-check/systems=libvirt-fedora-31/ws/> [virt-manager] $ /bin/sh -xe /tmp/jenkins4308478179596799067.sh + /usr/bin/python3 ./setup.py test running test ..........................................................................I/O warning : failed to load external entity "/home/jenkins/build/libvirt/share/libvirt/cpu_map/x86_Cooperlake.xml" F...............................................................F.......................................................................................................................................................................................................................................................................................................................................................F......................................................................................sssssssssssssssss ====================================================================== FAIL: testAlterCpuMode (tests.test_xmlparse.XMLParseTest) ---------------------------------------------------------------------- Traceback (most recent call last): File "<https://ci.centos.org/job/virt-manager-check/systems=libvirt-fedora-31/ws/t…",> line 379, in testAlterCpuMode check("secure", True) File "<https://ci.centos.org/job/virt-manager-check/systems=libvirt-fedora-31/ws/t…",> line 82, in check return self._set_and_check(obj, name, initval, *args) File "<https://ci.centos.org/job/virt-manager-check/systems=libvirt-fedora-31/ws/t…",> line 73, in _set_and_check self.assertEqual(initval, curval) AssertionError: True != False ====================================================================== FAIL: testCLI0020virt_install_cpu_rhel7_default (tests.test_cli.CLITests) ---------------------------------------------------------------------- Traceback (most recent call last): File "<https://ci.centos.org/job/virt-manager-check/systems=libvirt-fedora-31/ws/t…",> line 1462, in <lambda> return lambda s: cmdtemplate(s, cmd) File "<https://ci.centos.org/job/virt-manager-check/systems=libvirt-fedora-31/ws/t…",> line 1461, in cmdtemplate _cmdobj.run(self) File "<https://ci.centos.org/job/virt-manager-check/systems=libvirt-fedora-31/ws/t…",> line 352, in run tests.fail(err) AssertionError: ./virt-install --hvm --nographics --noautoconsole --nodisks --pxe --connect __virtinst_test__test://<https://ci.centos.org/job/virt-manager-check/systems=libvirt-fedora-31/ws/t…>:///system,domcaps=<https://ci.centos.org/job/virt-manager-check/systems=libvirt-fedora-31/ws/t…> --ram 64 --print-step all Conversion outputs did not match. --- tests/data/cli/compare/virt-install-cpu-rhel7-default.xml +++ Generated Output @@ -14,8 +14,6 @@ </features> <cpu mode="custom" match="exact"> <model>Skylake-Client-IBRS</model> - <feature policy="require" name="spec-ctrl"/> - <feature policy="require" name="ssbd"/> </cpu> <clock offset="utc"> <timer name="rtc" tickpolicy="catchup"/> @@ -63,8 +61,6 @@ </features> <cpu mode="custom" match="exact"> <model>Skylake-Client-IBRS</model> - <feature policy="require" name="spec-ctrl"/> - <feature policy="require" name="ssbd"/> </cpu> <clock offset="utc"> <timer name="rtc" tickpolicy="catchup"/> ====================================================================== FAIL: testCLI0364virt_xml_edit_cpu_host_copy (tests.test_cli.CLITests) ---------------------------------------------------------------------- Traceback (most recent call last): File "<https://ci.centos.org/job/virt-manager-check/systems=libvirt-fedora-31/ws/t…",> line 1462, in <lambda> return lambda s: cmdtemplate(s, cmd) File "<https://ci.centos.org/job/virt-manager-check/systems=libvirt-fedora-31/ws/t…",> line 1461, in cmdtemplate _cmdobj.run(self) File "<https://ci.centos.org/job/virt-manager-check/systems=libvirt-fedora-31/ws/t…",> line 352, in run tests.fail(err) AssertionError: ./virt-xml --connect __virtinst_test__test://<https://ci.centos.org/job/virt-manager-check/systems=libvirt-fedora-31/ws/t…>:///system,caps=<https://ci.centos.org/job/virt-manager-check/systems=libvirt-fedora-31/ws/t…> test-many-devices --edit --cpu host-copy Conversion outputs did not match. --- tests/data/cli/compare/virt-xml-edit-cpu-host-copy.xml +++ Generated Output @@ -1,2 +1,3 @@ +WARNING Failed to get expanded CPU XML: XML error: failed to parse xml document '/home/jenkins/build/libvirt/share/libvirt/cpu_map/x86_Cooperlake.xml' Domain 'test-many-devices' defined successfully. Changes will take effect after the domain is fully powered off. ---------------------------------------------------------------------- Ran 586 tests in 276.272s FAILED (failures=3, skipped=17) Build step 'Execute shell' marked build as failure
1 2
0 0
Build failed in Jenkins: libvirt-dbus-check » libvirt-debian-10 #1157
by ci@centos.org 26 May '20

26 May '20
See <https://ci.centos.org/job/libvirt-dbus-check/systems=libvirt-debian-10/1157…> ------------------------------------------ [...truncated 5.38 KB...] kwargs = {}, get_args_opts = {'byte_arrays': False} message = <dbus.lowlevel.MethodCallMessage path: /org/libvirt/Test, iface: org.libvirt.Connect, member: GetCPUModelNames dest: :1.19> def call_blocking(self, bus_name, object_path, dbus_interface, method, signature, args, timeout=-1.0, byte_arrays=False, **kwargs): """Call the given method, synchronously. :Since: 0.81.0 """ if object_path == LOCAL_PATH: raise DBusException('Methods may not be called on the reserved ' 'path %s' % LOCAL_PATH) if dbus_interface == LOCAL_IFACE: raise DBusException('Methods may not be called on the reserved ' 'interface %s' % LOCAL_IFACE) # no need to validate other args - MethodCallMessage ctor will do get_args_opts = dict(byte_arrays=byte_arrays) if is_py2: get_args_opts['utf8_strings'] = kwargs.get('utf8_strings', False) elif 'utf8_strings' in kwargs: raise TypeError("unexpected keyword argument 'utf8_strings'") message = MethodCallMessage(destination=bus_name, path=object_path, interface=dbus_interface, method=method) # Add the arguments to the function try: message.append(signature=signature, *args) except Exception as e: logging.basicConfig() _logger.error('Unable to set arguments %r according to ' 'signature %r: %s: %s', args, signature, e.__class__, e) raise # make a blocking call reply_message = self.send_message_with_reply_and_block( > message, timeout) E dbus.exceptions.DBusException: org.libvirt.Error: XML error: failed to parse xml document '/home/jenkins/build/libvirt/share/libvirt/cpu_map/x86_Cooperlake.xml' /usr/lib/python3/dist-packages/dbus/connection.py:651: DBusException ----------------------------- Captured stderr call ----------------------------- I/O warning : failed to load external entity "/home/jenkins/build/libvirt/share/libvirt/cpu_map/x86_Cooperlake.xml" ===================== 1 failed, 34 passed in 7.52 seconds ====================== ------- Full log written to <https://ci.centos.org/job/libvirt-dbus-check/systems=libvirt-debian-10/ws/b…> FAILED: meson-test /usr/bin/meson test --no-rebuild --print-errorlogs ninja: build stopped: subcommand failed. + cat meson-logs/testlog.txt Log of Meson test suite run on 2020-05-25T22:23:58.428183 Inherited environment: JENKINS_HOME='/var/lib/jenkins' C_INCLUDE_PATH='/home/jenkins/build/libvirt/include' USER='jenkins' RUN_CHANGES_DISPLAY_URL='https://ci.centos.org/job/libvirt-dbus-check/systems=libvirt-debian-10/1157…' LD_LIBRARY_PATH='/home/jenkins/build/libvirt/lib/x86_64-linux-gnu:/home/jenkins/build/libvirt/lib' SHLVL='0' NODE_LABELS='libvirt libvirt-debian-10' HUDSON_URL='https://ci.centos.org/' HOME='/home/jenkins' OLDPWD='<https://ci.centos.org/job/libvirt-dbus-check/systems=libvirt-debian-10/ws/'> PYTHON='/usr/bin/python3' GI_TYPELIB_PATH='/home/jenkins/build/libvirt/lib/x86_64-linux-gnu/girepository-1.0:/home/jenkins/build/libvirt/lib/girepository-1.0' CCACHE_WRAPPERSDIR='/usr/libexec/ccache-wrappers' BUILD_URL='https://ci.centos.org/job/libvirt-dbus-check/systems=libvirt-debian-10/1157/' HUDSON_COOKIE='2a77bde7-3940-4d50-a5bd-e9e3462e00d4' JENKINS_SERVER_COOKIE='f4d3a7a925dabf8a' PS1='[\u@\h \w]$ ' OSINFO_SYSTEM_DIR='/home/jenkins/build/libvirt/share/osinfo' MAKEFLAGS='-j3' WORKSPACE='<https://ci.centos.org/job/libvirt-dbus-check/systems=libvirt-debian-10/ws/'> CCACHE_MAXSIZE='2G' LOGNAME='jenkins' NODE_NAME='libvirt-debian-10' JOURNAL_STREAM='9:13962' BUILD_CAUSE='UPSTREAMTRIGGER' _='/usr/bin/java' PKG_CONFIG_PATH='/home/jenkins/build/libvirt/lib/x86_64-linux-gnu/pkgconfig:/home/jenkins/build/libvirt/lib/pkgconfig' NINJA='/usr/bin/ninja' EXECUTOR_NUMBER='3' BUILD_DISPLAY_NAME='#1157' systems='libvirt-debian-10' BUILD_CAUSE_UPSTREAMTRIGGER='true' HUDSON_HOME='/var/lib/jenkins' JOB_BASE_NAME='systems=libvirt-debian-10' PATH='/usr/libexec/ccache-wrappers:/home/jenkins/build/libvirt/bin:/usr/local/bin:/usr/bin:/bin:/usr/local/games:/usr/games' INVOCATION_ID='e3afabfea91142e397ba00457937b0e6' BUILD_ID='1157' PERL5LIB='/home/jenkins/build/libvirt/lib/perl5/x86_64-linux-gnu-thread-multi' BUILD_TAG='jenkins-libvirt-dbus-check-systems=libvirt-debian-10-1157' ROOT_BUILD_CAUSE_SCMTRIGGER='true' JENKINS_URL='https://ci.centos.org/' LANG='en_US.UTF-8' JOB_URL='https://ci.centos.org/job/libvirt-dbus-check/systems=libvirt-debian-10/' BUILD_NUMBER='1157' SHELL='/bin/bash' RUN_DISPLAY_URL='https://ci.centos.org/job/libvirt-dbus-check/systems=libvirt-debian-10/1157…' ROOT_BUILD_CAUSE='SCMTRIGGER' HUDSON_SERVER_COOKIE='f4d3a7a925dabf8a' JOB_DISPLAY_URL='https://ci.centos.org/job/libvirt-dbus-check/systems=libvirt-debian-10/disp…' JOB_NAME='libvirt-dbus-check/systems=libvirt-debian-10' PWD='<https://ci.centos.org/job/libvirt-dbus-check/systems=libvirt-debian-10/ws/b…'> XDG_DATA_DIRS='/home/jenkins/build/libvirt/share:/usr/share:/usr/local/share' PYTHONPATH='/home/jenkins/build/libvirt/lib/python3.7/site-packages' VIRT_PREFIX='/home/jenkins/build/libvirt' MAKE='/usr/bin/make' 1/9 libvirt-dbus:unit / test_util OK 0.14 s --- command --- <https://ci.centos.org/job/libvirt-dbus-check/systems=libvirt-debian-10/ws/b…> ------- 2/9 libvirt-dbus:unit / test_connect.py FAIL 9.46 s (exit status 1) --- command --- VIRT_DBUS_INTERFACES_DIR='<https://ci.centos.org/job/libvirt-dbus-check/systems=libvirt-debian-10/ws/d…'> abs_top_builddir='<https://ci.centos.org/job/libvirt-dbus-check/systems=libvirt-debian-10/ws/b…'> <https://ci.centos.org/job/libvirt-dbus-check/systems=libvirt-debian-10/ws/t…> --- stdout --- ============================= test session starts ============================== platform linux -- Python 3.7.3, pytest-3.10.1, py-1.7.0, pluggy-0.8.0 rootdir: <https://ci.centos.org/job/libvirt-dbus-check/systems=libvirt-debian-10/ws/,> inifile: collected 35 items ../tests/test_connect.py ..................F................ [100%] =================================== FAILURES =================================== _________________ TestConnect.test_connect_get_cpu_model_names _________________ self = <test_connect.TestConnect object at 0x7fc4b84df940> def test_connect_get_cpu_model_names(self): arch = "x86_64" > assert isinstance(self.connect.GetCPUModelNames(arch, 0), dbus.Array) ../tests/test_connect.py:122: _ _ _ _ _ _ _ _ _ _ _ _ _ _ _ _ _ _ _ _ _ _ _ _ _ _ _ _ _ _ _ _ _ _ _ _ _ _ _ _ /usr/lib/python3/dist-packages/dbus/proxies.py:70: in __call__ return self._proxy_method(*args, **keywords) /usr/lib/python3/dist-packages/dbus/proxies.py:145: in __call__ **keywords) _ _ _ _ _ _ _ _ _ _ _ _ _ _ _ _ _ _ _ _ _ _ _ _ _ _ _ _ _ _ _ _ _ _ _ _ _ _ _ _ self = <dbus._dbus.SessionBus (session) at 0x7fc4b83bedb0> bus_name = dbus.String(':1.19'), object_path = '/org/libvirt/Test' dbus_interface = 'org.libvirt.Connect', method = 'GetCPUModelNames' signature = 'su', args = ('x86_64', 0), timeout = -1.0, byte_arrays = False kwargs = {}, get_args_opts = {'byte_arrays': False} message = <dbus.lowlevel.MethodCallMessage path: /org/libvirt/Test, iface: org.libvirt.Connect, member: GetCPUModelNames dest: :1.19> def call_blocking(self, bus_name, object_path, dbus_interface, method, signature, args, timeout=-1.0, byte_arrays=False, **kwargs): """Call the given method, synchronously. :Since: 0.81.0 """ if object_path == LOCAL_PATH: raise DBusException('Methods may not be called on the reserved ' 'path %s' % LOCAL_PATH) if dbus_interface == LOCAL_IFACE: raise DBusException('Methods may not be called on the reserved ' 'interface %s' % LOCAL_IFACE) # no need to validate other args - MethodCallMessage ctor will do get_args_opts = dict(byte_arrays=byte_arrays) if is_py2: get_args_opts['utf8_strings'] = kwargs.get('utf8_strings', False) elif 'utf8_strings' in kwargs: raise TypeError("unexpected keyword argument 'utf8_strings'") message = MethodCallMessage(destination=bus_name, path=object_path, interface=dbus_interface, method=method) # Add the arguments to the function try: message.append(signature=signature, *args) except Exception as e: logging.basicConfig() _logger.error('Unable to set arguments %r according to ' 'signature %r: %s: %s', args, signature, e.__class__, e) raise # make a blocking call reply_message = self.send_message_with_reply_and_block( > message, timeout) E dbus.exceptions.DBusException: org.libvirt.Error: XML error: failed to parse xml document '/home/jenkins/build/libvirt/share/libvirt/cpu_map/x86_Cooperlake.xml' /usr/lib/python3/dist-packages/dbus/connection.py:651: DBusException ----------------------------- Captured stderr call ----------------------------- I/O warning : failed to load external entity "/home/jenkins/build/libvirt/share/libvirt/cpu_map/x86_Cooperlake.xml" ===================== 1 failed, 34 passed in 7.52 seconds ====================== ------- 3/9 libvirt-dbus:unit / test_domain.py OK 5.01 s --- command --- VIRT_DBUS_INTERFACES_DIR='<https://ci.centos.org/job/libvirt-dbus-check/systems=libvirt-debian-10/ws/d…'> abs_top_builddir='<https://ci.centos.org/job/libvirt-dbus-check/systems=libvirt-debian-10/ws/b…'> <https://ci.centos.org/job/libvirt-dbus-check/systems=libvirt-debian-10/ws/t…> --- stdout --- ============================= test session starts ============================== platform linux -- Python 3.7.3, pytest-3.10.1, py-1.7.0, pluggy-0.8.0 rootdir: <https://ci.centos.org/job/libvirt-dbus-check/systems=libvirt-debian-10/ws/,> inifile: collected 11 items ../tests/test_domain.py ........... [100%] ========================== 11 passed in 3.30 seconds =========================== ------- 4/9 libvirt-dbus:unit / test_snapshot.py OK 2.43 s --- command --- VIRT_DBUS_INTERFACES_DIR='<https://ci.centos.org/job/libvirt-dbus-check/systems=libvirt-debian-10/ws/d…'> abs_top_builddir='<https://ci.centos.org/job/libvirt-dbus-check/systems=libvirt-debian-10/ws/b…'> <https://ci.centos.org/job/libvirt-dbus-check/systems=libvirt-debian-10/ws/t…> --- stdout --- ============================= test session starts ============================== platform linux -- Python 3.7.3, pytest-3.10.1, py-1.7.0, pluggy-0.8.0 rootdir: <https://ci.centos.org/job/libvirt-dbus-check/systems=libvirt-debian-10/ws/,> inifile: collected 6 items ../tests/test_snapshot.py ...... [100%] =========================== 6 passed in 1.59 seconds =========================== ------- 5/9 libvirt-dbus:unit / test_interface.py OK 2.04 s --- command --- VIRT_DBUS_INTERFACES_DIR='<https://ci.centos.org/job/libvirt-dbus-check/systems=libvirt-debian-10/ws/d…'> abs_top_builddir='<https://ci.centos.org/job/libvirt-dbus-check/systems=libvirt-debian-10/ws/b…'> <https://ci.centos.org/job/libvirt-dbus-check/systems=libvirt-debian-10/ws/t…> --- stdout --- ============================= test session starts ============================== platform linux -- Python 3.7.3, pytest-3.10.1, py-1.7.0, pluggy-0.8.0 rootdir: <https://ci.centos.org/job/libvirt-dbus-check/systems=libvirt-debian-10/ws/,> inifile: collected 5 items ../tests/test_interface.py ..... [100%] =========================== 5 passed in 1.13 seconds =========================== ------- 6/9 libvirt-dbus:unit / test_network.py OK 2.63 s --- command --- VIRT_DBUS_INTERFACES_DIR='<https://ci.centos.org/job/libvirt-dbus-check/systems=libvirt-debian-10/ws/d…'> abs_top_builddir='<https://ci.centos.org/job/libvirt-dbus-check/systems=libvirt-debian-10/ws/b…'> <https://ci.centos.org/job/libvirt-dbus-check/systems=libvirt-debian-10/ws/t…> --- stdout --- ============================= test session starts ============================== platform linux -- Python 3.7.3, pytest-3.10.1, py-1.7.0, pluggy-0.8.0 rootdir: <https://ci.centos.org/job/libvirt-dbus-check/systems=libvirt-debian-10/ws/,> inifile: collected 7 items ../tests/test_network.py ....... [100%] =========================== 7 passed in 1.74 seconds =========================== ------- 7/9 libvirt-dbus:unit / test_nodedev.py OK 1.74 s --- command --- VIRT_DBUS_INTERFACES_DIR='<https://ci.centos.org/job/libvirt-dbus-check/systems=libvirt-debian-10/ws/d…'> abs_top_builddir='<https://ci.centos.org/job/libvirt-dbus-check/systems=libvirt-debian-10/ws/b…'> <https://ci.centos.org/job/libvirt-dbus-check/systems=libvirt-debian-10/ws/t…> --- stdout --- ============================= test session starts ============================== platform linux -- Python 3.7.3, pytest-3.10.1, py-1.7.0, pluggy-0.8.0 rootdir: <https://ci.centos.org/job/libvirt-dbus-check/systems=libvirt-debian-10/ws/,> inifile: collected 4 items ../tests/test_nodedev.py .... [100%] =========================== 4 passed in 0.77 seconds =========================== ------- 8/9 libvirt-dbus:unit / test_storage.py OK 4.60 s --- command --- VIRT_DBUS_INTERFACES_DIR='<https://ci.centos.org/job/libvirt-dbus-check/systems=libvirt-debian-10/ws/d…'> abs_top_builddir='<https://ci.centos.org/job/libvirt-dbus-check/systems=libvirt-debian-10/ws/b…'> <https://ci.centos.org/job/libvirt-dbus-check/systems=libvirt-debian-10/ws/t…> --- stdout --- ============================= test session starts ============================== platform linux -- Python 3.7.3, pytest-3.10.1, py-1.7.0, pluggy-0.8.0 rootdir: <https://ci.centos.org/job/libvirt-dbus-check/systems=libvirt-debian-10/ws/,> inifile: collected 16 items ../tests/test_storage.py ................ [100%] ========================== 16 passed in 3.43 seconds =========================== ------- 9/9 libvirt-dbus:style / flake8 OK 1.66 s --- command --- /usr/bin/flake8 --show-source --ignore=E501 <https://ci.centos.org/job/libvirt-dbus-check/systems=libvirt-debian-10/ws/> ------- Ok: 8 Expected Fail: 0 Fail: 1 Unexpected Pass: 0 Skipped: 0 Timeout: 0 + exit 1 Build step 'Execute shell' marked build as failure
1 2
0 0
Build failed in Jenkins: virt-manager-check » libvirt-freebsd-12 #1828
by ci@centos.org 26 May '20

26 May '20
See <https://ci.centos.org/job/virt-manager-check/systems=libvirt-freebsd-12/182…> ------------------------------------------ Started by upstream project "virt-manager-check" build number 1828 originally caused by: Started by upstream project "virt-manager-build" build number 1834 originally caused by: Started by upstream project "libvirt-python-build" build number 1268 originally caused by: Started by upstream project "libvirt-build" build number 1448 originally caused by: Started by an SCM change Running as SYSTEM [EnvInject] - Loading node environment variables. Building remotely on libvirt-freebsd-12 (libvirt) in workspace <https://ci.centos.org/job/virt-manager-check/systems=libvirt-freebsd-12/ws/> [virt-manager] $ /bin/sh -xe /tmp/jenkins11621263307538529180.sh + /usr/local/bin/python3 ./setup.py test running test ..........................................................................I/O warning : failed to load external entity "/home/jenkins/build/libvirt/share/libvirt/cpu_map/x86_Cooperlake.xml" F...............................................................F........................................................................GLib-GIO-Message: 22:17:01.758: Using the 'memory' GSettings backend. Your settings will not be saved or shared with other applications. ...............................................................................................................................................................................................................................................................................F......................................................................................sssssssssssssssss ====================================================================== FAIL: testAlterCpuMode (tests.test_xmlparse.XMLParseTest) ---------------------------------------------------------------------- Traceback (most recent call last): File "/usr<https://ci.centos.org/job/virt-manager-check/systems=libvirt-freebsd-12/ws/…",> line 379, in testAlterCpuMode check("secure", True) File "/usr<https://ci.centos.org/job/virt-manager-check/systems=libvirt-freebsd-12/ws/…",> line 82, in check return self._set_and_check(obj, name, initval, *args) File "/usr<https://ci.centos.org/job/virt-manager-check/systems=libvirt-freebsd-12/ws/…",> line 73, in _set_and_check self.assertEqual(initval, curval) AssertionError: True != False ====================================================================== FAIL: testCLI0020virt_install_cpu_rhel7_default (tests.test_cli.CLITests) ---------------------------------------------------------------------- Traceback (most recent call last): File "/usr<https://ci.centos.org/job/virt-manager-check/systems=libvirt-freebsd-12/ws/…",> line 1462, in <lambda> return lambda s: cmdtemplate(s, cmd) File "/usr<https://ci.centos.org/job/virt-manager-check/systems=libvirt-freebsd-12/ws/…",> line 1461, in cmdtemplate _cmdobj.run(self) File "/usr<https://ci.centos.org/job/virt-manager-check/systems=libvirt-freebsd-12/ws/…",> line 352, in run tests.fail(err) AssertionError: ./virt-install --hvm --nographics --noautoconsole --nodisks --pxe --connect __virtinst_test__test:///usr<https://ci.centos.org/job/virt-manager-check/systems=libvirt-freebsd-12/ws/…>:///system,domcaps=/usr<https://ci.centos.org/job/virt-manager-check/systems=libvirt-freebsd-12/ws/…> --ram 64 --print-step all Conversion outputs did not match. --- tests/data/cli/compare/virt-install-cpu-rhel7-default.xml +++ Generated Output @@ -14,8 +14,6 @@ </features> <cpu mode="custom" match="exact"> <model>Skylake-Client-IBRS</model> - <feature policy="require" name="spec-ctrl"/> - <feature policy="require" name="ssbd"/> </cpu> <clock offset="utc"> <timer name="rtc" tickpolicy="catchup"/> @@ -63,8 +61,6 @@ </features> <cpu mode="custom" match="exact"> <model>Skylake-Client-IBRS</model> - <feature policy="require" name="spec-ctrl"/> - <feature policy="require" name="ssbd"/> </cpu> <clock offset="utc"> <timer name="rtc" tickpolicy="catchup"/> ====================================================================== FAIL: testCLI0364virt_xml_edit_cpu_host_copy (tests.test_cli.CLITests) ---------------------------------------------------------------------- Traceback (most recent call last): File "/usr<https://ci.centos.org/job/virt-manager-check/systems=libvirt-freebsd-12/ws/…",> line 1462, in <lambda> return lambda s: cmdtemplate(s, cmd) File "/usr<https://ci.centos.org/job/virt-manager-check/systems=libvirt-freebsd-12/ws/…",> line 1461, in cmdtemplate _cmdobj.run(self) File "/usr<https://ci.centos.org/job/virt-manager-check/systems=libvirt-freebsd-12/ws/…",> line 352, in run tests.fail(err) AssertionError: ./virt-xml --connect __virtinst_test__test:///usr<https://ci.centos.org/job/virt-manager-check/systems=libvirt-freebsd-12/ws/…>:///system,caps=/usr<https://ci.centos.org/job/virt-manager-check/systems=libvirt-freebsd-12/ws/…> test-many-devices --edit --cpu host-copy Conversion outputs did not match. --- tests/data/cli/compare/virt-xml-edit-cpu-host-copy.xml +++ Generated Output @@ -1,2 +1,3 @@ +WARNING Failed to get expanded CPU XML: XML error: failed to parse xml document '/home/jenkins/build/libvirt/share/libvirt/cpu_map/x86_Cooperlake.xml' Domain 'test-many-devices' defined successfully. Changes will take effect after the domain is fully powered off. ---------------------------------------------------------------------- Ran 586 tests in 169.153s FAILED (failures=3, skipped=17) Build step 'Execute shell' marked build as failure
1 2
0 0
  • ← Newer
  • 1
  • 2
  • 3
  • 4
  • 5
  • 6
  • 7
  • 8
  • Older →

HyperKitty Powered by HyperKitty version 1.3.12.