libvirt List Archives
Sign In Sign Up
Manage this list Sign In Sign Up

Keyboard Shortcuts

Thread View

  • j: Next unread message
  • k: Previous unread message
  • j a: Jump to all threads
  • j l: Jump to MailingList overview

CI

Thread Start a new thread
Download
Threads by month
  • ----- 2025 -----
  • August
  • July
  • June
  • May
  • April
  • March
  • February
  • January
  • ----- 2024 -----
  • December
  • November
  • October
  • September
  • August
  • July
  • June
  • May
  • April
  • March
  • February
  • January
  • ----- 2023 -----
  • December
  • November
  • October
  • September
  • August
  • July
  • June
  • May
  • April
  • March
  • February
  • January
  • ----- 2022 -----
  • December
  • November
  • October
  • September
  • August
  • July
  • June
  • May
  • April
  • March
  • February
  • January
  • ----- 2021 -----
  • December
  • November
  • October
  • September
  • August
  • July
  • June
  • May
  • April
  • March
  • February
  • January
  • ----- 2020 -----
  • December
  • November
  • October
  • September
  • August
  • July
  • June
  • May
  • April
  • March
  • February
  • January
  • ----- 2019 -----
  • December
  • November
  • October
  • September
  • August
  • July
  • June
  • May
  • April
  • March
  • February
  • January
  • ----- 2018 -----
  • December
  • November
  • October
  • September
  • August
  • July
  • June
  • May
  • April
  • March
  • February
  • January
  • ----- 2017 -----
  • December
  • November
  • October
  • September
  • August
  • July
  • June
  • May
  • April
  • March
  • February
  • January
  • ----- 2016 -----
  • December
  • November
  • October
  • September
  • August
  • July
ci@lists.libvirt.org

May 2020

  • 3 participants
  • 80 discussions
Build failed in Jenkins: virt-manager-check » libvirt-freebsd-11 #1828
by ci@centos.org 26 May '20

26 May '20
See <https://ci.centos.org/job/virt-manager-check/systems=libvirt-freebsd-11/182…> ------------------------------------------ Started by upstream project "virt-manager-check" build number 1828 originally caused by: Started by upstream project "virt-manager-build" build number 1834 originally caused by: Started by upstream project "libvirt-python-build" build number 1268 originally caused by: Started by upstream project "libvirt-build" build number 1448 originally caused by: Started by an SCM change Running as SYSTEM [EnvInject] - Loading node environment variables. Building remotely on libvirt-freebsd-11 (libvirt) in workspace <https://ci.centos.org/job/virt-manager-check/systems=libvirt-freebsd-11/ws/> [virt-manager] $ /bin/sh -xe /tmp/jenkins10724001891934307237.sh + /usr/local/bin/python3 ./setup.py test running test ..........................................................................I/O warning : failed to load external entity "/home/jenkins/build/libvirt/share/libvirt/cpu_map/x86_Cooperlake.xml" F...............................................................F........................................................................GLib-GIO-Message: 22:16:58.935: Using the 'memory' GSettings backend. Your settings will not be saved or shared with other applications. ...............................................................................................................................................................................................................................................................................F......................................................................................sssssssssssssssss ====================================================================== FAIL: testAlterCpuMode (tests.test_xmlparse.XMLParseTest) ---------------------------------------------------------------------- Traceback (most recent call last): File "/usr<https://ci.centos.org/job/virt-manager-check/systems=libvirt-freebsd-11/ws/…",> line 379, in testAlterCpuMode check("secure", True) File "/usr<https://ci.centos.org/job/virt-manager-check/systems=libvirt-freebsd-11/ws/…",> line 82, in check return self._set_and_check(obj, name, initval, *args) File "/usr<https://ci.centos.org/job/virt-manager-check/systems=libvirt-freebsd-11/ws/…",> line 73, in _set_and_check self.assertEqual(initval, curval) AssertionError: True != False ====================================================================== FAIL: testCLI0020virt_install_cpu_rhel7_default (tests.test_cli.CLITests) ---------------------------------------------------------------------- Traceback (most recent call last): File "/usr<https://ci.centos.org/job/virt-manager-check/systems=libvirt-freebsd-11/ws/…",> line 1462, in <lambda> return lambda s: cmdtemplate(s, cmd) File "/usr<https://ci.centos.org/job/virt-manager-check/systems=libvirt-freebsd-11/ws/…",> line 1461, in cmdtemplate _cmdobj.run(self) File "/usr<https://ci.centos.org/job/virt-manager-check/systems=libvirt-freebsd-11/ws/…",> line 352, in run tests.fail(err) AssertionError: ./virt-install --hvm --nographics --noautoconsole --nodisks --pxe --connect __virtinst_test__test:///usr<https://ci.centos.org/job/virt-manager-check/systems=libvirt-freebsd-11/ws/…>:///system,domcaps=/usr<https://ci.centos.org/job/virt-manager-check/systems=libvirt-freebsd-11/ws/…> --ram 64 --print-step all Conversion outputs did not match. --- tests/data/cli/compare/virt-install-cpu-rhel7-default.xml +++ Generated Output @@ -14,8 +14,6 @@ </features> <cpu mode="custom" match="exact"> <model>Skylake-Client-IBRS</model> - <feature policy="require" name="spec-ctrl"/> - <feature policy="require" name="ssbd"/> </cpu> <clock offset="utc"> <timer name="rtc" tickpolicy="catchup"/> @@ -63,8 +61,6 @@ </features> <cpu mode="custom" match="exact"> <model>Skylake-Client-IBRS</model> - <feature policy="require" name="spec-ctrl"/> - <feature policy="require" name="ssbd"/> </cpu> <clock offset="utc"> <timer name="rtc" tickpolicy="catchup"/> ====================================================================== FAIL: testCLI0364virt_xml_edit_cpu_host_copy (tests.test_cli.CLITests) ---------------------------------------------------------------------- Traceback (most recent call last): File "/usr<https://ci.centos.org/job/virt-manager-check/systems=libvirt-freebsd-11/ws/…",> line 1462, in <lambda> return lambda s: cmdtemplate(s, cmd) File "/usr<https://ci.centos.org/job/virt-manager-check/systems=libvirt-freebsd-11/ws/…",> line 1461, in cmdtemplate _cmdobj.run(self) File "/usr<https://ci.centos.org/job/virt-manager-check/systems=libvirt-freebsd-11/ws/…",> line 352, in run tests.fail(err) AssertionError: ./virt-xml --connect __virtinst_test__test:///usr<https://ci.centos.org/job/virt-manager-check/systems=libvirt-freebsd-11/ws/…>:///system,caps=/usr<https://ci.centos.org/job/virt-manager-check/systems=libvirt-freebsd-11/ws/…> test-many-devices --edit --cpu host-copy Conversion outputs did not match. --- tests/data/cli/compare/virt-xml-edit-cpu-host-copy.xml +++ Generated Output @@ -1,2 +1,3 @@ +WARNING Failed to get expanded CPU XML: XML error: failed to parse xml document '/home/jenkins/build/libvirt/share/libvirt/cpu_map/x86_Cooperlake.xml' Domain 'test-many-devices' defined successfully. Changes will take effect after the domain is fully powered off. ---------------------------------------------------------------------- Ran 586 tests in 171.171s FAILED (failures=3, skipped=17) Build step 'Execute shell' marked build as failure
1 2
0 0
Build failed in Jenkins: virt-manager-check » libvirt-debian-9 #1828
by ci@centos.org 26 May '20

26 May '20
See <https://ci.centos.org/job/virt-manager-check/systems=libvirt-debian-9/1828/…> ------------------------------------------ Started by upstream project "virt-manager-check" build number 1828 originally caused by: Started by upstream project "virt-manager-build" build number 1834 originally caused by: Started by upstream project "libvirt-python-build" build number 1268 originally caused by: Started by upstream project "libvirt-build" build number 1448 originally caused by: Started by an SCM change Running as SYSTEM [EnvInject] - Loading node environment variables. Building remotely on libvirt-debian-9 (libvirt) in workspace <https://ci.centos.org/job/virt-manager-check/systems=libvirt-debian-9/ws/> [virt-manager] $ /bin/sh -xe /tmp/jenkins9160536125034728076.sh + /usr/bin/python3 ./setup.py test running test ..........................................................................I/O warning : failed to load external entity "/home/jenkins/build/libvirt/share/libvirt/cpu_map/x86_Cooperlake.xml" F...............................................................F.......................................................................................................................................................................................................................................................................................................................................................F......................................................................................sssssssssssssssss ====================================================================== FAIL: testAlterCpuMode (tests.test_xmlparse.XMLParseTest) ---------------------------------------------------------------------- Traceback (most recent call last): File "<https://ci.centos.org/job/virt-manager-check/systems=libvirt-debian-9/ws/te…",> line 379, in testAlterCpuMode check("secure", True) File "<https://ci.centos.org/job/virt-manager-check/systems=libvirt-debian-9/ws/te…",> line 82, in check return self._set_and_check(obj, name, initval, *args) File "<https://ci.centos.org/job/virt-manager-check/systems=libvirt-debian-9/ws/te…",> line 73, in _set_and_check self.assertEqual(initval, curval) AssertionError: True != False ====================================================================== FAIL: testCLI0020virt_install_cpu_rhel7_default (tests.test_cli.CLITests) ---------------------------------------------------------------------- Traceback (most recent call last): File "<https://ci.centos.org/job/virt-manager-check/systems=libvirt-debian-9/ws/te…",> line 1462, in <lambda> return lambda s: cmdtemplate(s, cmd) File "<https://ci.centos.org/job/virt-manager-check/systems=libvirt-debian-9/ws/te…",> line 1461, in cmdtemplate _cmdobj.run(self) File "<https://ci.centos.org/job/virt-manager-check/systems=libvirt-debian-9/ws/te…",> line 352, in run tests.fail(err) AssertionError: ./virt-install --hvm --nographics --noautoconsole --nodisks --pxe --connect __virtinst_test__test://<https://ci.centos.org/job/virt-manager-check/systems=libvirt-debian-9/ws/te…>:///system,domcaps=<https://ci.centos.org/job/virt-manager-check/systems=libvirt-debian-9/ws/te…> --ram 64 --print-step all Conversion outputs did not match. --- tests/data/cli/compare/virt-install-cpu-rhel7-default.xml +++ Generated Output @@ -14,8 +14,6 @@ </features> <cpu mode="custom" match="exact"> <model>Skylake-Client-IBRS</model> - <feature policy="require" name="spec-ctrl"/> - <feature policy="require" name="ssbd"/> </cpu> <clock offset="utc"> <timer name="rtc" tickpolicy="catchup"/> @@ -63,8 +61,6 @@ </features> <cpu mode="custom" match="exact"> <model>Skylake-Client-IBRS</model> - <feature policy="require" name="spec-ctrl"/> - <feature policy="require" name="ssbd"/> </cpu> <clock offset="utc"> <timer name="rtc" tickpolicy="catchup"/> ====================================================================== FAIL: testCLI0364virt_xml_edit_cpu_host_copy (tests.test_cli.CLITests) ---------------------------------------------------------------------- Traceback (most recent call last): File "<https://ci.centos.org/job/virt-manager-check/systems=libvirt-debian-9/ws/te…",> line 1462, in <lambda> return lambda s: cmdtemplate(s, cmd) File "<https://ci.centos.org/job/virt-manager-check/systems=libvirt-debian-9/ws/te…",> line 1461, in cmdtemplate _cmdobj.run(self) File "<https://ci.centos.org/job/virt-manager-check/systems=libvirt-debian-9/ws/te…",> line 352, in run tests.fail(err) AssertionError: ./virt-xml --connect __virtinst_test__test://<https://ci.centos.org/job/virt-manager-check/systems=libvirt-debian-9/ws/te…>:///system,caps=<https://ci.centos.org/job/virt-manager-check/systems=libvirt-debian-9/ws/te…> test-many-devices --edit --cpu host-copy Conversion outputs did not match. --- tests/data/cli/compare/virt-xml-edit-cpu-host-copy.xml +++ Generated Output @@ -1,2 +1,3 @@ +WARNING Failed to get expanded CPU XML: XML error: failed to parse xml document '/home/jenkins/build/libvirt/share/libvirt/cpu_map/x86_Cooperlake.xml' Domain 'test-many-devices' defined successfully. Changes will take effect after the domain is fully powered off. ---------------------------------------------------------------------- Ran 586 tests in 126.206s FAILED (failures=3, skipped=17) Build step 'Execute shell' marked build as failure
1 2
0 0
Build failed in Jenkins: virt-manager-check » libvirt-debian-10 #1828
by ci@centos.org 26 May '20

26 May '20
See <https://ci.centos.org/job/virt-manager-check/systems=libvirt-debian-10/1828…> ------------------------------------------ Started by upstream project "virt-manager-check" build number 1828 originally caused by: Started by upstream project "virt-manager-build" build number 1834 originally caused by: Started by upstream project "libvirt-python-build" build number 1268 originally caused by: Started by upstream project "libvirt-build" build number 1448 originally caused by: Started by an SCM change Running as SYSTEM [EnvInject] - Loading node environment variables. Building remotely on libvirt-debian-10 (libvirt) in workspace <https://ci.centos.org/job/virt-manager-check/systems=libvirt-debian-10/ws/> [virt-manager] $ /bin/sh -xe /tmp/jenkins16324035865291348999.sh + /usr/bin/python3 ./setup.py test running test ..........................................................................I/O warning : failed to load external entity "/home/jenkins/build/libvirt/share/libvirt/cpu_map/x86_Cooperlake.xml" F...............................................................F.......................................................................................................................................................................................................................................................................................................................................................F......................................................................................sssssssssssssssss ====================================================================== FAIL: testAlterCpuMode (tests.test_xmlparse.XMLParseTest) ---------------------------------------------------------------------- Traceback (most recent call last): File "<https://ci.centos.org/job/virt-manager-check/systems=libvirt-debian-10/ws/t…",> line 379, in testAlterCpuMode check("secure", True) File "<https://ci.centos.org/job/virt-manager-check/systems=libvirt-debian-10/ws/t…",> line 82, in check return self._set_and_check(obj, name, initval, *args) File "<https://ci.centos.org/job/virt-manager-check/systems=libvirt-debian-10/ws/t…",> line 73, in _set_and_check self.assertEqual(initval, curval) AssertionError: True != False ====================================================================== FAIL: testCLI0020virt_install_cpu_rhel7_default (tests.test_cli.CLITests) ---------------------------------------------------------------------- Traceback (most recent call last): File "<https://ci.centos.org/job/virt-manager-check/systems=libvirt-debian-10/ws/t…",> line 1462, in <lambda> return lambda s: cmdtemplate(s, cmd) File "<https://ci.centos.org/job/virt-manager-check/systems=libvirt-debian-10/ws/t…",> line 1461, in cmdtemplate _cmdobj.run(self) File "<https://ci.centos.org/job/virt-manager-check/systems=libvirt-debian-10/ws/t…",> line 352, in run tests.fail(err) AssertionError: ./virt-install --hvm --nographics --noautoconsole --nodisks --pxe --connect __virtinst_test__test://<https://ci.centos.org/job/virt-manager-check/systems=libvirt-debian-10/ws/t…>:///system,domcaps=<https://ci.centos.org/job/virt-manager-check/systems=libvirt-debian-10/ws/t…> --ram 64 --print-step all Conversion outputs did not match. --- tests/data/cli/compare/virt-install-cpu-rhel7-default.xml +++ Generated Output @@ -14,8 +14,6 @@ </features> <cpu mode="custom" match="exact"> <model>Skylake-Client-IBRS</model> - <feature policy="require" name="spec-ctrl"/> - <feature policy="require" name="ssbd"/> </cpu> <clock offset="utc"> <timer name="rtc" tickpolicy="catchup"/> @@ -63,8 +61,6 @@ </features> <cpu mode="custom" match="exact"> <model>Skylake-Client-IBRS</model> - <feature policy="require" name="spec-ctrl"/> - <feature policy="require" name="ssbd"/> </cpu> <clock offset="utc"> <timer name="rtc" tickpolicy="catchup"/> ====================================================================== FAIL: testCLI0364virt_xml_edit_cpu_host_copy (tests.test_cli.CLITests) ---------------------------------------------------------------------- Traceback (most recent call last): File "<https://ci.centos.org/job/virt-manager-check/systems=libvirt-debian-10/ws/t…",> line 1462, in <lambda> return lambda s: cmdtemplate(s, cmd) File "<https://ci.centos.org/job/virt-manager-check/systems=libvirt-debian-10/ws/t…",> line 1461, in cmdtemplate _cmdobj.run(self) File "<https://ci.centos.org/job/virt-manager-check/systems=libvirt-debian-10/ws/t…",> line 352, in run tests.fail(err) AssertionError: ./virt-xml --connect __virtinst_test__test://<https://ci.centos.org/job/virt-manager-check/systems=libvirt-debian-10/ws/t…>:///system,caps=<https://ci.centos.org/job/virt-manager-check/systems=libvirt-debian-10/ws/t…> test-many-devices --edit --cpu host-copy Conversion outputs did not match. --- tests/data/cli/compare/virt-xml-edit-cpu-host-copy.xml +++ Generated Output @@ -1,2 +1,3 @@ +WARNING Failed to get expanded CPU XML: XML error: failed to parse xml document '/home/jenkins/build/libvirt/share/libvirt/cpu_map/x86_Cooperlake.xml' Domain 'test-many-devices' defined successfully. Changes will take effect after the domain is fully powered off. ---------------------------------------------------------------------- Ran 586 tests in 76.439s FAILED (failures=3, skipped=17) Build step 'Execute shell' marked build as failure
1 2
0 0
Build failed in Jenkins: libvirt-perl-check » libvirt-fedora-rawhide #1247
by ci@centos.org 26 May '20

26 May '20
See <https://ci.centos.org/job/libvirt-perl-check/systems=libvirt-fedora-rawhide…> ------------------------------------------ Started by upstream project "libvirt-perl-check" build number 1247 originally caused by: Started by upstream project "libvirt-perl-build" build number 1250 originally caused by: Started by upstream project "libvirt-build" build number 1448 originally caused by: Started by an SCM change Running as SYSTEM [EnvInject] - Loading node environment variables. Building remotely on libvirt-fedora-rawhide (libvirt) in workspace <https://ci.centos.org/job/libvirt-perl-check/systems=libvirt-fedora-rawhide…> [libvirt-perl] $ /bin/sh -xe /tmp/jenkins3426048904921741552.sh + export TEST_MAINTAINER=1 + TEST_MAINTAINER=1 + perl Build test t/005-pod.t ............ ok t/010-pod-coverage.t ... ok t/015-changes.t ........ ok t/020-constants.t ...... ok t/030-api-coverage.t ... ok I/O warning : failed to load external entity "/home/jenkins/build/libvirt/share/libvirt/cpu_map/x86_Cooperlake.xml" libvirt error code: 27, message: XML error: failed to parse xml document '/home/jenkins/build/libvirt/share/libvirt/cpu_map/x86_Cooperlake.xml' # Looks like your test exited with 2 just after 24. t/100-connect.t ........ Dubious, test returned 2 (wstat 512, 0x200) Failed 1/25 subtests (less 1 skipped subtest: 23 okay) t/200-domains.t ........ ok t/300-networks.t ....... ok t/400-storage-pools.t .. ok t/500-storage-vols.t ... ok t/600-interfaces.t ..... ok t/800-events.t ......... ok Test Summary Report ------------------- t/100-connect.t (Wstat: 512 Tests: 24 Failed: 0) Non-zero exit status: 2 Parse errors: Bad plan. You planned 25 tests but ran 24. Files=12, Tests=2012, 32 wallclock secs ( 0.40 usr 0.06 sys + 7.88 cusr 0.57 csys = 8.91 CPU) Result: FAIL Failed 1/12 test programs. 0/2012 subtests failed. Build step 'Execute shell' marked build as failure
1 2
0 0
Build failed in Jenkins: libvirt-perl-check » libvirt-debian-9 #1247
by ci@centos.org 26 May '20

26 May '20
See <https://ci.centos.org/job/libvirt-perl-check/systems=libvirt-debian-9/1247/…> ------------------------------------------ Started by upstream project "libvirt-perl-check" build number 1247 originally caused by: Started by upstream project "libvirt-perl-build" build number 1250 originally caused by: Started by upstream project "libvirt-build" build number 1448 originally caused by: Started by an SCM change Running as SYSTEM [EnvInject] - Loading node environment variables. Building remotely on libvirt-debian-9 (libvirt) in workspace <https://ci.centos.org/job/libvirt-perl-check/systems=libvirt-debian-9/ws/> [libvirt-perl] $ /bin/sh -xe /tmp/jenkins7743381388686374507.sh + export TEST_MAINTAINER=1 + perl Build test t/005-pod.t ............ ok t/010-pod-coverage.t ... ok t/015-changes.t ........ ok t/020-constants.t ...... ok t/030-api-coverage.t ... ok I/O warning : failed to load external entity "/home/jenkins/build/libvirt/share/libvirt/cpu_map/x86_Cooperlake.xml" libvirt error code: 27, message: XML error: failed to parse xml document '/home/jenkins/build/libvirt/share/libvirt/cpu_map/x86_Cooperlake.xml' # Looks like you planned 25 tests but ran 24. # Looks like your test exited with 2 just after 24. t/100-connect.t ........ Dubious, test returned 2 (wstat 512, 0x200) Failed 1/25 subtests (less 1 skipped subtest: 23 okay) t/200-domains.t ........ ok t/300-networks.t ....... ok t/400-storage-pools.t .. ok t/500-storage-vols.t ... ok t/600-interfaces.t ..... ok t/800-events.t ......... ok Test Summary Report ------------------- t/100-connect.t (Wstat: 512 Tests: 24 Failed: 0) Non-zero exit status: 2 Parse errors: Bad plan. You planned 25 tests but ran 24. Files=12, Tests=2012, 52 wallclock secs ( 0.72 usr 0.08 sys + 14.35 cusr 0.68 csys = 15.83 CPU) Result: FAIL Failed 1/12 test programs. 0/2012 subtests failed. Build step 'Execute shell' marked build as failure
1 2
0 0
Build failed in Jenkins: libvirt-perl-check » libvirt-fedora-31 #1247
by ci@centos.org 26 May '20

26 May '20
See <https://ci.centos.org/job/libvirt-perl-check/systems=libvirt-fedora-31/1247…> ------------------------------------------ Started by upstream project "libvirt-perl-check" build number 1247 originally caused by: Started by upstream project "libvirt-perl-build" build number 1250 originally caused by: Started by upstream project "libvirt-build" build number 1448 originally caused by: Started by an SCM change Running as SYSTEM [EnvInject] - Loading node environment variables. Building remotely on libvirt-fedora-31 (libvirt) in workspace <https://ci.centos.org/job/libvirt-perl-check/systems=libvirt-fedora-31/ws/> [libvirt-perl] $ /bin/sh -xe /tmp/jenkins6063070798825716863.sh + export TEST_MAINTAINER=1 + TEST_MAINTAINER=1 + perl Build test t/005-pod.t ............ ok t/010-pod-coverage.t ... ok t/015-changes.t ........ ok t/020-constants.t ...... ok t/030-api-coverage.t ... ok I/O warning : failed to load external entity "/home/jenkins/build/libvirt/share/libvirt/cpu_map/x86_Cooperlake.xml" libvirt error code: 27, message: XML error: failed to parse xml document '/home/jenkins/build/libvirt/share/libvirt/cpu_map/x86_Cooperlake.xml' # Looks like your test exited with 2 just after 24. t/100-connect.t ........ Dubious, test returned 2 (wstat 512, 0x200) Failed 1/25 subtests (less 1 skipped subtest: 23 okay) t/200-domains.t ........ ok t/300-networks.t ....... ok t/400-storage-pools.t .. ok t/500-storage-vols.t ... ok t/600-interfaces.t ..... ok t/800-events.t ......... ok Test Summary Report ------------------- t/100-connect.t (Wstat: 512 Tests: 24 Failed: 0) Non-zero exit status: 2 Parse errors: Bad plan. You planned 25 tests but ran 24. Files=12, Tests=2012, 89 wallclock secs ( 0.54 usr 0.08 sys + 8.85 cusr 0.66 csys = 10.13 CPU) Result: FAIL Failed 1/12 test programs. 0/2012 subtests failed. Build step 'Execute shell' marked build as failure
1 2
0 0
Build failed in Jenkins: libvirt-perl-check » libvirt-fedora-32 #1247
by ci@centos.org 26 May '20

26 May '20
See <https://ci.centos.org/job/libvirt-perl-check/systems=libvirt-fedora-32/1247…> ------------------------------------------ Started by upstream project "libvirt-perl-check" build number 1247 originally caused by: Started by upstream project "libvirt-perl-build" build number 1250 originally caused by: Started by upstream project "libvirt-build" build number 1448 originally caused by: Started by an SCM change Running as SYSTEM [EnvInject] - Loading node environment variables. Building remotely on libvirt-fedora-32 (libvirt) in workspace <https://ci.centos.org/job/libvirt-perl-check/systems=libvirt-fedora-32/ws/> [libvirt-perl] $ /bin/sh -xe /tmp/jenkins774697926335036910.sh + export TEST_MAINTAINER=1 + TEST_MAINTAINER=1 + perl Build test t/005-pod.t ............ ok t/010-pod-coverage.t ... ok t/015-changes.t ........ ok t/020-constants.t ...... ok t/030-api-coverage.t ... ok I/O warning : failed to load external entity "/home/jenkins/build/libvirt/share/libvirt/cpu_map/x86_Cooperlake.xml" libvirt error code: 27, message: XML error: failed to parse xml document '/home/jenkins/build/libvirt/share/libvirt/cpu_map/x86_Cooperlake.xml' # Looks like your test exited with 2 just after 24. t/100-connect.t ........ Dubious, test returned 2 (wstat 512, 0x200) Failed 1/25 subtests (less 1 skipped subtest: 23 okay) t/200-domains.t ........ ok t/300-networks.t ....... ok t/400-storage-pools.t .. ok t/500-storage-vols.t ... ok t/600-interfaces.t ..... ok t/800-events.t ......... ok Test Summary Report ------------------- t/100-connect.t (Wstat: 512 Tests: 24 Failed: 0) Non-zero exit status: 2 Parse errors: Bad plan. You planned 25 tests but ran 24. Files=12, Tests=2012, 85 wallclock secs ( 0.46 usr 0.08 sys + 9.10 cusr 0.66 csys = 10.30 CPU) Result: FAIL Failed 1/12 test programs. 0/2012 subtests failed. Build step 'Execute shell' marked build as failure
1 2
0 0
Build failed in Jenkins: libvirt-perl-check » libvirt-centos-7 #1247
by ci@centos.org 26 May '20

26 May '20
See <https://ci.centos.org/job/libvirt-perl-check/systems=libvirt-centos-7/1247/…> ------------------------------------------ Started by upstream project "libvirt-perl-check" build number 1247 originally caused by: Started by upstream project "libvirt-perl-build" build number 1250 originally caused by: Started by upstream project "libvirt-build" build number 1448 originally caused by: Started by an SCM change Running as SYSTEM [EnvInject] - Loading node environment variables. Building remotely on libvirt-centos-7 (libvirt) in workspace <https://ci.centos.org/job/libvirt-perl-check/systems=libvirt-centos-7/ws/> [libvirt-perl] $ /bin/sh -xe /tmp/jenkins2962042700076546597.sh + export TEST_MAINTAINER=1 + TEST_MAINTAINER=1 + perl Build test t/005-pod.t ............ ok t/010-pod-coverage.t ... ok t/015-changes.t ........ ok t/020-constants.t ...... ok t/030-api-coverage.t ... ok I/O warning : failed to load external entity "/home/jenkins/build/libvirt/share/libvirt/cpu_map/x86_Cooperlake.xml" libvirt error code: 27, message: XML error: failed to parse xml document '/home/jenkins/build/libvirt/share/libvirt/cpu_map/x86_Cooperlake.xml' # Looks like you planned 25 tests but ran 24. # Looks like your test exited with 2 just after 24. t/100-connect.t ........ Dubious, test returned 2 (wstat 512, 0x200) Failed 1/25 subtests (less 1 skipped subtest: 23 okay) t/200-domains.t ........ ok t/300-networks.t ....... ok t/400-storage-pools.t .. ok t/500-storage-vols.t ... ok t/600-interfaces.t ..... ok t/800-events.t ......... ok Test Summary Report ------------------- t/100-connect.t (Wstat: 512 Tests: 24 Failed: 0) Non-zero exit status: 2 Parse errors: Bad plan. You planned 25 tests but ran 24. Files=12, Tests=2012, 57 wallclock secs ( 0.41 usr 0.04 sys + 8.46 cusr 0.45 csys = 9.36 CPU) Result: FAIL Failed 1/12 test programs. 0/2012 subtests failed. Build step 'Execute shell' marked build as failure
1 2
0 0
Build failed in Jenkins: libvirt-perl-check » libvirt-freebsd-11 #1247
by ci@centos.org 26 May '20

26 May '20
See <https://ci.centos.org/job/libvirt-perl-check/systems=libvirt-freebsd-11/124…> ------------------------------------------ Started by upstream project "libvirt-perl-check" build number 1247 originally caused by: Started by upstream project "libvirt-perl-build" build number 1250 originally caused by: Started by upstream project "libvirt-build" build number 1448 originally caused by: Started by an SCM change Running as SYSTEM [EnvInject] - Loading node environment variables. Building remotely on libvirt-freebsd-11 (libvirt) in workspace <https://ci.centos.org/job/libvirt-perl-check/systems=libvirt-freebsd-11/ws/> [libvirt-perl] $ /bin/sh -xe /tmp/jenkins7895900246446448992.sh + export 'TEST_MAINTAINER=1' + perl Build test t/005-pod.t ............ ok t/010-pod-coverage.t ... ok t/015-changes.t ........ ok t/020-constants.t ...... ok t/030-api-coverage.t ... ok I/O warning : failed to load external entity "/home/jenkins/build/libvirt/share/libvirt/cpu_map/x86_Cooperlake.xml" libvirt error code: 27, message: XML error: failed to parse xml document '/home/jenkins/build/libvirt/share/libvirt/cpu_map/x86_Cooperlake.xml' # Looks like your test exited with 2 just after 24. t/100-connect.t ........ Dubious, test returned 2 (wstat 512, 0x200) Failed 1/25 subtests (less 1 skipped subtest: 23 okay) t/200-domains.t ........ ok t/300-networks.t ....... ok t/400-storage-pools.t .. ok t/500-storage-vols.t ... ok t/600-interfaces.t ..... ok t/800-events.t ......... ok Test Summary Report ------------------- t/100-connect.t (Wstat: 512 Tests: 24 Failed: 0) Non-zero exit status: 2 Parse errors: Bad plan. You planned 25 tests but ran 24. Files=12, Tests=2012, 29 wallclock secs ( 0.83 usr 0.38 sys + 19.89 cusr 1.92 csys = 23.02 CPU) Result: FAIL Failed 1/12 test programs. 0/2012 subtests failed. Build step 'Execute shell' marked build as failure
1 2
0 0
Build failed in Jenkins: libvirt-perl-check » libvirt-freebsd-12 #1247
by ci@centos.org 26 May '20

26 May '20
See <https://ci.centos.org/job/libvirt-perl-check/systems=libvirt-freebsd-12/124…> ------------------------------------------ Started by upstream project "libvirt-perl-check" build number 1247 originally caused by: Started by upstream project "libvirt-perl-build" build number 1250 originally caused by: Started by upstream project "libvirt-build" build number 1448 originally caused by: Started by an SCM change Running as SYSTEM [EnvInject] - Loading node environment variables. Building remotely on libvirt-freebsd-12 (libvirt) in workspace <https://ci.centos.org/job/libvirt-perl-check/systems=libvirt-freebsd-12/ws/> [libvirt-perl] $ /bin/sh -xe /tmp/jenkins10562044621016669636.sh + export 'TEST_MAINTAINER=1' + perl Build test t/005-pod.t ............ ok t/010-pod-coverage.t ... ok t/015-changes.t ........ ok t/020-constants.t ...... ok t/030-api-coverage.t ... ok I/O warning : failed to load external entity "/home/jenkins/build/libvirt/share/libvirt/cpu_map/x86_Cooperlake.xml" libvirt error code: 27, message: XML error: failed to parse xml document '/home/jenkins/build/libvirt/share/libvirt/cpu_map/x86_Cooperlake.xml' # Looks like your test exited with 2 just after 24. t/100-connect.t ........ Dubious, test returned 2 (wstat 512, 0x200) Failed 1/25 subtests (less 1 skipped subtest: 23 okay) t/200-domains.t ........ ok t/300-networks.t ....... ok t/400-storage-pools.t .. ok t/500-storage-vols.t ... ok t/600-interfaces.t ..... ok t/800-events.t ......... ok Test Summary Report ------------------- t/100-connect.t (Wstat: 512 Tests: 24 Failed: 0) Non-zero exit status: 2 Parse errors: Bad plan. You planned 25 tests but ran 24. Files=12, Tests=2012, 39 wallclock secs ( 1.03 usr 0.35 sys + 19.48 cusr 2.08 csys = 22.94 CPU) Result: FAIL Failed 1/12 test programs. 0/2012 subtests failed. Build step 'Execute shell' marked build as failure
1 2
0 0
  • ← Newer
  • 1
  • 2
  • 3
  • 4
  • 5
  • 6
  • 7
  • 8
  • Older →

HyperKitty Powered by HyperKitty version 1.3.12.