libvirt List Archives
Sign In Sign Up
Manage this list Sign In Sign Up

Keyboard Shortcuts

Thread View

  • j: Next unread message
  • k: Previous unread message
  • j a: Jump to all threads
  • j l: Jump to MailingList overview

CI

Thread Start a new thread
Download
Threads by month
  • ----- 2026 -----
  • September
  • August
  • July
  • June
  • May
  • April
  • March
  • February
  • January
  • ----- 2025 -----
  • December
  • November
  • October
  • September
  • August
  • July
  • June
  • May
  • April
  • March
  • February
  • January
  • ----- 2024 -----
  • December
  • November
  • October
  • September
  • August
  • July
  • June
  • May
  • April
  • March
  • February
  • January
  • ----- 2023 -----
  • December
  • November
  • October
  • September
  • August
  • July
  • June
  • May
  • April
  • March
  • February
  • January
  • ----- 2022 -----
  • December
  • November
  • October
  • September
  • August
  • July
  • June
  • May
  • April
  • March
  • February
  • January
  • ----- 2021 -----
  • December
  • November
  • October
  • September
  • August
  • July
  • June
  • May
  • April
  • March
  • February
  • January
  • ----- 2020 -----
  • December
  • November
  • October
  • September
  • August
  • July
  • June
  • May
  • April
  • March
  • February
  • January
  • ----- 2019 -----
  • December
  • November
  • October
  • September
  • August
  • July
  • June
  • May
  • April
  • March
  • February
  • January
  • ----- 2018 -----
  • December
  • November
  • October
  • September
  • August
  • July
  • June
  • May
  • April
  • March
  • February
  • January
  • ----- 2017 -----
  • December
  • November
  • October
  • September
  • August
  • July
  • June
  • May
  • April
  • March
  • February
  • January
  • ----- 2016 -----
  • December
  • November
  • October
  • September
  • August
  • July
ci@lists.libvirt.org

  • 2 participants
  • 10212 discussions
[Libvirt-ci] Build failed in Jenkins: libosinfo-master-check » libvirt-fedora-23 #75
by ci@centos.org 24 Aug '17

24 Aug '17
See <https://ci.centos.org/job/libosinfo-master-check/systems=libvirt-fedora-23/…> ------------------------------------------ Started by upstream project "libosinfo-master-check" build number 75 originally caused by: Started by upstream project "libosinfo-master-syntax-check" build number 78 originally caused by: Started by upstream project "libosinfo-master-build" build number 90 originally caused by: Started by an SCM change [EnvInject] - Loading node environment variables. Building remotely on libvirt-fedora-23 (libvirt) in workspace <https://ci.centos.org/job/libosinfo-master-check/systems=libvirt-fedora-23/…> [libosinfo-master] $ /bin/sh -xe /tmp/jenkins8928341119137013946.sh + MAKE=make ++ uname + unamestr=Linux + '[' Linux = FreeBSD ']' + export OSINFO_SYSTEM_DIR=/home/jenkins/build/libvirt/share/osinfo + OSINFO_SYSTEM_DIR=/home/jenkins/build/libvirt/share/osinfo + cd build + make -j3 check GEN public-submodule-commit Making check in osinfo make[1]: Entering directory '<https://ci.centos.org/job/libosinfo-master-check/systems=libvirt-fedora-23/…'> make check-am make[2]: Entering directory '<https://ci.centos.org/job/libosinfo-master-check/systems=libvirt-fedora-23/…'> make check-local make[3]: Entering directory '<https://ci.centos.org/job/libosinfo-master-check/systems=libvirt-fedora-23/…'> GEN check-symsorting GEN check-symfile make[3]: Leaving directory '<https://ci.centos.org/job/libosinfo-master-check/systems=libvirt-fedora-23/…'> make[2]: Leaving directory '<https://ci.centos.org/job/libosinfo-master-check/systems=libvirt-fedora-23/…'> make[1]: Leaving directory '<https://ci.centos.org/job/libosinfo-master-check/systems=libvirt-fedora-23/…'> Making check in tests make[1]: Entering directory '<https://ci.centos.org/job/libosinfo-master-check/systems=libvirt-fedora-23/…'> make test-entity test-device test-list test-devicelist test-filter test-product test-os test-oslist test-productfilter test-platform test-platformlist test-db test-loader test-isodetect test-mediauris test-treeuris test-install-script make[2]: Entering directory '<https://ci.centos.org/job/libosinfo-master-check/systems=libvirt-fedora-23/…'> CC test_list-test-list.o CC test_entity-test-entity.o CC test_device-test-device.o CC test_devicelist-test-devicelist.o CC test_filter-test-filter.o CC test_product-test-product.o CC test_oslist-test-oslist.o CC test_os-test-os.o CC test_productfilter-test-productfilter.o CC test_platform-test-platform.o CC test_platformlist-test-platformlist.o CC test_db-test-db.o CC test_loader-test-loader.o CC test_isodetect-test-isodetect.o CC test_mediauris-test-mediauris.o CC test_treeuris-test-treeuris.o CC test_install_script-test-install-script.o CCLD test-entity CCLD test-device CCLD test-list CCLD test-devicelist CCLD test-filter CCLD test-product CCLD test-os CCLD test-oslist CCLD test-productfilter CCLD test-platform CCLD test-platformlist CCLD test-db CCLD test-loader CCLD test-isodetect CCLD test-mediauris CCLD test-treeuris CCLD test-install-script make[2]: Leaving directory '<https://ci.centos.org/job/libosinfo-master-check/systems=libvirt-fedora-23/…'> make check-TESTS make[2]: Entering directory '<https://ci.centos.org/job/libosinfo-master-check/systems=libvirt-fedora-23/…'> make[3]: Entering directory '<https://ci.centos.org/job/libosinfo-master-check/systems=libvirt-fedora-23/…'> PASS: test-list PASS: test-entity PASS: test-device PASS: test-devicelist PASS: test-product PASS: test-filter PASS: test-os PASS: test-oslist PASS: test-productfilter PASS: test-platform PASS: test-platformlist PASS: test-db SKIP: test-mediauris SKIP: test-treeuris PASS: test-install-script FAIL: test-loader PASS: test-isodetect ============================================================================ Testsuite summary for libosinfo 1.2.0 ============================================================================ # TOTAL: 17 # PASS: 14 # SKIP: 2 # XFAIL: 0 # FAIL: 1 # XPASS: 0 # ERROR: 0 ============================================================================ See tests/test-suite.log Please report to libosinfo(a)redhat.com ============================================================================ Makefile:1250: recipe for target 'test-suite.log' failed make[3]: *** [test-suite.log] Error 1 make[3]: Leaving directory '<https://ci.centos.org/job/libosinfo-master-check/systems=libvirt-fedora-23/…'> Makefile:1356: recipe for target 'check-TESTS' failed make[2]: *** [check-TESTS] Error 2 make[2]: Leaving directory '<https://ci.centos.org/job/libosinfo-master-check/systems=libvirt-fedora-23/…'> Makefile:1541: recipe for target 'check-am' failed make[1]: *** [check-am] Error 2 make[1]: Leaving directory '<https://ci.centos.org/job/libosinfo-master-check/systems=libvirt-fedora-23/…'> Makefile:595: recipe for target 'check-recursive' failed make: *** [check-recursive] Error 1 + cat tests/test-suite.log =========================================== libosinfo 1.2.0: tests/test-suite.log =========================================== # TOTAL: 17 # PASS: 14 # SKIP: 2 # XFAIL: 0 # FAIL: 1 # XPASS: 0 # ERROR: 0 .. contents:: :depth: 2 FAIL: test-loader ================= Running suite(s): Loader 0%: Checks: 1, Failures: 0, Errors: 1 ../../tests/test-loader.c:32:E:Core:test_basic:0: (after this point) Test timeout expired FAIL test-loader (exit status: 1) SKIP: test-mediauris ==================== SKIP test-mediauris (exit status: 77) SKIP: test-treeuris =================== SKIP test-treeuris (exit status: 77) + exit 1 Build step 'Execute shell' marked build as failure
1 1
0 0
[Libvirt-ci] Build failed in Jenkins: virt-manager-master-check » libvirt-centos-7 #723
by ci@centos.org 16 Aug '17

16 Aug '17
See <https://ci.centos.org/job/virt-manager-master-check/systems=libvirt-centos-…> ------------------------------------------ Started by upstream project "virt-manager-master-check" build number 723 originally caused by: Started by upstream project "virt-manager-master-build" build number 726 originally caused by: Started by upstream project "libvirt-python-master-build" build number 580 originally caused by: Started by upstream project "libvirt-master-build" build number 780 originally caused by: Started by an SCM change [EnvInject] - Loading node environment variables. Building remotely on libvirt-centos-7 (libvirt) in workspace <https://ci.centos.org/job/virt-manager-master-check/systems=libvirt-centos-…> [virt-manager-master] $ /bin/sh -xe /tmp/jenkins4413094126315672850.sh + python setup.py test running test ............................................................................................................................................................................................................................................................................................................................................................................................................................................. ---------------------------------------------------------------------- Ran 429 tests in 263.796s OK /tmp/jenkins4413094126315672850.sh: line 2: 9582 Segmentation fault (core dumped) python setup.py test Build step 'Execute shell' marked build as failure
1 1
0 0
[Libvirt-ci] Build failed in Jenkins: libvirt-go-master-check » libvirt-fedora-rawhide #464
by ci@centos.org 14 Aug '17

14 Aug '17
See <https://ci.centos.org/job/libvirt-go-master-check/systems=libvirt-fedora-ra…> ------------------------------------------ Started by upstream project "libvirt-go-master-check" build number 464 originally caused by: Started by upstream project "libvirt-go-master-build" build number 465 originally caused by: Started by upstream project "libvirt-master-build" build number 774 originally caused by: Started by an SCM change [EnvInject] - Loading node environment variables. Building remotely on libvirt-fedora-rawhide (libvirt) in workspace <https://ci.centos.org/job/libvirt-go-master-check/systems=libvirt-fedora-ra…> [libvirt-go-master] $ /bin/sh -xe /tmp/jenkins6802238344009321068.sh + go test -tags api Missing enum 'VIR_FROM_RESCTRL' --- FAIL: TestAPICoverage (1.03s) panic: Missing symbols found [recovered] panic: Missing symbols found goroutine 6 [running]: testing.tRunner.func1(0xc4200980f0) /usr/lib/golang/src/testing/testing.go:719 +0x2d2 panic(0x5b7140, 0x61c4e0) /usr/lib/golang/src/runtime/panic.go:491 +0x283 _<https://ci.centos.org/job/libvirt-go-master-check/systems=libvirt-fedora-ra…> <https://ci.centos.org/job/libvirt-go-master-check/systems=libvirt-fedora-ra…>:504 +0x5b1 testing.tRunner(0xc4200980f0, 0x606c28) /usr/lib/golang/src/testing/testing.go:754 +0xd0 created by testing.(*T).Run /usr/lib/golang/src/testing/testing.go:800 +0x314 exit status 2 FAIL _<https://ci.centos.org/job/libvirt-go-master-check/systems=libvirt-fedora-ra…> 1.379s Build step 'Execute shell' marked build as failure
1 2
0 0
[Libvirt-ci] Build failed in Jenkins: libvirt-go-master-check » libvirt-fedora-23 #464
by ci@centos.org 14 Aug '17

14 Aug '17
See <https://ci.centos.org/job/libvirt-go-master-check/systems=libvirt-fedora-23…> ------------------------------------------ Started by upstream project "libvirt-go-master-check" build number 464 originally caused by: Started by upstream project "libvirt-go-master-build" build number 465 originally caused by: Started by upstream project "libvirt-master-build" build number 774 originally caused by: Started by an SCM change [EnvInject] - Loading node environment variables. Building remotely on libvirt-fedora-23 (libvirt) in workspace <https://ci.centos.org/job/libvirt-go-master-check/systems=libvirt-fedora-23…> [libvirt-go-master] $ /bin/sh -xe /tmp/jenkins8543610665692803283.sh + go test -tags api Missing enum 'VIR_FROM_RESCTRL' --- FAIL: TestAPICoverage (1.77s) panic: Missing symbols found [recovered] panic: Missing symbols found goroutine 5 [running]: testing.tRunner.func1(0xc820016090) /usr/lib/golang/src/testing/testing.go:450 +0x171 _<https://ci.centos.org/job/libvirt-go-master-check/systems=libvirt-fedora-23…> <https://ci.centos.org/job/libvirt-go-master-check/systems=libvirt-fedora-23…>:504 +0x65e testing.tRunner(0xc820016090, 0xa5ae60) /usr/lib/golang/src/testing/testing.go:456 +0x98 created by testing.RunTests /usr/lib/golang/src/testing/testing.go:561 +0x86d goroutine 1 [chan receive]: testing.RunTests(0x76da00, 0xa5ae60, 0x77, 0x77, 0x7f8677a58001) /usr/lib/golang/src/testing/testing.go:562 +0x8ad testing.(*M).Run(0xc82003ff08, 0xc82004deb0) /usr/lib/golang/src/testing/testing.go:494 +0x70 main.main() _<https://ci.centos.org/job/libvirt-go-master-check/systems=libvirt-fedora-23…>:290 +0x116 goroutine 17 [syscall, locked to thread]: runtime.goexit() /usr/lib/golang/src/runtime/asm_amd64.s:1721 +0x1 exit status 2 FAIL _<https://ci.centos.org/job/libvirt-go-master-check/systems=libvirt-fedora-23…> 1.901s Build step 'Execute shell' marked build as failure
1 2
0 0
[Libvirt-ci] Build failed in Jenkins: libvirt-go-master-check » libvirt-centos-7 #464
by ci@centos.org 14 Aug '17

14 Aug '17
See <https://ci.centos.org/job/libvirt-go-master-check/systems=libvirt-centos-7/…> ------------------------------------------ Started by upstream project "libvirt-go-master-check" build number 464 originally caused by: Started by upstream project "libvirt-go-master-build" build number 465 originally caused by: Started by upstream project "libvirt-master-build" build number 774 originally caused by: Started by an SCM change [EnvInject] - Loading node environment variables. Building remotely on libvirt-centos-7 (libvirt) in workspace <https://ci.centos.org/job/libvirt-go-master-check/systems=libvirt-centos-7/…> [libvirt-go-master] $ /bin/sh -xe /tmp/jenkins8716558210241159772.sh + go test -tags api Missing enum 'VIR_FROM_RESCTRL' --- FAIL: TestAPICoverage (0.90s) panic: Missing symbols found [recovered] panic: Missing symbols found goroutine 19 [running]: panic(0x650720, 0xc82019a440) /usr/lib/golang/src/runtime/panic.go:481 +0x3e6 testing.tRunner.func1(0xc8200c8000) /usr/lib/golang/src/testing/testing.go:467 +0x192 panic(0x650720, 0xc82019a440) /usr/lib/golang/src/runtime/panic.go:443 +0x4e9 _<https://ci.centos.org/job/libvirt-go-master-check/systems=libvirt-centos-7/…> <https://ci.centos.org/job/libvirt-go-master-check/systems=libvirt-centos-7/…>:504 +0x66d testing.tRunner(0xc8200c8000, 0xa79f60) /usr/lib/golang/src/testing/testing.go:473 +0x98 created by testing.RunTests /usr/lib/golang/src/testing/testing.go:582 +0x892 exit status 2 FAIL _<https://ci.centos.org/job/libvirt-go-master-check/systems=libvirt-centos-7/…> 1.239s Build step 'Execute shell' marked build as failure
1 2
0 0
[Libvirt-ci] Build failed in Jenkins: libvirt-go-master-check » libvirt-fedora-24 #464
by ci@centos.org 14 Aug '17

14 Aug '17
See <https://ci.centos.org/job/libvirt-go-master-check/systems=libvirt-fedora-24…> ------------------------------------------ Started by upstream project "libvirt-go-master-check" build number 464 originally caused by: Started by upstream project "libvirt-go-master-build" build number 465 originally caused by: Started by upstream project "libvirt-master-build" build number 774 originally caused by: Started by an SCM change [EnvInject] - Loading node environment variables. Building remotely on libvirt-fedora-24 (libvirt) in workspace <https://ci.centos.org/job/libvirt-go-master-check/systems=libvirt-fedora-24…> [libvirt-go-master] $ /bin/sh -xe /tmp/jenkins5668820238365352899.sh + go test -tags api Missing enum 'VIR_FROM_RESCTRL' --- FAIL: TestAPICoverage (2.09s) panic: Missing symbols found [recovered] panic: Missing symbols found goroutine 5 [running]: panic(0x650780, 0xc42013c570) /usr/lib/golang/src/runtime/panic.go:481 +0x3e6 testing.tRunner.func1(0xc420016120) /usr/lib/golang/src/testing/testing.go:467 +0x192 panic(0x650780, 0xc42013c570) /usr/lib/golang/src/runtime/panic.go:443 +0x4e9 _<https://ci.centos.org/job/libvirt-go-master-check/systems=libvirt-fedora-24…> <https://ci.centos.org/job/libvirt-go-master-check/systems=libvirt-fedora-24…>:504 +0x66d testing.tRunner(0xc420016120, 0xa79f60) /usr/lib/golang/src/testing/testing.go:473 +0x98 created by testing.RunTests /usr/lib/golang/src/testing/testing.go:582 +0x892 exit status 2 FAIL _<https://ci.centos.org/job/libvirt-go-master-check/systems=libvirt-fedora-24…> 2.615s Build step 'Execute shell' marked build as failure
1 2
0 0
[Libvirt-ci] Build failed in Jenkins: libvirt-go-master-check » libvirt-fedora-25 #464
by ci@centos.org 14 Aug '17

14 Aug '17
See <https://ci.centos.org/job/libvirt-go-master-check/systems=libvirt-fedora-25…> ------------------------------------------ Started by upstream project "libvirt-go-master-check" build number 464 originally caused by: Started by upstream project "libvirt-go-master-build" build number 465 originally caused by: Started by upstream project "libvirt-master-build" build number 774 originally caused by: Started by an SCM change [EnvInject] - Loading node environment variables. Building remotely on libvirt-fedora-25 (libvirt) in workspace <https://ci.centos.org/job/libvirt-go-master-check/systems=libvirt-fedora-25…> [libvirt-go-master] $ /bin/sh -xe /tmp/jenkins4107407295361490029.sh + go test -tags api Missing enum 'VIR_FROM_RESCTRL' --- FAIL: TestAPICoverage (1.89s) panic: Missing symbols found [recovered] panic: Missing symbols found goroutine 5 [running]: panic(0x599280, 0xc4200eecd0) /usr/lib/golang/src/runtime/panic.go:500 +0x1a1 testing.tRunner.func1(0xc420078180) /usr/lib/golang/src/testing/testing.go:579 +0x25d panic(0x599280, 0xc4200eecd0) /usr/lib/golang/src/runtime/panic.go:458 +0x243 _<https://ci.centos.org/job/libvirt-go-master-check/systems=libvirt-fedora-25…> <https://ci.centos.org/job/libvirt-go-master-check/systems=libvirt-fedora-25…>:504 +0x5ff testing.tRunner(0xc420078180, 0x5ecb28) /usr/lib/golang/src/testing/testing.go:610 +0x81 created by testing.(*T).Run /usr/lib/golang/src/testing/testing.go:646 +0x2ec exit status 2 FAIL _<https://ci.centos.org/job/libvirt-go-master-check/systems=libvirt-fedora-25…> 2.208s Build step 'Execute shell' marked build as failure
1 2
0 0
[Libvirt-ci] Build failed in Jenkins: libvirt-perl-master-test » libvirt-fedora-rawhide #570
by ci@centos.org 14 Aug '17

14 Aug '17
See <https://ci.centos.org/job/libvirt-perl-master-test/systems=libvirt-fedora-r…> ------------------------------------------ Started by upstream project "libvirt-perl-master-test" build number 570 originally caused by: Started by upstream project "libvirt-perl-master-build" build number 591 originally caused by: Started by upstream project "libvirt-master-build" build number 774 originally caused by: Started by an SCM change [EnvInject] - Loading node environment variables. Building remotely on libvirt-fedora-rawhide (libvirt) in workspace <https://ci.centos.org/job/libvirt-perl-master-test/systems=libvirt-fedora-r…> [libvirt-perl-master] $ /bin/sh -xe /tmp/jenkins4768172464545857774.sh + make -j3 test TEST_MAINTAINER=1 "/usr/bin/perl" -MExtUtils::Command::MM -e 'cp_nonempty' -- Virt.bs blib/arch/auto/Sys/Virt/Virt.bs 644 PERL_DL_NONLAZY=1 "/usr/bin/perl" "-MExtUtils::Command::MM" "-MTest::Harness" "-e" "undef *Test::Harness::Switches; test_harness(0, 'blib/lib', 'blib/arch')" t/*.t t/005-pod.t ............ ok t/010-pod-coverage.t ... ok t/015-changes.t ........ ok t/020-constants.t ...... ok # Failed test 'VIR_FROM_RESCTRL' # at t/030-api-coverage.t line 173. # Looks like you failed 1 test of 1592. t/030-api-coverage.t ... Dubious, test returned 1 (wstat 256, 0x100) Failed 1/1592 subtests t/100-connect.t ........ ok t/200-domains.t ........ ok t/300-networks.t ....... ok t/400-storage-pools.t .. ok t/500-storage-vols.t ... ok t/600-interfaces.t ..... ok t/800-events.t ......... ok Test Summary Report ------------------- t/030-api-coverage.t (Wstat: 256 Tests: 1592 Failed: 1) Failed test: 1177 Non-zero exit status: 1 Files=12, Tests=1844, 28 wallclock secs ( 0.38 usr 0.05 sys + 6.85 cusr 0.50 csys = 7.78 CPU) Result: FAIL Failed 1/12 test programs. 1/1844 subtests failed. make: *** [Makefile:1018: test_dynamic] Error 255 Build step 'Execute shell' marked build as failure
1 1
0 0
[Libvirt-ci] Build failed in Jenkins: libvirt-perl-master-test » libvirt-fedora-25 #570
by ci@centos.org 14 Aug '17

14 Aug '17
See <https://ci.centos.org/job/libvirt-perl-master-test/systems=libvirt-fedora-2…> ------------------------------------------ Started by upstream project "libvirt-perl-master-test" build number 570 originally caused by: Started by upstream project "libvirt-perl-master-build" build number 591 originally caused by: Started by upstream project "libvirt-master-build" build number 774 originally caused by: Started by an SCM change [EnvInject] - Loading node environment variables. Building remotely on libvirt-fedora-25 (libvirt) in workspace <https://ci.centos.org/job/libvirt-perl-master-test/systems=libvirt-fedora-2…> [libvirt-perl-master] $ /bin/sh -xe /tmp/jenkins6630325472552828273.sh + make -j3 test TEST_MAINTAINER=1 "/usr/bin/perl" -MExtUtils::Command::MM -e 'cp_nonempty' -- Virt.bs blib/arch/auto/Sys/Virt/Virt.bs 644 PERL_DL_NONLAZY=1 "/usr/bin/perl" "-MExtUtils::Command::MM" "-MTest::Harness" "-e" "undef *Test::Harness::Switches; test_harness(0, 'blib/lib', 'blib/arch')" t/*.t t/005-pod.t ............ ok t/010-pod-coverage.t ... ok t/015-changes.t ........ ok t/020-constants.t ...... ok # Failed test 'VIR_FROM_RESCTRL' # at t/030-api-coverage.t line 173. # Looks like you failed 1 test of 1592. t/030-api-coverage.t ... Dubious, test returned 1 (wstat 256, 0x100) Failed 1/1592 subtests t/100-connect.t ........ ok t/200-domains.t ........ ok t/300-networks.t ....... ok t/400-storage-pools.t .. ok t/500-storage-vols.t ... ok t/600-interfaces.t ..... ok t/800-events.t ......... ok Test Summary Report ------------------- t/030-api-coverage.t (Wstat: 256 Tests: 1592 Failed: 1) Failed test: 1177 Non-zero exit status: 1 Files=12, Tests=1844, 59 wallclock secs ( 0.43 usr 0.06 sys + 7.71 cusr 0.51 csys = 8.71 CPU) Result: FAIL Failed 1/12 test programs. 1/1844 subtests failed. Makefile:1018: recipe for target 'test_dynamic' failed make: *** [test_dynamic] Error 255 Build step 'Execute shell' marked build as failure
1 1
0 0
[Libvirt-ci] Build failed in Jenkins: libvirt-perl-master-test » libvirt-fedora-23 #570
by ci@centos.org 14 Aug '17

14 Aug '17
See <https://ci.centos.org/job/libvirt-perl-master-test/systems=libvirt-fedora-2…> ------------------------------------------ Started by upstream project "libvirt-perl-master-test" build number 570 originally caused by: Started by upstream project "libvirt-perl-master-build" build number 591 originally caused by: Started by upstream project "libvirt-master-build" build number 774 originally caused by: Started by an SCM change [EnvInject] - Loading node environment variables. Building remotely on libvirt-fedora-23 (libvirt) in workspace <https://ci.centos.org/job/libvirt-perl-master-test/systems=libvirt-fedora-2…> [libvirt-perl-master] $ /bin/sh -xe /tmp/jenkins3437422216482276663.sh + make -j3 test TEST_MAINTAINER=1 PERL_DL_NONLAZY=1 "/usr/bin/perl" "-MExtUtils::Command::MM" "-MTest::Harness" "-e" "undef *Test::Harness::Switches; test_harness(0, 'blib/lib', 'blib/arch')" t/*.t t/005-pod.t ............ ok t/010-pod-coverage.t ... ok t/015-changes.t ........ ok t/020-constants.t ...... ok # Failed test 'VIR_FROM_RESCTRL' # at t/030-api-coverage.t line 173. # Looks like you failed 1 test of 1592. t/030-api-coverage.t ... Dubious, test returned 1 (wstat 256, 0x100) Failed 1/1592 subtests t/100-connect.t ........ ok t/200-domains.t ........ ok t/300-networks.t ....... ok t/400-storage-pools.t .. ok t/500-storage-vols.t ... ok t/600-interfaces.t ..... ok t/800-events.t ......... ok Test Summary Report ------------------- t/030-api-coverage.t (Wstat: 256 Tests: 1592 Failed: 1) Failed test: 1177 Non-zero exit status: 1 Files=12, Tests=1844, 39 wallclock secs ( 0.49 usr 0.07 sys + 6.20 cusr 0.52 csys = 7.28 CPU) Result: FAIL Failed 1/12 test programs. 1/1844 subtests failed. Makefile:1030: recipe for target 'test_dynamic' failed make: *** [test_dynamic] Error 255 Build step 'Execute shell' marked build as failure
1 1
0 0
  • ← Newer
  • 1
  • ...
  • 999
  • 1000
  • 1001
  • 1002
  • 1003
  • 1004
  • 1005
  • ...
  • 1022
  • Older →

HyperKitty Powered by HyperKitty version 1.3.12.