libvirt List Archives
Sign In Sign Up
Manage this list Sign In Sign Up

Keyboard Shortcuts

Thread View

  • j: Next unread message
  • k: Previous unread message
  • j a: Jump to all threads
  • j l: Jump to MailingList overview

CI

Thread Start a new thread
Download
Threads by month
  • ----- 2026 -----
  • September
  • August
  • July
  • June
  • May
  • April
  • March
  • February
  • January
  • ----- 2025 -----
  • December
  • November
  • October
  • September
  • August
  • July
  • June
  • May
  • April
  • March
  • February
  • January
  • ----- 2024 -----
  • December
  • November
  • October
  • September
  • August
  • July
  • June
  • May
  • April
  • March
  • February
  • January
  • ----- 2023 -----
  • December
  • November
  • October
  • September
  • August
  • July
  • June
  • May
  • April
  • March
  • February
  • January
  • ----- 2022 -----
  • December
  • November
  • October
  • September
  • August
  • July
  • June
  • May
  • April
  • March
  • February
  • January
  • ----- 2021 -----
  • December
  • November
  • October
  • September
  • August
  • July
  • June
  • May
  • April
  • March
  • February
  • January
  • ----- 2020 -----
  • December
  • November
  • October
  • September
  • August
  • July
  • June
  • May
  • April
  • March
  • February
  • January
  • ----- 2019 -----
  • December
  • November
  • October
  • September
  • August
  • July
  • June
  • May
  • April
  • March
  • February
  • January
  • ----- 2018 -----
  • December
  • November
  • October
  • September
  • August
  • July
  • June
  • May
  • April
  • March
  • February
  • January
  • ----- 2017 -----
  • December
  • November
  • October
  • September
  • August
  • July
  • June
  • May
  • April
  • March
  • February
  • January
  • ----- 2016 -----
  • December
  • November
  • October
  • September
  • August
  • July
ci@lists.libvirt.org

  • 2 participants
  • 10212 discussions
[Libvirt-ci] Build failed in Jenkins: libvirt-perl-master-test » libvirt-centos-7 #570
by ci@centos.org 14 Aug '17

14 Aug '17
See <https://ci.centos.org/job/libvirt-perl-master-test/systems=libvirt-centos-7…> ------------------------------------------ Started by upstream project "libvirt-perl-master-test" build number 570 originally caused by: Started by upstream project "libvirt-perl-master-build" build number 591 originally caused by: Started by upstream project "libvirt-master-build" build number 774 originally caused by: Started by an SCM change [EnvInject] - Loading node environment variables. Building remotely on libvirt-centos-7 (libvirt) in workspace <https://ci.centos.org/job/libvirt-perl-master-test/systems=libvirt-centos-7…> [libvirt-perl-master] $ /bin/sh -xe /tmp/jenkins5585565221123485954.sh + make -j3 test TEST_MAINTAINER=1 PERL_DL_NONLAZY=1 /usr/bin/perl "-MExtUtils::Command::MM" "-e" "test_harness(0, 'blib/lib', 'blib/arch')" t/*.t t/005-pod.t ............ ok t/010-pod-coverage.t ... ok t/015-changes.t ........ ok t/020-constants.t ...... ok # Failed test 'VIR_FROM_RESCTRL' # at t/030-api-coverage.t line 173. # Looks like you failed 1 test of 1592. t/030-api-coverage.t ... Dubious, test returned 1 (wstat 256, 0x100) Failed 1/1592 subtests t/100-connect.t ........ ok t/200-domains.t ........ ok t/300-networks.t ....... ok t/400-storage-pools.t .. ok t/500-storage-vols.t ... ok t/600-interfaces.t ..... ok t/800-events.t ......... ok Test Summary Report ------------------- t/030-api-coverage.t (Wstat: 256 Tests: 1592 Failed: 1) Failed test: 1177 Non-zero exit status: 1 Files=12, Tests=1844, 37 wallclock secs ( 0.37 usr 0.04 sys + 7.29 cusr 0.38 csys = 8.08 CPU) Result: FAIL Failed 1/12 test programs. 1/1844 subtests failed. make: *** [test_dynamic] Error 255 Build step 'Execute shell' marked build as failure
1 1
0 0
[Libvirt-ci] Build failed in Jenkins: libvirt-perl-master-test » libvirt-fedora-24 #570
by ci@centos.org 14 Aug '17

14 Aug '17
See <https://ci.centos.org/job/libvirt-perl-master-test/systems=libvirt-fedora-2…> ------------------------------------------ Started by upstream project "libvirt-perl-master-test" build number 570 originally caused by: Started by upstream project "libvirt-perl-master-build" build number 591 originally caused by: Started by upstream project "libvirt-master-build" build number 774 originally caused by: Started by an SCM change [EnvInject] - Loading node environment variables. Building remotely on libvirt-fedora-24 (libvirt) in workspace <https://ci.centos.org/job/libvirt-perl-master-test/systems=libvirt-fedora-2…> [libvirt-perl-master] $ /bin/sh -xe /tmp/jenkins7298511786682804313.sh + make -j3 test TEST_MAINTAINER=1 PERL_DL_NONLAZY=1 "/usr/bin/perl" "-MExtUtils::Command::MM" "-MTest::Harness" "-e" "undef *Test::Harness::Switches; test_harness(0, 'blib/lib', 'blib/arch')" t/*.t t/005-pod.t ............ ok t/010-pod-coverage.t ... ok t/015-changes.t ........ ok t/020-constants.t ...... ok # Failed test 'VIR_FROM_RESCTRL' # at t/030-api-coverage.t line 173. # Looks like you failed 1 test of 1592. t/030-api-coverage.t ... Dubious, test returned 1 (wstat 256, 0x100) Failed 1/1592 subtests t/100-connect.t ........ ok t/200-domains.t ........ ok t/300-networks.t ....... ok t/400-storage-pools.t .. ok t/500-storage-vols.t ... ok t/600-interfaces.t ..... ok t/800-events.t ......... ok Test Summary Report ------------------- t/030-api-coverage.t (Wstat: 256 Tests: 1592 Failed: 1) Failed test: 1177 Non-zero exit status: 1 Files=12, Tests=1844, 48 wallclock secs ( 0.50 usr 0.08 sys + 6.45 cusr 0.42 csys = 7.45 CPU) Result: FAIL Failed 1/12 test programs. 1/1844 subtests failed. Makefile:1030: recipe for target 'test_dynamic' failed make: *** [test_dynamic] Error 255 Build step 'Execute shell' marked build as failure
1 1
0 0
[Libvirt-ci] Build failed in Jenkins: libosinfo-master-check » libvirt-fedora-rawhide #73
by ci@centos.org 14 Aug '17

14 Aug '17
See <https://ci.centos.org/job/libosinfo-master-check/systems=libvirt-fedora-raw…> ------------------------------------------ Started by upstream project "libosinfo-master-check" build number 73 originally caused by: Started by upstream project "libosinfo-master-syntax-check" build number 77 originally caused by: Started by upstream project "libosinfo-master-build" build number 89 originally caused by: Started by an SCM change [EnvInject] - Loading node environment variables. Building remotely on libvirt-fedora-rawhide (libvirt) in workspace <https://ci.centos.org/job/libosinfo-master-check/systems=libvirt-fedora-raw…> [libosinfo-master] $ /bin/sh -xe /tmp/jenkins714427979631901078.sh + MAKE=make ++ uname + unamestr=Linux + '[' Linux = FreeBSD ']' + export OSINFO_SYSTEM_DIR=/home/jenkins/build/libvirt/share/osinfo + OSINFO_SYSTEM_DIR=/home/jenkins/build/libvirt/share/osinfo + cd build + make -j3 check GEN public-submodule-commit Making check in osinfo make[1]: Entering directory '<https://ci.centos.org/job/libosinfo-master-check/systems=libvirt-fedora-raw…'> make check-am make[2]: Entering directory '<https://ci.centos.org/job/libosinfo-master-check/systems=libvirt-fedora-raw…'> make check-local make[3]: Entering directory '<https://ci.centos.org/job/libosinfo-master-check/systems=libvirt-fedora-raw…'> GEN check-symfile GEN check-symsorting make[3]: Leaving directory '<https://ci.centos.org/job/libosinfo-master-check/systems=libvirt-fedora-raw…'> make[2]: Leaving directory '<https://ci.centos.org/job/libosinfo-master-check/systems=libvirt-fedora-raw…'> make[1]: Leaving directory '<https://ci.centos.org/job/libosinfo-master-check/systems=libvirt-fedora-raw…'> Making check in tests make[1]: Entering directory '<https://ci.centos.org/job/libosinfo-master-check/systems=libvirt-fedora-raw…'> make test-entity test-device test-list test-devicelist test-filter test-product test-os test-oslist test-productfilter test-platform test-platformlist test-db test-loader test-isodetect test-mediauris test-treeuris test-install-script make[2]: Entering directory '<https://ci.centos.org/job/libosinfo-master-check/systems=libvirt-fedora-raw…'> CC test_entity-test-entity.o CC test_device-test-device.o CC test_list-test-list.o CC test_devicelist-test-devicelist.o CC test_filter-test-filter.o CC test_product-test-product.o CC test_os-test-os.o CC test_oslist-test-oslist.o CC test_productfilter-test-productfilter.o CC test_platform-test-platform.o CC test_platformlist-test-platformlist.o CC test_db-test-db.o CC test_loader-test-loader.o CC test_isodetect-test-isodetect.o CC test_mediauris-test-mediauris.o CC test_treeuris-test-treeuris.o CC test_install_script-test-install-script.o CCLD test-entity CCLD test-device CCLD test-list CCLD test-devicelist CCLD test-filter CCLD test-product CCLD test-os CCLD test-oslist CCLD test-productfilter CCLD test-platform CCLD test-platformlist CCLD test-db CCLD test-loader CCLD test-isodetect CCLD test-mediauris CCLD test-treeuris CCLD test-install-script make[2]: Leaving directory '<https://ci.centos.org/job/libosinfo-master-check/systems=libvirt-fedora-raw…'> make check-TESTS make[2]: Entering directory '<https://ci.centos.org/job/libosinfo-master-check/systems=libvirt-fedora-raw…'> make[3]: Entering directory '<https://ci.centos.org/job/libosinfo-master-check/systems=libvirt-fedora-raw…'> PASS: test-device PASS: test-list PASS: test-entity PASS: test-devicelist PASS: test-filter PASS: test-product PASS: test-os PASS: test-productfilter PASS: test-oslist PASS: test-platform PASS: test-platformlist PASS: test-db SKIP: test-mediauris SKIP: test-treeuris PASS: test-install-script FAIL: test-loader PASS: test-isodetect ============================================================================ Testsuite summary for libosinfo 1.1.0 ============================================================================ # TOTAL: 17 # PASS: 14 # SKIP: 2 # XFAIL: 0 # FAIL: 1 # XPASS: 0 # ERROR: 0 ============================================================================ See tests/test-suite.log Please report to libosinfo(a)redhat.com ============================================================================ make[3]: *** [Makefile:1251: test-suite.log] Error 1 make[3]: Leaving directory '<https://ci.centos.org/job/libosinfo-master-check/systems=libvirt-fedora-raw…'> make[2]: *** [Makefile:1359: check-TESTS] Error 2 make[2]: Leaving directory '<https://ci.centos.org/job/libosinfo-master-check/systems=libvirt-fedora-raw…'> make[1]: *** [Makefile:1542: check-am] Error 2 make[1]: Leaving directory '<https://ci.centos.org/job/libosinfo-master-check/systems=libvirt-fedora-raw…'> make: *** [Makefile:595: check-recursive] Error 1 + cat tests/test-suite.log =========================================== libosinfo 1.1.0: tests/test-suite.log =========================================== # TOTAL: 17 # PASS: 14 # SKIP: 2 # XFAIL: 0 # FAIL: 1 # XPASS: 0 # ERROR: 0 .. contents:: :depth: 2 FAIL: test-loader ================= Running suite(s): Loader 0%: Checks: 1, Failures: 0, Errors: 1 ../../tests/test-loader.c:36:E:Core:test_basic:0: (after this point) Test timeout expired FAIL test-loader (exit status: 1) SKIP: test-mediauris ==================== SKIP test-mediauris (exit status: 77) SKIP: test-treeuris =================== SKIP test-treeuris (exit status: 77) + exit 1 Build step 'Execute shell' marked build as failure
1 1
0 0
[Libvirt-ci] Build failed in Jenkins: libosinfo-master-build » libvirt-fedora-rawhide #84
by ci@centos.org 14 Aug '17

14 Aug '17
See <https://ci.centos.org/job/libosinfo-master-build/systems=libvirt-fedora-raw…> Changes: [cfergeau] freebsd: add FreeBSD 11.1 isodata [cfergeau] mageia: add Mageia 6 test data [cfergeau] tests: test-mediauris: skip non-http URLs [cfergeau] tests: test-mediauris: show status code on failure [cfergeau] tests: make the network tests run ------------------------------------------ [...truncated 6.01 KB...] checking for egrep... /usr/bin/grep -E checking for fgrep... /usr/bin/grep -F checking for ld used by gcc... /usr/bin/ld checking if the linker (/usr/bin/ld) is GNU ld... yes checking for BSD- or MS-compatible name lister (nm)... /usr/bin/nm -B checking the name lister (/usr/bin/nm -B) interface... BSD nm checking the maximum length of command line arguments... 1572864 checking how to convert x86_64-pc-linux-gnu file names to x86_64-pc-linux-gnu format... func_convert_file_noop checking how to convert x86_64-pc-linux-gnu file names to toolchain format... func_convert_file_noop checking for /usr/bin/ld option to reload object files... -r checking for objdump... objdump checking how to recognize dependent libraries... pass_all checking for dlltool... no checking how to associate runtime and link libraries... printf %s\n checking for ar... ar checking for archiver @FILE support... @ checking for strip... strip checking for ranlib... ranlib checking command to parse /usr/bin/nm -B output from gcc object... ok checking for sysroot... no checking for a working dd... /usr/bin/dd checking how to truncate binary pipes... /usr/bin/dd bs=4096 count=1 checking for mt... no checking if : is a manifest tool... no checking how to run the C preprocessor... gcc -E checking for ANSI C header files... yes checking for sys/types.h... yes checking for sys/stat.h... yes checking for stdlib.h... yes checking for string.h... yes checking for memory.h... yes checking for strings.h... yes checking for inttypes.h... yes checking for stdint.h... yes checking for unistd.h... yes checking for dlfcn.h... yes checking for objdir... .libs checking if gcc supports -fno-rtti -fno-exceptions... no checking for gcc option to produce PIC... -fPIC -DPIC checking if gcc PIC flag -fPIC -DPIC works... yes checking if gcc static flag -static works... yes checking if gcc supports -c -o file.o... yes checking if gcc supports -c -o file.o... (cached) yes checking whether the gcc linker (/usr/bin/ld -m elf_x86_64) supports shared libraries... yes checking whether -lc should be explicitly linked in... no checking dynamic linker characteristics... GNU/Linux ld.so checking how to hardcode library paths into programs... immediate checking whether stripping libraries is possible... yes checking if libtool supports shared libraries... yes checking whether to build shared libraries... yes checking whether to build static libraries... no checking whether C compiler handles -Werror -Wunknown-warning-option... no checking whether -Wno-missing-field-initializers is supported... yes checking whether -Wno-missing-field-initializers is needed... no checking whether -Wuninitialized is supported... yes checking whether C compiler handles -W... yes checking whether C compiler handles -Waddress... yes checking whether C compiler handles -Waggressive-loop-optimizations... yes checking whether C compiler handles -Wall... yes checking whether C compiler handles -Warray-bounds... yes checking whether C compiler handles -Wattributes... yes checking whether C compiler handles -Wbuiltin-macro-redefined... yes checking whether C compiler handles -Wcast-align... yes checking whether C compiler handles -Wchar-subscripts... yes checking whether C compiler handles -Wclobbered... yes checking whether C compiler handles -Wcomment... yes checking whether C compiler handles -Wcomments... yes checking whether C compiler handles -Wcoverage-mismatch... yes checking whether C compiler handles -Wcpp... yes checking whether C compiler handles -Wdate-time... yes checking whether C compiler handles -Wdeprecated-declarations... yes checking whether C compiler handles -Wdisabled-optimization... yes checking whether C compiler handles -Wdiv-by-zero... yes checking whether C compiler handles -Wdouble-promotion... yes checking whether C compiler handles -Wempty-body... yes checking whether C compiler handles -Wendif-labels... yes checking whether C compiler handles -Wenum-compare... yes checking whether C compiler handles -Wextra... yes checking whether C compiler handles -Wformat-contains-nul... yes checking whether C compiler handles -Wformat-extra-args... yes checking whether C compiler handles -Wformat-nonliteral... yes checking whether C compiler handles -Wformat-security... yes checking whether C compiler handles -Wformat-y2k... yes checking whether C compiler handles -Wformat-zero-length... yes checking whether C compiler handles -Wfree-nonheap-object... yes checking whether C compiler handles -Wignored-qualifiers... yes checking whether C compiler handles -Wimplicit... yes checking whether C compiler handles -Wimplicit-function-declaration... yes checking whether C compiler handles -Wimplicit-int... yes checking whether C compiler handles -Winit-self... yes checking whether C compiler handles -Winline... yes checking whether C compiler handles -Wint-to-pointer-cast... yes checking whether C compiler handles -Winvalid-memory-model... yes checking whether C compiler handles -Winvalid-pch... yes checking whether C compiler handles -Wjump-misses-init... yes checking whether C compiler handles -Wlogical-op... yes checking whether C compiler handles -Wmain... yes checking whether C compiler handles -Wmaybe-uninitialized... yes checking whether C compiler handles -Wmissing-braces... yes checking whether C compiler handles -Wmissing-declarations... yes checking whether C compiler handles -Wmissing-field-initializers... yes checking whether C compiler handles -Wmissing-include-dirs... yes checking whether C compiler handles -Wmissing-parameter-type... yes checking whether C compiler handles -Wmissing-prototypes... yes checking whether C compiler handles -Wmultichar... yes checking whether C compiler handles -Wnarrowing... yes checking whether C compiler handles -Wnested-externs... yes checking whether C compiler handles -Wnonnull... yes checking whether C compiler handles -Wold-style-declaration... yes checking whether C compiler handles -Wold-style-definition... yes checking whether C compiler handles -Wopenmp-simd... yes checking whether C compiler handles -Woverflow... yes checking whether C compiler handles -Woverlength-strings... yes checking whether C compiler handles -Woverride-init... yes checking whether C compiler handles -Wpacked... yes checking whether C compiler handles -Wpacked-bitfield-compat... yes checking whether C compiler handles -Wparentheses... yes checking whether C compiler handles -Wpointer-arith... yes checking whether C compiler handles -Wpointer-sign... yes checking whether C compiler handles -Wpointer-to-int-cast... yes checking whether C compiler handles -Wpragmas... yes checking whether C compiler handles -Wreturn-local-addr... yes checking whether C compiler handles -Wreturn-type... yes checking whether C compiler handles -Wsequence-point... yes checking whether C compiler handles -Wshadow... yes checking whether C compiler handles -Wsizeof-pointer-memaccess... yes checking whether C compiler handles -Wstack-protector... yes checking whether C compiler handles -Wstrict-aliasing... yes checking whether C compiler handles -Wstrict-overflow... yes checking whether C compiler handles -Wstrict-prototypes... yes checking whether C compiler handles -Wsuggest-attribute=const... yes checking whether C compiler handles -Wsuggest-attribute=format... yes checking whether C compiler handles -Wsuggest-attribute=noreturn... yes checking whether C compiler handles -Wsuggest-attribute=pure... yes checking whether C compiler handles -Wswitch... yes checking whether C compiler handles -Wsync-nand... yes checking whether C compiler handles -Wtrampolines... yes checking whether C compiler handles -Wtrigraphs... yes checking whether C compiler handles -Wtype-limits... yes checking whether C compiler handles -Wuninitialized... yes checking whether C compiler handles -Wunknown-pragmas... yes checking whether C compiler handles -Wunused... yes checking whether C compiler handles -Wunused-but-set-parameter... yes checking whether C compiler handles -Wunused-but-set-variable... yes checking whether C compiler handles -Wunused-function... yes checking whether C compiler handles -Wunused-label... yes checking whether C compiler handles -Wunused-local-typedefs... yes checking whether C compiler handles -Wunused-parameter... yes checking whether C compiler handles -Wunused-result... yes checking whether C compiler handles -Wunused-value... yes checking whether C compiler handles -Wunused-variable... yes checking whether C compiler handles -Wvarargs... yes checking whether C compiler handles -Wvariadic-macros... yes checking whether C compiler handles -Wvector-operation-performance... yes checking whether C compiler handles -Wvla... yes checking whether C compiler handles -Wvolatile-register-var... yes checking whether C compiler handles -Wwrite-strings... yes checking whether C compiler handles -Wnormalized=nfc... yes checking whether C compiler handles -Wno-sign-compare... yes checking whether C compiler handles -Wno-sign-conversion... yes checking whether C compiler handles -Wno-conversion... yes checking whether C compiler handles -Wno-unused-parameter... yes checking whether C compiler handles -Wjump-misses-init... (cached) yes checking whether C compiler handles -Wframe-larger-than=4096... yes checking whether C compiler handles -Wno-overlength-strings... yes checking whether C compiler handles -fstack-protector-all... yes checking whether C compiler handles --param=ssp-buffer-size=4... yes checking whether C compiler handles -fexceptions... yes checking whether C compiler handles -fasynchronous-unwind-tables... yes checking whether C compiler handles -fdiagnostics-show-option... yes checking whether C compiler handles -funit-at-a-time... yes checking whether C compiler handles -fipa-pure-const... yes checking whether C compiler handles -Wno-suggest-attribute=pure... yes checking whether C compiler handles -Wno-suggest-attribute=const... yes checking whether C compiler handles -Werror... yes checking whether to enable maintainer-specific portions of Makefiles... yes checking whether to enable maintainer-specific portions of Makefiles... yes checking whether NLS is requested... yes checking for intltool >= 0.40.0... 0.51.0 found checking for intltool-update... /usr/bin/intltool-update checking for intltool-merge... /usr/bin/intltool-merge checking for intltool-extract... /usr/bin/intltool-extract checking for xgettext... /usr/bin/xgettext checking for msgmerge... /usr/bin/msgmerge checking for msgfmt... /usr/bin/msgfmt checking for gmsgfmt... /usr/bin/msgfmt checking for perl... /usr/bin/perl checking for perl >= 5.8.1... 5.26.0 checking for XML::Parser... ok checking whether make supports nested variables... (cached) yes checking for pkg-config... /usr/bin/pkg-config checking pkg-config is at least version 0.9.0... yes checking for LIBXML... yes checking for LIBXSLT... yes checking for GLIB... yes checking for SOUP... yes checking for gtk-doc... yes checking for gtkdoc-check... gtkdoc-check.test checking for gtkdoc-check... /usr/bin/gtkdoc-check checking for gtkdoc-rebase... /usr/bin/gtkdoc-rebase checking for gtkdoc-mkpdf... /usr/bin/gtkdoc-mkpdf checking whether to build gtk-doc documentation... yes checking for GTKDOC_DEPS... yes checking for CHECK... yes checking for perl... /usr/bin/perl checking for gobject-introspection... yes checking for vapigen... /usr/bin/vapigen checking location of usb.ids database... /usr/share/hwdata/usb.ids checking location of pci.ids database... /usr/share/hwdata/pci.ids checking that generated files are newer than configure... done configure: creating ./config.status config.status: creating Makefile config.status: creating libosinfo.spec config.status: creating mingw-libosinfo.spec config.status: creating osinfo/Makefile config.status: creating osinfo/libosinfo-1.0.pc config.status: creating osinfo/osinfo_version.h config.status: creating tools/Makefile config.status: creating tests/Makefile config.status: creating docs/Makefile config.status: creating docs/reference/Makefile config.status: creating examples/Makefile config.status: creating po/Makefile.in config.status: creating config.h config.status: linking ../GNUmakefile to GNUmakefile config.status: executing depfiles commands config.status: executing libtool commands config.status: executing po/stamp-it commands Now type `make' to compile libosinfo + make -j3 make all-recursive make[1]: Entering directory '<https://ci.centos.org/job/libosinfo-master-build/systems=libvirt-fedora-raw…'> Making all in osinfo make[2]: Entering directory '<https://ci.centos.org/job/libosinfo-master-build/systems=libvirt-fedora-raw…'> GEN osinfo_enum_types.h Traceback (most recent call last): File "/usr/bin/glib-mkenums", line 669, in <module> process_file(fname) File "/usr/bin/glib-mkenums", line 406, in process_file line = curfile.readline() File "/usr/lib64/python3.6/encodings/ascii.py", line 26, in decode return codecs.ascii_decode(input, self.errors)[0] UnicodeDecodeError: 'ascii' codec can't decode byte 0xc3 in position 869: ordinal not in range(128) make[2]: *** [Makefile:1384: osinfo_enum_types.h] Error 1 make[2]: Leaving directory '<https://ci.centos.org/job/libosinfo-master-build/systems=libvirt-fedora-raw…'> make[1]: *** [Makefile:595: all-recursive] Error 1 make[1]: Leaving directory '<https://ci.centos.org/job/libosinfo-master-build/systems=libvirt-fedora-raw…'> make: *** [Makefile:481: all] Error 2 Build step 'Execute shell' marked build as failure
1 5
0 0
[Libvirt-ci] Build failed in Jenkins: libvirt-python-master-rpm » libvirt-centos-7 #540
by ci@centos.org 10 Aug '17

10 Aug '17
See <https://ci.centos.org/job/libvirt-python-master-rpm/systems=libvirt-centos-…> ------------------------------------------ Started by upstream project "libvirt-python-master-rpm" build number 540 originally caused by: Started by upstream project "libvirt-python-master-check" build number 541 originally caused by: Started by upstream project "libvirt-python-master-build" build number 565 originally caused by: Started by an SCM change Started by an SCM change [EnvInject] - Loading node environment variables. Building remotely on libvirt-centos-7 (libvirt) in workspace <https://ci.centos.org/job/libvirt-python-master-rpm/systems=libvirt-centos-…> [libvirt-python-master] $ /bin/sh -xe /tmp/jenkins1514064375470197513.sh + sed -i -e 's/BuildRequires: libvirt.*devel.*//' libvirt-python.spec.in + python setup.py rpm running rpm running sdist running check reading manifest template 'MANIFEST.in' warning: no files found matching 'MANIFEST' writing manifest file 'MANIFEST' creating libvirt-python-3.6.0 creating libvirt-python-3.6.0/examples creating libvirt-python-3.6.0/examples/guest-vcpus creating libvirt-python-3.6.0/tests making hard links in libvirt-python-3.6.0... hard linking AUTHORS -> libvirt-python-3.6.0 hard linking COPYING -> libvirt-python-3.6.0 hard linking COPYING.LESSER -> libvirt-python-3.6.0 hard linking ChangeLog -> libvirt-python-3.6.0 hard linking NEWS -> libvirt-python-3.6.0 hard linking README -> libvirt-python-3.6.0 hard linking generator.py -> libvirt-python-3.6.0 hard linking libvirt-lxc-override-api.xml -> libvirt-python-3.6.0 hard linking libvirt-lxc-override.c -> libvirt-python-3.6.0 hard linking libvirt-override-api.xml -> libvirt-python-3.6.0 hard linking libvirt-override-virConnect.py -> libvirt-python-3.6.0 hard linking libvirt-override-virDomain.py -> libvirt-python-3.6.0 hard linking libvirt-override-virDomainSnapshot.py -> libvirt-python-3.6.0 hard linking libvirt-override-virStoragePool.py -> libvirt-python-3.6.0 hard linking libvirt-override-virStream.py -> libvirt-python-3.6.0 hard linking libvirt-override.c -> libvirt-python-3.6.0 hard linking libvirt-override.py -> libvirt-python-3.6.0 hard linking libvirt-python.spec -> libvirt-python-3.6.0 hard linking libvirt-qemu-override-api.xml -> libvirt-python-3.6.0 hard linking libvirt-qemu-override.c -> libvirt-python-3.6.0 hard linking libvirt-utils.c -> libvirt-python-3.6.0 hard linking libvirt-utils.h -> libvirt-python-3.6.0 hard linking libvirtaio.py -> libvirt-python-3.6.0 hard linking sanitytest.py -> libvirt-python-3.6.0 hard linking setup.py -> libvirt-python-3.6.0 hard linking tox.ini -> libvirt-python-3.6.0 hard linking typewrappers.c -> libvirt-python-3.6.0 hard linking typewrappers.h -> libvirt-python-3.6.0 hard linking examples/consolecallback.py -> libvirt-python-3.6.0/examples hard linking examples/dominfo.py -> libvirt-python-3.6.0/examples hard linking examples/domipaddrs.py -> libvirt-python-3.6.0/examples hard linking examples/domrestore.py -> libvirt-python-3.6.0/examples hard linking examples/domsave.py -> libvirt-python-3.6.0/examples hard linking examples/domstart.py -> libvirt-python-3.6.0/examples hard linking examples/esxlist.py -> libvirt-python-3.6.0/examples hard linking examples/event-test.py -> libvirt-python-3.6.0/examples hard linking examples/nodestats.py -> libvirt-python-3.6.0/examples hard linking examples/topology.py -> libvirt-python-3.6.0/examples hard linking examples/guest-vcpus/guest-vcpu-daemon.py -> libvirt-python-3.6.0/examples/guest-vcpus hard linking examples/guest-vcpus/guest-vcpu.py -> libvirt-python-3.6.0/examples/guest-vcpus hard linking tests/test_conn.py -> libvirt-python-3.6.0/tests hard linking tests/test_domain.py -> libvirt-python-3.6.0/tests creating dist Creating tar archive removing 'libvirt-python-3.6.0' (and everything under it) /usr/bin/rpmbuild -ta --clean dist/libvirt-python-3.6.0.tar.gz error: Failed build dependencies: python3-devel is needed by libvirt-python-3.6.0-1.el7.centos.x86_64 python3-nose is needed by libvirt-python-3.6.0-1.el7.centos.x86_64 python3-lxml is needed by libvirt-python-3.6.0-1.el7.centos.x86_64 error: command '/usr/bin/rpmbuild' failed with exit status 1 Build step 'Execute shell' marked build as failure
1 2
0 0
[Libvirt-ci] Build failed in Jenkins: libvirt-python-master-rpm » libvirt-centos-6 #540
by ci@centos.org 10 Aug '17

10 Aug '17
See <https://ci.centos.org/job/libvirt-python-master-rpm/systems=libvirt-centos-…> ------------------------------------------ Started by upstream project "libvirt-python-master-rpm" build number 540 originally caused by: Started by upstream project "libvirt-python-master-check" build number 541 originally caused by: Started by upstream project "libvirt-python-master-build" build number 565 originally caused by: Started by an SCM change Started by an SCM change [EnvInject] - Loading node environment variables. Building remotely on libvirt-centos-6 (libvirt) in workspace <https://ci.centos.org/job/libvirt-python-master-rpm/systems=libvirt-centos-…> [libvirt-python-master] $ /bin/sh -xe /tmp/jenkins6701066401275521776.sh + sed -i -e 's/BuildRequires: libvirt.*devel.*//' libvirt-python.spec.in + python setup.py rpm running rpm running sdist reading manifest template 'MANIFEST.in' warning: no files found matching 'MANIFEST' writing manifest file 'MANIFEST' creating libvirt-python-3.6.0 creating libvirt-python-3.6.0/examples creating libvirt-python-3.6.0/examples/guest-vcpus creating libvirt-python-3.6.0/tests making hard links in libvirt-python-3.6.0... hard linking AUTHORS -> libvirt-python-3.6.0 hard linking COPYING -> libvirt-python-3.6.0 hard linking COPYING.LESSER -> libvirt-python-3.6.0 hard linking ChangeLog -> libvirt-python-3.6.0 hard linking NEWS -> libvirt-python-3.6.0 hard linking README -> libvirt-python-3.6.0 hard linking generator.py -> libvirt-python-3.6.0 hard linking libvirt-lxc-override-api.xml -> libvirt-python-3.6.0 hard linking libvirt-lxc-override.c -> libvirt-python-3.6.0 hard linking libvirt-override-api.xml -> libvirt-python-3.6.0 hard linking libvirt-override-virConnect.py -> libvirt-python-3.6.0 hard linking libvirt-override-virDomain.py -> libvirt-python-3.6.0 hard linking libvirt-override-virDomainSnapshot.py -> libvirt-python-3.6.0 hard linking libvirt-override-virStoragePool.py -> libvirt-python-3.6.0 hard linking libvirt-override-virStream.py -> libvirt-python-3.6.0 hard linking libvirt-override.c -> libvirt-python-3.6.0 hard linking libvirt-override.py -> libvirt-python-3.6.0 hard linking libvirt-python.spec -> libvirt-python-3.6.0 hard linking libvirt-qemu-override-api.xml -> libvirt-python-3.6.0 hard linking libvirt-qemu-override.c -> libvirt-python-3.6.0 hard linking libvirt-utils.c -> libvirt-python-3.6.0 hard linking libvirt-utils.h -> libvirt-python-3.6.0 hard linking libvirtaio.py -> libvirt-python-3.6.0 hard linking sanitytest.py -> libvirt-python-3.6.0 hard linking setup.py -> libvirt-python-3.6.0 hard linking tox.ini -> libvirt-python-3.6.0 hard linking typewrappers.c -> libvirt-python-3.6.0 hard linking typewrappers.h -> libvirt-python-3.6.0 hard linking examples/consolecallback.py -> libvirt-python-3.6.0/examples hard linking examples/dominfo.py -> libvirt-python-3.6.0/examples hard linking examples/domipaddrs.py -> libvirt-python-3.6.0/examples hard linking examples/domrestore.py -> libvirt-python-3.6.0/examples hard linking examples/domsave.py -> libvirt-python-3.6.0/examples hard linking examples/domstart.py -> libvirt-python-3.6.0/examples hard linking examples/esxlist.py -> libvirt-python-3.6.0/examples hard linking examples/event-test.py -> libvirt-python-3.6.0/examples hard linking examples/nodestats.py -> libvirt-python-3.6.0/examples hard linking examples/topology.py -> libvirt-python-3.6.0/examples hard linking examples/guest-vcpus/guest-vcpu-daemon.py -> libvirt-python-3.6.0/examples/guest-vcpus hard linking examples/guest-vcpus/guest-vcpu.py -> libvirt-python-3.6.0/examples/guest-vcpus hard linking tests/test_conn.py -> libvirt-python-3.6.0/tests hard linking tests/test_domain.py -> libvirt-python-3.6.0/tests creating dist tar -cf dist/libvirt-python-3.6.0.tar libvirt-python-3.6.0 gzip -f9 dist/libvirt-python-3.6.0.tar tar -cf dist/libvirt-python-3.6.0.tar libvirt-python-3.6.0 gzip -f9 dist/libvirt-python-3.6.0.tar removing 'libvirt-python-3.6.0' (and everything under it) /usr/bin/rpmbuild -ta --clean dist/libvirt-python-3.6.0.tar.gz error: Failed build dependencies: python3-devel is needed by libvirt-python-3.6.0-1.el6.x86_64 python3-nose is needed by libvirt-python-3.6.0-1.el6.x86_64 python3-lxml is needed by libvirt-python-3.6.0-1.el6.x86_64 error: command '/usr/bin/rpmbuild' failed with exit status 1 Build step 'Execute shell' marked build as failure
1 2
0 0
[Libvirt-ci] Errored: libvirt/libvirt#380 (master - 0842574)
by Travis CI 07 Aug '17

07 Aug '17
Build Update for libvirt/libvirt ------------------------------------- Build: #380 Status: Errored Duration: 6 hours, 38 minutes, and 26 seconds Commit: 0842574 (master) Author: Michal Privoznik Message: virdbustest: Don't leak @out_strv1 In testMessageSingleArrayRef the string is doubly referenced. Therefore we have to free also the first pointer to the string. Signed-off-by: Michal Privoznik <mprivozn(a)redhat.com> View the changeset: https://github.com/libvirt/libvirt/compare/addcebc7d088...08425740b2b7 View the full build log and details: https://travis-ci.org/libvirt/libvirt/builds/261745381?utm_source=email&utm… -- You can configure recipients for build notifications in your .travis.yml file. See https://docs.travis-ci.com/user/notifications
1 0
0 0
[Libvirt-ci] Errored: libvirt/libvirt#383 (master - b343f5d)
by Travis CI 07 Aug '17

07 Aug '17
Build Update for libvirt/libvirt ------------------------------------- Build: #383 Status: Errored Duration: 11 minutes and 17 seconds Commit: b343f5d (master) Author: Daniel P. Berrange Message: tests: add further XML namespace test Validate that we can pass QEMU command line options using a default namespace, instead of a prefixed namespace Signed-off-by: Daniel P. Berrange <berrange(a)redhat.com> View the changeset: https://github.com/libvirt/libvirt/compare/7c956d42a247...b343f5d678b8 View the full build log and details: https://travis-ci.org/libvirt/libvirt/builds/261848183?utm_source=email&utm… -- You can configure recipients for build notifications in your .travis.yml file. See https://docs.travis-ci.com/user/notifications
1 0
0 0
[Libvirt-ci] Build failed in Jenkins: virt-manager-master-check » libvirt-fedora-rawhide #694
by ci@centos.org 07 Aug '17

07 Aug '17
See <https://ci.centos.org/job/virt-manager-master-check/systems=libvirt-fedora-…> ------------------------------------------ Started by upstream project "virt-manager-master-check" build number 694 originally caused by: Started by upstream project "virt-manager-master-build" build number 697 originally caused by: Started by upstream project "libvirt-python-master-build" build number 557 originally caused by: Started by upstream project "libvirt-master-build" build number 759 originally caused by: Started by an SCM change Started by an SCM change Started by an SCM change Started by an SCM change Started by an SCM change [EnvInject] - Loading node environment variables. Building remotely on libvirt-fedora-rawhide (libvirt) in workspace <https://ci.centos.org/job/virt-manager-master-check/systems=libvirt-fedora-…> [virt-manager-master] $ /bin/sh -xe /tmp/jenkins3070246151374625023.sh + python setup.py test running test ............................................................................................................................................................................................................................................................................................................................................................................................................................................. ---------------------------------------------------------------------- Ran 429 tests in 234.339s OK /tmp/jenkins3070246151374625023.sh: line 2: 25688 Segmentation fault (core dumped) python setup.py test Build step 'Execute shell' marked build as failure
1 1
0 0
[Libvirt-ci] Build failed in Jenkins: libvirt-master-rpm » libvirt-fedora-24 #496
by ci@centos.org 07 Aug '17

07 Aug '17
See <https://ci.centos.org/job/libvirt-master-rpm/systems=libvirt-fedora-24/496/…> ------------------------------------------ [...truncated 341.93 KB...] + for i in nodeinfotest seclabeltest + rm -f nodeinfotest + printf 'int main(void) { return 0; }' + printf '#!/bin/sh\nexit 0\n' + chmod +x nodeinfotest + for i in nodeinfotest seclabeltest + rm -f seclabeltest + printf 'int main(void) { return 0; }' + printf '#!/bin/sh\nexit 0\n' + chmod +x seclabeltest + make -j2 check VIR_TEST_DEBUG=1 make libshunload.la virportallocatormock.la virnetdaemonmock.la virnetserverclientmock.la vircgroupmock.la virpcimock.la virnetdevmock.la virrandommock.la virhostcpumock.la domaincapsmock.la virfilecachemock.la virusbmock.la virnetdevbandwidthmock.la virnumamock.la virtestmock.la virdbusmock.la virmocklibxl.la libqemumonitortestutils.la libqemutestdriver.la qemuxml2argvmock.la qemucaps2xmlmock.la qemucapsprobemock.la qemucpumock.la nssmock.la virdeterministichashmock.la libsecurityselinuxhelper.la virshtest sockettest virhostcputest virbuftest commandtest seclabeltest virhashtest virconftest viratomictest utiltest shunloadtest virtimetest viruritest virkeyfiletest viralloctest virauthconfigtest virbitmaptest vircgrouptest vircryptotest virpcitest virendiantest virfiletest virfilecachetest virfirewalltest viriscsitest virkeycodetest virlockspacetest virlogtest virrotatingfiletest virschematest virstringtest virportallocatortest sysinfotest virkmodtest vircapstest domaincapstest domainconftest virhostdevtest virnetdevtest virtypedparamtest virnetmessagetest virnetsockettest virnetdaemontest virnetserverclienttest virnettlscontexttest virnettlssessiontest fchosttest scsihosttest vircaps2xmltest fdstreamtest virdbustest virsystemdtest virpolkittest securityselinuxtest viridentitytest securityselinuxlabeltest xml2sexprtest sexpr2xmltest xmconfigtest xencapstest xlconfigtest libxlxml2domconfigtest qemuxml2argvtest qemuxml2xmltest qemuargv2xmltest qemuhelptest domainsnapshotxml2xmltest qemumonitortest qemumonitorjsontest qemuhotplugtest qemuagenttest qemucapabilitiestest qemucaps2xmltest qemumemlocktest qemucommandutiltest lxcxml2xmltest lxcconf2xmltest openvzutilstest esxutilstest vboxsnapshotxmltest vmx2xmltest xml2vmxtest vmwarevertest virjsontest networkxml2xmltest networkxml2xmlupdatetest networkxml2conftest networkxml2firewalltest storagebackendsheepdogtest nwfilterxml2xmltest nwfilterebiptablestest nwfilterxml2firewalltest storagevolxml2argvtest virstorageutiltest virstoragetest virscsitest nsstest nssguesttest storagevolxml2xmltest storagepoolxml2xmltest nodedevxml2xmltest interfacexml2xmltest cputest metadatatest secretxml2xmltest genericxml2xmltest virusbtest virnetdevbandwidthtest eventtest virdrivermoduletest objecteventtest virmacmaptest commandhelper ssh qemucapsprobe nsslinktest nssguestlinktest make[1]: Entering directory '<https://ci.centos.org/job/libvirt-master-rpm/systems=libvirt-fedora-24/ws/b…'> CC shunloadhelper.lo CC virportallocatormock_la-virportallocatormock.lo CC virnetdaemonmock_la-virnetdaemonmock.lo CC virnetserverclientmock_la-virnetserverclientmock.lo CC vircgroupmock_la-vircgroupmock.lo CC virpcimock_la-virpcimock.lo CC virnetdevmock_la-virnetdevmock.lo CC virrandommock_la-virrandommock.lo CC virhostcpumock_la-virhostcpumock.lo CC domaincapsmock_la-domaincapsmock.lo CC virfilecachemock_la-virfilecachemock.lo CC virusbmock_la-virusbmock.lo CC virnetdevbandwidthmock_la-virnetdevbandwidthmock.lo CC virnumamock_la-virnumamock.lo CC virtestmock_la-virtestmock.lo CC virdbusmock_la-virdbusmock.lo CC virmocklibxl_la-virmocklibxl.lo CC qemumonitortestutils.lo CCLD libqemutestdriver.la CC qemuxml2argvmock_la-qemuxml2argvmock.lo CC qemucaps2xmlmock_la-qemucaps2xmlmock.lo CC qemucapsprobemock_la-qemucapsprobemock.lo CC qemucpumock_la-qemucpumock.lo CC nssmock_la-nssmock.lo CC virdeterministichashmock_la-virdeterministichashmock.lo CC securityselinuxhelper.lo CC virshtest.o CC testutils.o CC sockettest.o CC virhostcputest.o CC virfilewrapper.o CC virbuftest.o CC commandtest.o CC seclabeltest.o CC virhashtest.o CC virconftest.o CC viratomictest.o CC utiltest.o CC shunloadtest.o CC virtimetest.o CC viruritest.o CC virkeyfiletest.o CC viralloctest.o CC virauthconfigtest.o CC virbitmaptest.o CC vircgrouptest.o CC vircryptotest.o CC virpcitest.o CC virendiantest.o CC virfiletest.o CC virfilecachetest.o CC virfirewalltest-virfirewalltest.o CC virfirewalltest-testutils.o CC viriscsitest.o CC virkeycodetest.o CC virlockspacetest.o CC virlogtest.o CC virrotatingfiletest-virrotatingfiletest.o CC virrotatingfiletest-testutils.o CC virschematest.o CC virstringtest.o CC virportallocatortest.o CC sysinfotest.o CC virkmodtest.o CC vircapstest.o CC testutilslxc.o CC testutilsqemu.o CC testutilsxen.o CC domaincapstest.o CC domainconftest.o CC virhostdevtest.o CC virnetdevtest-virnetdevtest.o CC virnetdevtest-testutils.o CC virtypedparamtest.o CC virnetmessagetest-virnetmessagetest.o CC virnetmessagetest-testutils.o CC virnetsockettest.o CC virnetdaemontest-virnetdaemontest.o CC virnetdaemontest-testutils.o CC virnetserverclienttest-virnetserverclienttest.o CC virnetserverclienttest-testutils.o CC virnettlscontexttest.o CC virnettlshelpers.o CC pkix_asn1_tab.o CC virnettlssessiontest.o CC fchosttest.o CC scsihosttest.o CC vircaps2xmltest.o CC fdstreamtest.o CC virdbustest-virdbustest.o CC virdbustest-testutils.o CC virsystemdtest-virsystemdtest.o CC virsystemdtest-testutils.o CC virpolkittest-virpolkittest.o CC virpolkittest-testutils.o CC securityselinuxtest.o CC viridentitytest.o CC securityselinuxlabeltest.o CC xml2sexprtest.o CC sexpr2xmltest.o CC xmconfigtest.o CC xencapstest.o CC xlconfigtest.o CC libxlxml2domconfigtest.o CC qemuxml2argvtest.o CC qemuxml2xmltest.o CC qemuargv2xmltest.o CC qemuhelptest.o CC domainsnapshotxml2xmltest.o CC qemumonitortest.o CC qemumonitorjsontest.o CC qemuhotplugtest.o CC qemuagenttest.o CC qemucapabilitiestest.o CC qemucaps2xmltest.o CC qemumemlocktest.o CC qemucommandutiltest.o CC lxcxml2xmltest.o CC lxcconf2xmltest.o CC openvzutilstest.o CC esxutilstest.o CC vboxsnapshotxmltest.o CC vmx2xmltest.o CC xml2vmxtest.o CC vmwarevertest.o CC virjsontest.o CC networkxml2xmltest.o CC networkxml2xmlupdatetest.o CC networkxml2conftest.o CC networkxml2firewalltest.o CC storagebackendsheepdogtest.o CC nwfilterxml2xmltest.o CC nwfilterebiptablestest.o CC nwfilterxml2firewalltest.o CC storagevolxml2argvtest.o CC virstorageutiltest.o CC virstoragetest.o CC virscsitest.o CC nsstest-nsstest.o CC nsstest-testutils.o CC nssguesttest-nsstest.o CC nssguesttest-testutils.o CC storagevolxml2xmltest.o CC storagepoolxml2xmltest.o CC nodedevxml2xmltest.o CC interfacexml2xmltest.o CC cputest.o CC metadatatest.o CC secretxml2xmltest.o CC genericxml2xmltest.o CC virusbtest.o CC virnetdevbandwidthtest.o CC eventtest.o CC virdrivermoduletest.o CC objecteventtest.o CC virmacmaptest.o CC commandhelper.o CC ssh.o CC qemucapsprobe.o CC nsslinktest-nsslinktest.o CC nssguestlinktest-nsslinktest.o CCLD libshunload.la CCLD virportallocatormock.la CCLD virnetdaemonmock.la CCLD virnetserverclientmock.la CCLD vircgroupmock.la CCLD virpcimock.la CCLD virnetdevmock.la CCLD virrandommock.la CCLD virhostcpumock.la CCLD domaincapsmock.la CCLD virfilecachemock.la CCLD virusbmock.la CCLD virnetdevbandwidthmock.la CCLD virnumamock.la CCLD virtestmock.la CCLD virdbusmock.la CCLD virmocklibxl.la CCLD libqemumonitortestutils.la CCLD qemuxml2argvmock.la CCLD qemucaps2xmlmock.la CCLD qemucapsprobemock.la CCLD qemucpumock.la CCLD nssmock.la CCLD virdeterministichashmock.la CCLD libsecurityselinuxhelper.la CCLD virshtest CCLD sockettest CCLD virhostcputest CCLD virbuftest CCLD commandtest CCLD seclabeltest CCLD virhashtest CCLD virconftest ../libtool: fork: retry: No child processes ../libtool: fork: retry: No child processes ../libtool: fork: retry: No child processes ../libtool: fork: retry: No child processes ../libtool: fork: retry: No child processes ../libtool: fork: retry: No child processes ../libtool: fork: retry: No child processes ../libtool: fork: retry: No child processes ../libtool: fork: retry: No child processes ../libtool: fork: Resource temporarily unavailable Makefile:5041: recipe for target 'virhashtest' failed make[1]: *** [virhashtest] Error 254 make[1]: *** Waiting for unfinished jobs.... ../libtool: fork: retry: No child processes ../libtool: fork: retry: Resource temporarily unavailable ../libtool: fork: retry: No child processes ../libtool: fork: retry: No child processes ../libtool: fork: retry: No child processes ../libtool: fork: retry: No child processes ../libtool: fork: retry: No child processes ../libtool: fork: Resource temporarily unavailable ../libtool: fork: retry: No child processes ../libtool: fork: retry: No child processes ../libtool: fork: retry: No child processes ../libtool: fork: retry: No child processes ../libtool: fork: Resource temporarily unavailable Makefile:5009: recipe for target 'virconftest' failed make[1]: *** [virconftest] Error 254 make[1]: Leaving directory '<https://ci.centos.org/job/libvirt-master-rpm/systems=libvirt-fedora-24/ws/b…'> Makefile:7077: recipe for target 'check-am' failed make: *** [check-am] Error 2 + cat test-suite.log /var/tmp/rpm-tmp.94iwUq: fork: retry: No child processes cat: test-suite.log: No such file or directory + true + exit 1 error: Bad exit status from /var/tmp/rpm-tmp.94iwUq (%check) RPM build errors: Bad exit status from /var/tmp/rpm-tmp.94iwUq (%check) Build step 'Execute shell' marked build as failure
1 1
0 0
  • ← Newer
  • 1
  • ...
  • 1000
  • 1001
  • 1002
  • 1003
  • 1004
  • 1005
  • 1006
  • ...
  • 1022
  • Older →

HyperKitty Powered by HyperKitty version 1.3.12.