libvirt List Archives
Sign In Sign Up
Manage this list Sign In Sign Up

Keyboard Shortcuts

Thread View

  • j: Next unread message
  • k: Previous unread message
  • j a: Jump to all threads
  • j l: Jump to MailingList overview

CI

Thread Start a new thread
Download
Threads by month
  • ----- 2026 -----
  • September
  • August
  • July
  • June
  • May
  • April
  • March
  • February
  • January
  • ----- 2025 -----
  • December
  • November
  • October
  • September
  • August
  • July
  • June
  • May
  • April
  • March
  • February
  • January
  • ----- 2024 -----
  • December
  • November
  • October
  • September
  • August
  • July
  • June
  • May
  • April
  • March
  • February
  • January
  • ----- 2023 -----
  • December
  • November
  • October
  • September
  • August
  • July
  • June
  • May
  • April
  • March
  • February
  • January
  • ----- 2022 -----
  • December
  • November
  • October
  • September
  • August
  • July
  • June
  • May
  • April
  • March
  • February
  • January
  • ----- 2021 -----
  • December
  • November
  • October
  • September
  • August
  • July
  • June
  • May
  • April
  • March
  • February
  • January
  • ----- 2020 -----
  • December
  • November
  • October
  • September
  • August
  • July
  • June
  • May
  • April
  • March
  • February
  • January
  • ----- 2019 -----
  • December
  • November
  • October
  • September
  • August
  • July
  • June
  • May
  • April
  • March
  • February
  • January
  • ----- 2018 -----
  • December
  • November
  • October
  • September
  • August
  • July
  • June
  • May
  • April
  • March
  • February
  • January
  • ----- 2017 -----
  • December
  • November
  • October
  • September
  • August
  • July
  • June
  • May
  • April
  • March
  • February
  • January
  • ----- 2016 -----
  • December
  • November
  • October
  • September
  • August
  • July
ci@lists.libvirt.org

  • 2 participants
  • 10212 discussions
[Libvirt-ci] Build failed in Jenkins: libvirt-python-master-build » libvirt-centos-7 #608
by ci@centos.org 29 Aug '17

29 Aug '17
See <https://ci.centos.org/job/libvirt-python-master-build/systems=libvirt-cento…> ------------------------------------------ Started by upstream project "libvirt-python-master-build" build number 608 originally caused by: Started by upstream project "libvirt-master-build" build number 810 originally caused by: Started by an SCM change Started by an SCM change Started by an SCM change Started by an SCM change [EnvInject] - Loading node environment variables. Building remotely on libvirt-centos-7 (libvirt) in workspace <https://ci.centos.org/job/libvirt-python-master-build/systems=libvirt-cento…> > git rev-parse --is-inside-work-tree # timeout=10 Fetching changes from the remote Git repository > git config remote.origin.url git://n64.pufty.ci.centos.org/libvirt-python.git # timeout=10 Fetching upstream changes from git://n64.pufty.ci.centos.org/libvirt-python.git > git --version # timeout=10 > git fetch --tags --progress git://n64.pufty.ci.centos.org/libvirt-python.git +refs/heads/*:refs/remotes/origin/* Checking out Revision 49cb00a5eb4b1291f177c569e962a14d1b9abb79 (refs/remotes/origin/master) Commit message: "Fix package name in description of sub-RPMs" > git config core.sparsecheckout # timeout=10 > git checkout -f 49cb00a5eb4b1291f177c569e962a14d1b9abb79 > git rev-list 49cb00a5eb4b1291f177c569e962a14d1b9abb79 # timeout=10 Cleaning workspace > git rev-parse --verify HEAD # timeout=10 Resetting working tree > git reset --hard # timeout=10 > git clean -fdx # timeout=10 [libvirt-python-master] $ /bin/sh -xe /tmp/jenkins4795931521622095785.sh + python setup.py build running build /usr/bin/pkg-config --print-errors --atleast-version=0.9.11 libvirt /usr/bin/python generator.py libvirt /home/jenkins/build/libvirt/share/libvirt/api/libvirt-api.xml Found 426 functions in /home/jenkins/build/libvirt/share/libvirt/api/libvirt-api.xml Found 0 functions in libvirt-override-api.xml Generated 346 wrapper functions Missing type converters: unsigned long long *:1 ERROR: failed virDomainMigrateGetMaxDowntime error: command '/usr/bin/python' failed with exit status 1 Build step 'Execute shell' marked build as failure
1 2
0 0
[Libvirt-ci] Build failed in Jenkins: libvirt-python-master-build » libvirt-centos-6 #608
by ci@centos.org 29 Aug '17

29 Aug '17
See <https://ci.centos.org/job/libvirt-python-master-build/systems=libvirt-cento…> ------------------------------------------ Started by upstream project "libvirt-python-master-build" build number 608 originally caused by: Started by upstream project "libvirt-master-build" build number 810 originally caused by: Started by an SCM change Started by an SCM change Started by an SCM change Started by an SCM change [EnvInject] - Loading node environment variables. Building remotely on libvirt-centos-6 (libvirt) in workspace <https://ci.centos.org/job/libvirt-python-master-build/systems=libvirt-cento…> > git rev-parse --is-inside-work-tree # timeout=10 Fetching changes from the remote Git repository > git config remote.origin.url git://n64.pufty.ci.centos.org/libvirt-python.git # timeout=10 Fetching upstream changes from git://n64.pufty.ci.centos.org/libvirt-python.git > git --version # timeout=10 > git fetch --tags --progress git://n64.pufty.ci.centos.org/libvirt-python.git +refs/heads/*:refs/remotes/origin/* Checking out Revision 49cb00a5eb4b1291f177c569e962a14d1b9abb79 (refs/remotes/origin/master) Commit message: "Fix package name in description of sub-RPMs" > git config core.sparsecheckout # timeout=10 > git checkout -f 49cb00a5eb4b1291f177c569e962a14d1b9abb79 > git rev-list 49cb00a5eb4b1291f177c569e962a14d1b9abb79 # timeout=10 Cleaning workspace > git rev-parse --verify HEAD # timeout=10 Resetting working tree > git reset --hard # timeout=10 > git clean -fdx # timeout=10 [libvirt-python-master] $ /bin/sh -xe /tmp/jenkins1195953194946190932.sh + python setup.py build running build /usr/bin/pkg-config --print-errors --atleast-version=0.9.11 libvirt /usr/bin/python generator.py libvirt /home/jenkins/build/libvirt/share/libvirt/api/libvirt-api.xml Found 426 functions in /home/jenkins/build/libvirt/share/libvirt/api/libvirt-api.xml Found 0 functions in libvirt-override-api.xml Generated 346 wrapper functions Missing type converters: unsigned long long *:1 ERROR: failed virDomainMigrateGetMaxDowntime error: command '/usr/bin/python' failed with exit status 1 Build step 'Execute shell' marked build as failure
1 2
0 0
[Libvirt-ci] Build failed in Jenkins: libvirt-python-master-build » libvirt-fedora-rawhide #608
by ci@centos.org 29 Aug '17

29 Aug '17
See <https://ci.centos.org/job/libvirt-python-master-build/systems=libvirt-fedor…> ------------------------------------------ Started by upstream project "libvirt-python-master-build" build number 608 originally caused by: Started by upstream project "libvirt-master-build" build number 810 originally caused by: Started by an SCM change Started by an SCM change Started by an SCM change Started by an SCM change [EnvInject] - Loading node environment variables. Building remotely on libvirt-fedora-rawhide (libvirt) in workspace <https://ci.centos.org/job/libvirt-python-master-build/systems=libvirt-fedor…> > git rev-parse --is-inside-work-tree # timeout=10 Fetching changes from the remote Git repository > git config remote.origin.url git://n64.pufty.ci.centos.org/libvirt-python.git # timeout=10 Fetching upstream changes from git://n64.pufty.ci.centos.org/libvirt-python.git > git --version # timeout=10 > git fetch --tags --progress git://n64.pufty.ci.centos.org/libvirt-python.git +refs/heads/*:refs/remotes/origin/* Checking out Revision 49cb00a5eb4b1291f177c569e962a14d1b9abb79 (refs/remotes/origin/master) Commit message: "Fix package name in description of sub-RPMs" > git config core.sparsecheckout # timeout=10 > git checkout -f 49cb00a5eb4b1291f177c569e962a14d1b9abb79 > git rev-list 49cb00a5eb4b1291f177c569e962a14d1b9abb79 # timeout=10 Cleaning workspace > git rev-parse --verify HEAD # timeout=10 Resetting working tree > git reset --hard # timeout=10 > git clean -fdx # timeout=10 [libvirt-python-master] $ /bin/sh -xe /tmp/jenkins3076713918616655071.sh + python setup.py build running build /usr/bin/pkg-config --print-errors --atleast-version=0.9.11 libvirt /usr/bin/python generator.py libvirt /home/jenkins/build/libvirt/share/libvirt/api/libvirt-api.xml Found 426 functions in /home/jenkins/build/libvirt/share/libvirt/api/libvirt-api.xml Found 0 functions in libvirt-override-api.xml Generated 346 wrapper functions Missing type converters: unsigned long long *:1 ERROR: failed virDomainMigrateGetMaxDowntime error: command '/usr/bin/python' failed with exit status 1 Build step 'Execute shell' marked build as failure
1 2
0 0
[Libvirt-ci] Build failed in Jenkins: libvirt-python-master-build » libvirt-fedora-23 #608
by ci@centos.org 29 Aug '17

29 Aug '17
See <https://ci.centos.org/job/libvirt-python-master-build/systems=libvirt-fedor…> ------------------------------------------ Started by upstream project "libvirt-python-master-build" build number 608 originally caused by: Started by upstream project "libvirt-master-build" build number 810 originally caused by: Started by an SCM change Started by an SCM change Started by an SCM change Started by an SCM change [EnvInject] - Loading node environment variables. Building remotely on libvirt-fedora-23 (libvirt) in workspace <https://ci.centos.org/job/libvirt-python-master-build/systems=libvirt-fedor…> > git rev-parse --is-inside-work-tree # timeout=10 Fetching changes from the remote Git repository > git config remote.origin.url git://n64.pufty.ci.centos.org/libvirt-python.git # timeout=10 Fetching upstream changes from git://n64.pufty.ci.centos.org/libvirt-python.git > git --version # timeout=10 > git fetch --tags --progress git://n64.pufty.ci.centos.org/libvirt-python.git +refs/heads/*:refs/remotes/origin/* Checking out Revision 49cb00a5eb4b1291f177c569e962a14d1b9abb79 (refs/remotes/origin/master) Commit message: "Fix package name in description of sub-RPMs" > git config core.sparsecheckout # timeout=10 > git checkout -f 49cb00a5eb4b1291f177c569e962a14d1b9abb79 > git rev-list 49cb00a5eb4b1291f177c569e962a14d1b9abb79 # timeout=10 Cleaning workspace > git rev-parse --verify HEAD # timeout=10 Resetting working tree > git reset --hard # timeout=10 > git clean -fdx # timeout=10 [libvirt-python-master] $ /bin/sh -xe /tmp/jenkins4812163104799443150.sh + python setup.py build running build /usr/bin/pkg-config --print-errors --atleast-version=0.9.11 libvirt /usr/bin/python generator.py libvirt /home/jenkins/build/libvirt/share/libvirt/api/libvirt-api.xml Found 426 functions in /home/jenkins/build/libvirt/share/libvirt/api/libvirt-api.xml Found 0 functions in libvirt-override-api.xml Generated 346 wrapper functions Missing type converters: unsigned long long *:1 ERROR: failed virDomainMigrateGetMaxDowntime error: command '/usr/bin/python' failed with exit status 1 Build step 'Execute shell' marked build as failure
1 2
0 0
[Libvirt-ci] Build failed in Jenkins: libvirt-perl-master-test » libvirt-fedora-rawhide #605
by ci@centos.org 29 Aug '17

29 Aug '17
See <https://ci.centos.org/job/libvirt-perl-master-test/systems=libvirt-fedora-r…> ------------------------------------------ Started by upstream project "libvirt-perl-master-test" build number 605 originally caused by: Started by upstream project "libvirt-perl-master-build" build number 626 originally caused by: Started by upstream project "libvirt-master-build" build number 810 originally caused by: Started by an SCM change Started by an SCM change Started by an SCM change Started by an SCM change [EnvInject] - Loading node environment variables. Building remotely on libvirt-fedora-rawhide (libvirt) in workspace <https://ci.centos.org/job/libvirt-perl-master-test/systems=libvirt-fedora-r…> [libvirt-perl-master] $ /bin/sh -xe /tmp/jenkins2029731206666435122.sh + make -j3 test TEST_MAINTAINER=1 "/usr/bin/perl" -MExtUtils::Command::MM -e 'cp_nonempty' -- Virt.bs blib/arch/auto/Sys/Virt/Virt.bs 644 PERL_DL_NONLAZY=1 "/usr/bin/perl" "-MExtUtils::Command::MM" "-MTest::Harness" "-e" "undef *Test::Harness::Switches; test_harness(0, 'blib/lib', 'blib/arch')" t/*.t t/005-pod.t ............ ok t/010-pod-coverage.t ... ok t/015-changes.t ........ ok t/020-constants.t ...... ok # Failed test 'virDomainMigrateGetMaxDowntime' # at t/030-api-coverage.t line 159. # Looks like you failed 1 test of 1593. t/030-api-coverage.t ... Dubious, test returned 1 (wstat 256, 0x100) Failed 1/1593 subtests t/100-connect.t ........ ok t/200-domains.t ........ ok t/300-networks.t ....... ok t/400-storage-pools.t .. ok t/500-storage-vols.t ... ok t/600-interfaces.t ..... ok t/800-events.t ......... ok Test Summary Report ------------------- t/030-api-coverage.t (Wstat: 256 Tests: 1593 Failed: 1) Failed test: 204 Non-zero exit status: 1 Files=12, Tests=1845, 54 wallclock secs ( 0.47 usr 0.06 sys + 7.70 cusr 0.53 csys = 8.76 CPU) Result: FAIL Failed 1/12 test programs. 1/1845 subtests failed. make: *** [Makefile:1018: test_dynamic] Error 255 Build step 'Execute shell' marked build as failure
1 2
0 0
[Libvirt-ci] Build failed in Jenkins: libvirt-perl-master-test » libvirt-centos-7 #605
by ci@centos.org 29 Aug '17

29 Aug '17
See <https://ci.centos.org/job/libvirt-perl-master-test/systems=libvirt-centos-7…> ------------------------------------------ Started by upstream project "libvirt-perl-master-test" build number 605 originally caused by: Started by upstream project "libvirt-perl-master-build" build number 626 originally caused by: Started by upstream project "libvirt-master-build" build number 810 originally caused by: Started by an SCM change Started by an SCM change Started by an SCM change Started by an SCM change [EnvInject] - Loading node environment variables. Building remotely on libvirt-centos-7 (libvirt) in workspace <https://ci.centos.org/job/libvirt-perl-master-test/systems=libvirt-centos-7…> [libvirt-perl-master] $ /bin/sh -xe /tmp/jenkins5418186337673430495.sh + make -j3 test TEST_MAINTAINER=1 PERL_DL_NONLAZY=1 /usr/bin/perl "-MExtUtils::Command::MM" "-e" "test_harness(0, 'blib/lib', 'blib/arch')" t/*.t t/005-pod.t ............ ok t/010-pod-coverage.t ... ok t/015-changes.t ........ ok t/020-constants.t ...... ok # Failed test 'virDomainMigrateGetMaxDowntime' # at t/030-api-coverage.t line 159. # Looks like you failed 1 test of 1593. t/030-api-coverage.t ... Dubious, test returned 1 (wstat 256, 0x100) Failed 1/1593 subtests t/100-connect.t ........ ok t/200-domains.t ........ ok t/300-networks.t ....... ok t/400-storage-pools.t .. ok t/500-storage-vols.t ... ok t/600-interfaces.t ..... ok t/800-events.t ......... ok Test Summary Report ------------------- t/030-api-coverage.t (Wstat: 256 Tests: 1593 Failed: 1) Failed test: 204 Non-zero exit status: 1 Files=12, Tests=1845, 42 wallclock secs ( 0.40 usr 0.05 sys + 7.24 cusr 0.36 csys = 8.05 CPU) Result: FAIL Failed 1/12 test programs. 1/1845 subtests failed. make: *** [test_dynamic] Error 255 Build step 'Execute shell' marked build as failure
1 2
0 0
[Libvirt-ci] Build failed in Jenkins: libvirt-perl-master-test » libvirt-fedora-25 #605
by ci@centos.org 29 Aug '17

29 Aug '17
See <https://ci.centos.org/job/libvirt-perl-master-test/systems=libvirt-fedora-2…> ------------------------------------------ Started by upstream project "libvirt-perl-master-test" build number 605 originally caused by: Started by upstream project "libvirt-perl-master-build" build number 626 originally caused by: Started by upstream project "libvirt-master-build" build number 810 originally caused by: Started by an SCM change Started by an SCM change Started by an SCM change Started by an SCM change [EnvInject] - Loading node environment variables. Building remotely on libvirt-fedora-25 (libvirt) in workspace <https://ci.centos.org/job/libvirt-perl-master-test/systems=libvirt-fedora-2…> [libvirt-perl-master] $ /bin/sh -xe /tmp/jenkins5580705614626053524.sh + make -j3 test TEST_MAINTAINER=1 "/usr/bin/perl" -MExtUtils::Command::MM -e 'cp_nonempty' -- Virt.bs blib/arch/auto/Sys/Virt/Virt.bs 644 PERL_DL_NONLAZY=1 "/usr/bin/perl" "-MExtUtils::Command::MM" "-MTest::Harness" "-e" "undef *Test::Harness::Switches; test_harness(0, 'blib/lib', 'blib/arch')" t/*.t t/005-pod.t ............ ok t/010-pod-coverage.t ... ok t/015-changes.t ........ ok t/020-constants.t ...... ok # Failed test 'virDomainMigrateGetMaxDowntime' # at t/030-api-coverage.t line 159. # Looks like you failed 1 test of 1593. t/030-api-coverage.t ... Dubious, test returned 1 (wstat 256, 0x100) Failed 1/1593 subtests t/100-connect.t ........ ok t/200-domains.t ........ ok t/300-networks.t ....... ok t/400-storage-pools.t .. ok t/500-storage-vols.t ... ok t/600-interfaces.t ..... ok t/800-events.t ......... ok Test Summary Report ------------------- t/030-api-coverage.t (Wstat: 256 Tests: 1593 Failed: 1) Failed test: 204 Non-zero exit status: 1 Files=12, Tests=1845, 31 wallclock secs ( 0.45 usr 0.06 sys + 7.35 cusr 0.63 csys = 8.49 CPU) Result: FAIL Failed 1/12 test programs. 1/1845 subtests failed. Makefile:1018: recipe for target 'test_dynamic' failed make: *** [test_dynamic] Error 255 Build step 'Execute shell' marked build as failure
1 2
0 0
[Libvirt-ci] Build failed in Jenkins: libvirt-perl-master-test » libvirt-fedora-24 #605
by ci@centos.org 29 Aug '17

29 Aug '17
See <https://ci.centos.org/job/libvirt-perl-master-test/systems=libvirt-fedora-2…> ------------------------------------------ Started by upstream project "libvirt-perl-master-test" build number 605 originally caused by: Started by upstream project "libvirt-perl-master-build" build number 626 originally caused by: Started by upstream project "libvirt-master-build" build number 810 originally caused by: Started by an SCM change Started by an SCM change Started by an SCM change Started by an SCM change [EnvInject] - Loading node environment variables. Building remotely on libvirt-fedora-24 (libvirt) in workspace <https://ci.centos.org/job/libvirt-perl-master-test/systems=libvirt-fedora-2…> [libvirt-perl-master] $ /bin/sh -xe /tmp/jenkins7567582241607271833.sh + make -j3 test TEST_MAINTAINER=1 PERL_DL_NONLAZY=1 "/usr/bin/perl" "-MExtUtils::Command::MM" "-MTest::Harness" "-e" "undef *Test::Harness::Switches; test_harness(0, 'blib/lib', 'blib/arch')" t/*.t t/005-pod.t ............ ok t/010-pod-coverage.t ... ok t/015-changes.t ........ ok t/020-constants.t ...... ok # Failed test 'virDomainMigrateGetMaxDowntime' # at t/030-api-coverage.t line 159. # Looks like you failed 1 test of 1593. t/030-api-coverage.t ... Dubious, test returned 1 (wstat 256, 0x100) Failed 1/1593 subtests t/100-connect.t ........ ok t/200-domains.t ........ ok t/300-networks.t ....... ok t/400-storage-pools.t .. ok t/500-storage-vols.t ... ok t/600-interfaces.t ..... ok t/800-events.t ......... ok Test Summary Report ------------------- t/030-api-coverage.t (Wstat: 256 Tests: 1593 Failed: 1) Failed test: 204 Non-zero exit status: 1 Files=12, Tests=1845, 28 wallclock secs ( 0.36 usr 0.05 sys + 6.25 cusr 0.37 csys = 7.03 CPU) Result: FAIL Failed 1/12 test programs. 1/1845 subtests failed. Makefile:1030: recipe for target 'test_dynamic' failed make: *** [test_dynamic] Error 255 Build step 'Execute shell' marked build as failure
1 2
0 0
[Libvirt-ci] Build failed in Jenkins: libvirt-perl-master-test » libvirt-fedora-23 #605
by ci@centos.org 29 Aug '17

29 Aug '17
See <https://ci.centos.org/job/libvirt-perl-master-test/systems=libvirt-fedora-2…> ------------------------------------------ Started by upstream project "libvirt-perl-master-test" build number 605 originally caused by: Started by upstream project "libvirt-perl-master-build" build number 626 originally caused by: Started by upstream project "libvirt-master-build" build number 810 originally caused by: Started by an SCM change Started by an SCM change Started by an SCM change Started by an SCM change [EnvInject] - Loading node environment variables. Building remotely on libvirt-fedora-23 (libvirt) in workspace <https://ci.centos.org/job/libvirt-perl-master-test/systems=libvirt-fedora-2…> [libvirt-perl-master] $ /bin/sh -xe /tmp/jenkins7635531425961753627.sh + make -j3 test TEST_MAINTAINER=1 PERL_DL_NONLAZY=1 "/usr/bin/perl" "-MExtUtils::Command::MM" "-MTest::Harness" "-e" "undef *Test::Harness::Switches; test_harness(0, 'blib/lib', 'blib/arch')" t/*.t t/005-pod.t ............ ok t/010-pod-coverage.t ... ok t/015-changes.t ........ ok t/020-constants.t ...... ok # Failed test 'virDomainMigrateGetMaxDowntime' # at t/030-api-coverage.t line 159. # Looks like you failed 1 test of 1593. t/030-api-coverage.t ... Dubious, test returned 1 (wstat 256, 0x100) Failed 1/1593 subtests t/100-connect.t ........ ok t/200-domains.t ........ ok t/300-networks.t ....... ok t/400-storage-pools.t .. ok t/500-storage-vols.t ... ok t/600-interfaces.t ..... ok t/800-events.t ......... ok Test Summary Report ------------------- t/030-api-coverage.t (Wstat: 256 Tests: 1593 Failed: 1) Failed test: 204 Non-zero exit status: 1 Files=12, Tests=1845, 26 wallclock secs ( 0.41 usr 0.05 sys + 6.32 cusr 0.38 csys = 7.16 CPU) Result: FAIL Failed 1/12 test programs. 1/1845 subtests failed. Makefile:1030: recipe for target 'test_dynamic' failed make: *** [test_dynamic] Error 255 Build step 'Execute shell' marked build as failure
1 2
0 0
[Libvirt-ci] Errored: libvirt/libvirt#434 (master - 1f43393)
by Travis CI 28 Aug '17

28 Aug '17
Build Update for libvirt/libvirt ------------------------------------- Build: #434 Status: Errored Duration: 5 hours, 17 minutes, and 39 seconds Commit: 1f43393 (master) Author: Andrea Bolognani Message: qemu: Handle host devices not being available better We can't retrieve the isolation group of a device that's not present in the system. However, it's very common for VFs to be created late in the boot, so they might not be present yet when libvirtd starts, which would cause the guests using them to disappear. Moreover, for other architectures and even ppc64 before isolation groups were introduced, it's considered perfectly fine to configure a guest to use a device that's not yet (or no longer) available to the host, with the obvious caveat that such a guest won't be able to start before the device is available. In order to be consistent, when a device's isolation group can't be determined fall back to not isolating it rather than erroring out or, worse, making the guest disappear. Resolves: https://bugzilla.redhat.com/show_bug.cgi?id=1484254 Signed-off-by: Andrea Bolognani <abologna(a)redhat.com> View the changeset: https://github.com/libvirt/libvirt/compare/e02ff020cac1...1f43393283ff View the full build log and details: https://travis-ci.org/libvirt/libvirt/builds/269215855?utm_source=email&utm… -- You can configure recipients for build notifications in your .travis.yml file. See https://docs.travis-ci.com/user/notifications
1 0
0 0
  • ← Newer
  • 1
  • ...
  • 996
  • 997
  • 998
  • 999
  • 1000
  • 1001
  • 1002
  • ...
  • 1022
  • Older →

HyperKitty Powered by HyperKitty version 1.3.12.