libvirt List Archives
Sign In Sign Up
Manage this list Sign In Sign Up

Keyboard Shortcuts

Thread View

  • j: Next unread message
  • k: Previous unread message
  • j a: Jump to all threads
  • j l: Jump to MailingList overview

CI

Thread Start a new thread
Download
Threads by month
  • ----- 2025 -----
  • August
  • July
  • June
  • May
  • April
  • March
  • February
  • January
  • ----- 2024 -----
  • December
  • November
  • October
  • September
  • August
  • July
  • June
  • May
  • April
  • March
  • February
  • January
  • ----- 2023 -----
  • December
  • November
  • October
  • September
  • August
  • July
  • June
  • May
  • April
  • March
  • February
  • January
  • ----- 2022 -----
  • December
  • November
  • October
  • September
  • August
  • July
  • June
  • May
  • April
  • March
  • February
  • January
  • ----- 2021 -----
  • December
  • November
  • October
  • September
  • August
  • July
  • June
  • May
  • April
  • March
  • February
  • January
  • ----- 2020 -----
  • December
  • November
  • October
  • September
  • August
  • July
  • June
  • May
  • April
  • March
  • February
  • January
  • ----- 2019 -----
  • December
  • November
  • October
  • September
  • August
  • July
  • June
  • May
  • April
  • March
  • February
  • January
  • ----- 2018 -----
  • December
  • November
  • October
  • September
  • August
  • July
  • June
  • May
  • April
  • March
  • February
  • January
  • ----- 2017 -----
  • December
  • November
  • October
  • September
  • August
  • July
  • June
  • May
  • April
  • March
  • February
  • January
  • ----- 2016 -----
  • December
  • November
  • October
  • September
  • August
  • July
ci@lists.libvirt.org

December 2017

  • 2 participants
  • 48 discussions
[Libvirt-ci] Build failed in Jenkins: libvirt-go-xml-master-check » libvirt-centos-7 #52
by ci@centos.org 07 Dec '17

07 Dec '17
See <https://ci.centos.org/job/libvirt-go-xml-master-check/systems=libvirt-cento…> ------------------------------------------ Started by upstream project "libvirt-go-xml-master-check" build number 52 originally caused by: Started by upstream project "libvirt-go-xml-master-build" build number 57 originally caused by: Started by upstream project "libvirt-master-build" build number 1045 originally caused by: Started by an SCM change [EnvInject] - Loading node environment variables. Building remotely on libvirt-centos-7 (libvirt) in workspace <https://ci.centos.org/job/libvirt-go-xml-master-check/systems=libvirt-cento…> [libvirt-go-xml-master] $ /bin/sh -xe /tmp/jenkins8747042587439997645.sh + MAKE=make ++ uname + unamestr=Linux + '[' Linux = FreeBSD ']' + export PATH=/home/jenkins/build/libvirt/bin:/home/jenkins/build/libvirt/bin:/home/jenkins/build/libvirt/bin:/home/jenkins/build/libvirt/bin:/usr/local/sbin:/usr/local/bin:/usr/sbin:/usr/bin:/home/jenkins/.local/bin:/home/jenkins/bin + PATH=/home/jenkins/build/libvirt/bin:/home/jenkins/build/libvirt/bin:/home/jenkins/build/libvirt/bin:/home/jenkins/build/libvirt/bin:/usr/local/sbin:/usr/local/bin:/usr/sbin:/usr/bin:/home/jenkins/.local/bin:/home/jenkins/bin + export 'TEST_ARGS=-tags xmlroundtrip' + TEST_ARGS='-tags xmlroundtrip' + go test -tags xmlroundtrip --- FAIL: TestRoundTrip (15.45s) xml_test.go:345: testdata/libvirt/tests/nwfilterxml2firewalldata/arp.xml: /filter[0]/rule[0]/arp[0]/@protocolid: attribute 'arp' in expected XML missing in actual XML FAIL exit status 1 FAIL _<https://ci.centos.org/job/libvirt-go-xml-master-check/systems=libvirt-cento…> 15.602s Build step 'Execute shell' marked build as failure
1 2
0 0
[Libvirt-ci] Build failed in Jenkins: libvirt-go-xml-master-check » libvirt-debian-9 #52
by ci@centos.org 07 Dec '17

07 Dec '17
See <https://ci.centos.org/job/libvirt-go-xml-master-check/systems=libvirt-debia…> ------------------------------------------ Started by upstream project "libvirt-go-xml-master-check" build number 52 originally caused by: Started by upstream project "libvirt-go-xml-master-build" build number 57 originally caused by: Started by upstream project "libvirt-master-build" build number 1045 originally caused by: Started by an SCM change [EnvInject] - Loading node environment variables. Building remotely on libvirt-debian-9 (libvirt) in workspace <https://ci.centos.org/job/libvirt-go-xml-master-check/systems=libvirt-debia…> [libvirt-go-xml-master] $ /bin/sh -xe /tmp/jenkins5418792189509952139.sh + MAKE=make + uname + unamestr=Linux + [ Linux = FreeBSD ] + export PATH=/home/jenkins/build/libvirt/bin:/home/jenkins/build/libvirt/bin:/home/jenkins/build/libvirt/bin:/home/jenkins/build/libvirt/bin:/usr/local/bin:/usr/bin:/bin:/usr/local/games:/usr/games + export TEST_ARGS=-tags xmlroundtrip + go test -tags xmlroundtrip --- FAIL: TestRoundTrip (10.31s) xml_test.go:345: testdata/libvirt/tests/nwfilterxml2firewalldata/arp.xml: /filter[0]/rule[0]/arp[0]/@protocolid: attribute 'arp' in expected XML missing in actual XML FAIL exit status 1 FAIL _<https://ci.centos.org/job/libvirt-go-xml-master-check/systems=libvirt-debia…> 10.386s Build step 'Execute shell' marked build as failure
1 2
0 0
[Libvirt-ci] Build failed in Jenkins: libvirt-go-xml-master-check » libvirt-fedora-26 #52
by ci@centos.org 07 Dec '17

07 Dec '17
See <https://ci.centos.org/job/libvirt-go-xml-master-check/systems=libvirt-fedor…> ------------------------------------------ Started by upstream project "libvirt-go-xml-master-check" build number 52 originally caused by: Started by upstream project "libvirt-go-xml-master-build" build number 57 originally caused by: Started by upstream project "libvirt-master-build" build number 1045 originally caused by: Started by an SCM change [EnvInject] - Loading node environment variables. Building remotely on libvirt-fedora-26 (libvirt) in workspace <https://ci.centos.org/job/libvirt-go-xml-master-check/systems=libvirt-fedor…> [libvirt-go-xml-master] $ /bin/sh -xe /tmp/jenkins3845879640773431765.sh + MAKE=make ++ uname + unamestr=Linux + '[' Linux = FreeBSD ']' + export PATH=/home/jenkins/build/libvirt/bin:/home/jenkins/build/libvirt/bin:/home/jenkins/build/libvirt/bin:/home/jenkins/build/libvirt/bin:/usr/lib64/ccache:/usr/local/sbin:/usr/local/bin:/usr/sbin:/usr/bin:/home/jenkins/.local/bin:/home/jenkins/bin + PATH=/home/jenkins/build/libvirt/bin:/home/jenkins/build/libvirt/bin:/home/jenkins/build/libvirt/bin:/home/jenkins/build/libvirt/bin:/usr/lib64/ccache:/usr/local/sbin:/usr/local/bin:/usr/sbin:/usr/bin:/home/jenkins/.local/bin:/home/jenkins/bin + export 'TEST_ARGS=-tags xmlroundtrip' + TEST_ARGS='-tags xmlroundtrip' + go test -tags xmlroundtrip --- FAIL: TestRoundTrip (9.81s) xml_test.go:345: testdata/libvirt/tests/nwfilterxml2firewalldata/arp.xml: /filter[0]/rule[0]/arp[0]/@protocolid: attribute 'arp' in expected XML missing in actual XML FAIL exit status 1 FAIL _<https://ci.centos.org/job/libvirt-go-xml-master-check/systems=libvirt-fedor…> 9.901s Build step 'Execute shell' marked build as failure
1 2
0 0
[Libvirt-ci] Build failed in Jenkins: libvirt-go-xml-master-check » libvirt-fedora-27 #52
by ci@centos.org 07 Dec '17

07 Dec '17
See <https://ci.centos.org/job/libvirt-go-xml-master-check/systems=libvirt-fedor…> ------------------------------------------ Started by upstream project "libvirt-go-xml-master-check" build number 52 originally caused by: Started by upstream project "libvirt-go-xml-master-build" build number 57 originally caused by: Started by upstream project "libvirt-master-build" build number 1045 originally caused by: Started by an SCM change [EnvInject] - Loading node environment variables. Building remotely on libvirt-fedora-27 (libvirt) in workspace <https://ci.centos.org/job/libvirt-go-xml-master-check/systems=libvirt-fedor…> [libvirt-go-xml-master] $ /bin/sh -xe /tmp/jenkins276135589008534269.sh + MAKE=make ++ uname + unamestr=Linux + '[' Linux = FreeBSD ']' + export PATH=/home/jenkins/build/libvirt/bin:/home/jenkins/build/libvirt/bin:/home/jenkins/build/libvirt/bin:/home/jenkins/build/libvirt/bin:/usr/lib64/ccache:/usr/local/sbin:/usr/local/bin:/usr/sbin:/usr/bin:/home/jenkins/.local/bin:/home/jenkins/bin + PATH=/home/jenkins/build/libvirt/bin:/home/jenkins/build/libvirt/bin:/home/jenkins/build/libvirt/bin:/home/jenkins/build/libvirt/bin:/usr/lib64/ccache:/usr/local/sbin:/usr/local/bin:/usr/sbin:/usr/bin:/home/jenkins/.local/bin:/home/jenkins/bin + export 'TEST_ARGS=-tags xmlroundtrip' + TEST_ARGS='-tags xmlroundtrip' + go test -tags xmlroundtrip --- FAIL: TestRoundTrip (6.49s) xml_test.go:345: testdata/libvirt/tests/nwfilterxml2firewalldata/arp.xml: /filter[0]/rule[0]/arp[0]/@protocolid: attribute 'arp' in expected XML missing in actual XML FAIL exit status 1 FAIL _<https://ci.centos.org/job/libvirt-go-xml-master-check/systems=libvirt-fedor…> 6.627s Build step 'Execute shell' marked build as failure
1 2
0 0
[Libvirt-ci] Build failed in Jenkins: libvirt-go-xml-master-check » libvirt-debian-8 #52
by ci@centos.org 07 Dec '17

07 Dec '17
See <https://ci.centos.org/job/libvirt-go-xml-master-check/systems=libvirt-debia…> ------------------------------------------ Started by upstream project "libvirt-go-xml-master-check" build number 52 originally caused by: Started by upstream project "libvirt-go-xml-master-build" build number 57 originally caused by: Started by upstream project "libvirt-master-build" build number 1045 originally caused by: Started by an SCM change [EnvInject] - Loading node environment variables. Building remotely on libvirt-debian-8 (libvirt) in workspace <https://ci.centos.org/job/libvirt-go-xml-master-check/systems=libvirt-debia…> [libvirt-go-xml-master] $ /bin/sh -xe /tmp/jenkins8510854499970527416.sh + MAKE=make + uname + unamestr=Linux + [ Linux = FreeBSD ] + export PATH=/home/jenkins/build/libvirt/bin:/home/jenkins/build/libvirt/bin:/home/jenkins/build/libvirt/bin:/home/jenkins/build/libvirt/bin:/usr/local/bin:/usr/bin:/bin:/usr/local/games:/usr/games + export TEST_ARGS=-tags xmlroundtrip + go test -tags xmlroundtrip --- FAIL: TestRoundTrip (12.14 seconds) xml_test.go:345: testdata/libvirt/tests/nwfilterxml2firewalldata/arp.xml: /filter[0]/rule[0]/arp[0]/@protocolid: attribute 'arp' in expected XML missing in actual XML FAIL exit status 1 FAIL _<https://ci.centos.org/job/libvirt-go-xml-master-check/systems=libvirt-debia…> 12.320s Build step 'Execute shell' marked build as failure
1 2
0 0
[Libvirt-ci] Build failed in Jenkins: libvirt-go-xml-master-check » libvirt-freebsd-11 #52
by ci@centos.org 07 Dec '17

07 Dec '17
See <https://ci.centos.org/job/libvirt-go-xml-master-check/systems=libvirt-freeb…> ------------------------------------------ Started by upstream project "libvirt-go-xml-master-check" build number 52 originally caused by: Started by upstream project "libvirt-go-xml-master-build" build number 57 originally caused by: Started by upstream project "libvirt-master-build" build number 1045 originally caused by: Started by an SCM change [EnvInject] - Loading node environment variables. Building remotely on libvirt-freebsd-11 (libvirt) in workspace <https://ci.centos.org/job/libvirt-go-xml-master-check/systems=libvirt-freeb…> [libvirt-go-xml-master] $ /bin/sh -xe /tmp/jenkins2870696989370531357.sh + MAKE=make + uname + unamestr=FreeBSD + [ FreeBSD '=' FreeBSD ] + MAKE=gmake + export 'PATH=/home/jenkins/build/libvirt/bin:/home/jenkins/build/libvirt/bin:/home/jenkins/build/libvirt/bin:/home/jenkins/build/libvirt/bin:/sbin:/bin:/usr/sbin:/usr/bin:/usr/local/sbin:/usr/local/bin:/home/jenkins/bin' + export 'TEST_ARGS=-tags xmlroundtrip' + go test -tags xmlroundtrip --- FAIL: TestRoundTrip (10.26s) xml_test.go:345: testdata/libvirt/tests/nwfilterxml2firewalldata/arp.xml: /filter[0]/rule[0]/arp[0]/@protocolid: attribute 'arp' in expected XML missing in actual XML FAIL exit status 1 FAIL _/usr<https://ci.centos.org/job/libvirt-go-xml-master-check/systems=libvirt-freeb…> 10.354s Build step 'Execute shell' marked build as failure
1 2
0 0
[Libvirt-ci] Build failed in Jenkins: libvirt-go-xml-master-check » libvirt-freebsd-10 #52
by ci@centos.org 07 Dec '17

07 Dec '17
See <https://ci.centos.org/job/libvirt-go-xml-master-check/systems=libvirt-freeb…> ------------------------------------------ Started by upstream project "libvirt-go-xml-master-check" build number 52 originally caused by: Started by upstream project "libvirt-go-xml-master-build" build number 57 originally caused by: Started by upstream project "libvirt-master-build" build number 1045 originally caused by: Started by an SCM change [EnvInject] - Loading node environment variables. Building remotely on libvirt-freebsd-10 (libvirt) in workspace <https://ci.centos.org/job/libvirt-go-xml-master-check/systems=libvirt-freeb…> [libvirt-go-xml-master] $ /bin/sh -xe /tmp/jenkins5668490481279615355.sh + MAKE=make + uname + unamestr=FreeBSD + [ FreeBSD = FreeBSD ] + MAKE=gmake + export PATH=/home/jenkins/build/libvirt/bin:/home/jenkins/build/libvirt/bin:/home/jenkins/build/libvirt/bin:/home/jenkins/build/libvirt/bin:/sbin:/bin:/usr/sbin:/usr/bin:/usr/games:/usr/local/sbin:/usr/local/bin:/home/jenkins/bin + export 'TEST_ARGS=-tags xmlroundtrip' + go test -tags xmlroundtrip --- FAIL: TestRoundTrip (10.82s) xml_test.go:345: testdata/libvirt/tests/nwfilterxml2firewalldata/arp.xml: /filter[0]/rule[0]/arp[0]/@protocolid: attribute 'arp' in expected XML missing in actual XML FAIL exit status 1 FAIL _/usr<https://ci.centos.org/job/libvirt-go-xml-master-check/systems=libvirt-freeb…> 10.933s Build step 'Execute shell' marked build as failure
1 2
0 0
[Libvirt-ci] Passed: libvirt/libvirt#745 (master - f28ed2e)
by Travis CI 05 Dec '17

05 Dec '17
Build Update for libvirt/libvirt ------------------------------------- Build: #745 Status: Passed Duration: 19 minutes and 59 seconds Commit: f28ed2e (master) Author: Andrea Bolognani Message: travis: Don't try to install brew packages twice gettext, gnutls and libgcrypt are already installed on the system, so we don't need to request their installation. Signed-off-by: Andrea Bolognani <abologna(a)redhat.com> Reviewed-by: Daniel P. Berrange <berrange(a)redhat.com> View the changeset: https://github.com/libvirt/libvirt/compare/ad24406440e8...f28ed2e98c83 View the full build log and details: https://travis-ci.org/libvirt/libvirt/builds/311786827?utm_source=email&utm… -- You can configure recipients for build notifications in your .travis.yml file. See https://docs.travis-ci.com/user/notifications
1 0
0 0
[Libvirt-ci] Passed: libvirt/libvirt#746 (master - 1c57eea)
by Travis CI 05 Dec '17

05 Dec '17
Build Update for libvirt/libvirt ------------------------------------- Build: #746 Status: Passed Duration: 33 minutes and 11 seconds Commit: 1c57eea (master) Author: Pavel Hrdina Message: qemu: fix security labeling for attach/detach of char devices Commit e93d844b90 was not enough to fix the permission denied issue. We need to apply security labels as well. Resolves: https://bugzilla.redhat.com/show_bug.cgi?id=1465833 Signed-off-by: Pavel Hrdina <phrdina(a)redhat.com> View the changeset: https://github.com/libvirt/libvirt/compare/f28ed2e98c83...1c57eea3625f View the full build log and details: https://travis-ci.org/libvirt/libvirt/builds/311845128?utm_source=email&utm… -- You can configure recipients for build notifications in your .travis.yml file. See https://docs.travis-ci.com/user/notifications
1 0
0 0
[Libvirt-ci] Build failed in Jenkins: libvirt-master-check » libvirt-centos-7 #779
by ci@centos.org 05 Dec '17

05 Dec '17
See <https://ci.centos.org/job/libvirt-master-check/systems=libvirt-centos-7/779…> ------------------------------------------ [...truncated 24.72 KB...] PASS: test-btowc1.sh PASS: test-byteswap PASS: test-c-ctype PASS: test-canonicalize-lgpl PASS: test-c-strcase.sh PASS: test-cloexec PASS: test-chown PASS: test-close PASS: test-connect PASS: test-count-leading-zeros PASS: test-count-one-bits PASS: test-md5 PASS: test-dup PASS: test-c-strcasestr PASS: test-ctype PASS: test-dup2 PASS: test-environ PASS: test-errno PASS: test-fclose PASS: test-fcntl-h PASS: test-fcntl PASS: test-fdatasync PASS: test-fflush PASS: test-fdopen PASS: test-ffs PASS: test-fflush2.sh PASS: test-ffsl PASS: test-fgetc PASS: test-float PASS: test-fnmatch PASS: test-fpurge PASS: test-fputc PASS: test-freading PASS: test-fread PASS: test-fseek.sh PASS: test-fseeko2.sh PASS: test-fseek2.sh PASS: test-fseeko.sh PASS: test-fseeko3.sh PASS: test-fseeko4.sh PASS: test-fstat PASS: test-fsync PASS: test-ftell2.sh PASS: test-ftell.sh PASS: test-ftell3 PASS: test-ftello3 PASS: test-ftello.sh PASS: test-ftello2.sh PASS: test-ftello4.sh PASS: test-ftruncate.sh PASS: test-func PASS: test-fwrite PASS: test-getcwd-lgpl PASS: test-getdelim PASS: test-getgroups PASS: test-getdtablesize PASS: test-getaddrinfo PASS: test-gethostname PASS: test-getline PASS: test-getopt-posix PASS: test-getpeername PASS: test-getprogname PASS: test-getsockname PASS: test-getsockopt PASS: test-gettimeofday PASS: test-grantpt PASS: test-inet_pton PASS: test-inet_ntop PASS: test-ignore-value PASS: test-inttypes PASS: test-intprops PASS: test-ioctl PASS: test-isblank PASS: test-isatty PASS: test-isnand-nolibm PASS: test-isnanf-nolibm PASS: test-isnanl-nolibm PASS: test-langinfo PASS: test-limits-h PASS: test-ldexp PASS: test-listen PASS: test-locale PASS: test-localeconv PASS: test-lstat PASS: test-lseek.sh PASS: test-malloca PASS: test-math PASS: test-mbrtowc1.sh PASS: test-mbrtowc2.sh PASS: test-mbrtowc4.sh PASS: test-localename PASS: test-mbrtowc3.sh PASS: test-mbrtowc5.sh SKIP: test-mbrtowc-w32-1.sh SKIP: test-mbrtowc-w32-2.sh SKIP: test-mbrtowc-w32-5.sh SKIP: test-mbrtowc-w32-3.sh SKIP: test-mbrtowc-w32-4.sh PASS: test-mbsinit.sh PASS: test-mbsrtowcs1.sh PASS: test-mbsrtowcs3.sh PASS: test-mbsrtowcs2.sh PASS: test-mbsrtowcs4.sh PASS: test-net_if PASS: test-netdb PASS: test-netinet_in PASS: test-nl_langinfo.sh PASS: test-memchr PASS: test-nanosleep PASS: test-nonblocking PASS: test-open PASS: test-openpty PASS: test-passfd PASS: test-pathmax PASS: test-perror.sh PASS: test-perror2 PASS: test-pipe PASS: test-pipe2 PASS: test-poll-h PASS: test-poll PASS: test-posix_openpt PASS: test-posix_spawn_file_actions_addclose PASS: test-posix_spawn_file_actions_adddup2 PASS: test-posix_spawn_file_actions_addopen PASS: test-posix_spawn1 PASS: test-posix_spawn2 PASS: test-pthread_sigmask1 PASS: test-nonblocking-pipe.sh SKIP: test-ptsname SKIP: test-ptsname_r PASS: test-raise PASS: test-random_r PASS: test-rawmemchr PASS: test-read PASS: test-pthread_sigmask2 PASS: test-readlink PASS: test-recv PASS: test-regex PASS: test-sched PASS: test-select PASS: test-nonblocking-socket.sh PASS: test-send PASS: test-setenv PASS: test-setlocale1.sh PASS: test-select-out.sh PASS: test-setsockopt PASS: test-sigaction PASS: test-setlocale2.sh PASS: test-signal-h PASS: test-signbit PASS: test-sigpipe.sh PASS: test-select-in.sh PASS: test-snprintf PASS: test-sockets PASS: test-spawn PASS: test-stat PASS: test-stat-time PASS: test-stdalign PASS: test-stdbool PASS: test-stddef PASS: test-stdint PASS: test-stdio PASS: test-stdlib PASS: test-sigprocmask PASS: test-strchrnul PASS: test-strerror PASS: test-strerror_r PASS: test-sleep PASS: test-string PASS: test-strings PASS: test-strnlen PASS: test-symlink PASS: test-sys_ioctl PASS: test-sys_select PASS: test-sys_socket PASS: test-sys_stat PASS: test-sys_time PASS: test-sys_types PASS: test-sys_uio PASS: test-sys_utsname PASS: test-sys_wait PASS: test-termios PASS: test-thread_self PASS: test-thread_create PASS: test-time SKIP: test-ttyname_r PASS: test-uname PASS: test-unistd PASS: test-unlockpt PASS: test-unsetenv PASS: test-vasnprintf PASS: test-vasprintf PASS: test-init.sh SKIP: test-vc-list-files-cvs.sh PASS: test-verify ../../../build-aux/test-driver: line 95: 9646 Aborted "$@" > $log_file 2>&1 FAIL: test-usleep PASS: test-vsnprintf PASS: test-wchar PASS: test-vc-list-files-git.sh PASS: test-wcrtomb.sh SKIP: test-wcrtomb-w32-1.sh SKIP: test-wcrtomb-w32-3.sh SKIP: test-wcrtomb-w32-2.sh SKIP: test-wcrtomb-w32-4.sh PASS: test-wctype-h SKIP: test-wcrtomb-w32-5.sh PASS: test-write PASS: test-xalloc-die.sh PASS: test-verify.sh make[6]: Entering directory `<https://ci.centos.org/job/libvirt-master-check/systems=libvirt-centos-7/ws/…'> make all-recursive make[7]: Entering directory `<https://ci.centos.org/job/libvirt-master-check/systems=libvirt-centos-7/ws/…'> Making all in . make[8]: Entering directory `<https://ci.centos.org/job/libvirt-master-check/systems=libvirt-centos-7/ws/…'> make[8]: Nothing to be done for `all-am'. make[8]: Leaving directory `<https://ci.centos.org/job/libvirt-master-check/systems=libvirt-centos-7/ws/…'> make[7]: Leaving directory `<https://ci.centos.org/job/libvirt-master-check/systems=libvirt-centos-7/ws/…'> make[6]: Leaving directory `<https://ci.centos.org/job/libvirt-master-check/systems=libvirt-centos-7/ws/…'> ============================================================================ Testsuite summary for libvirt 3.11.0 ============================================================================ # TOTAL: 218 # PASS: 203 # SKIP: 14 # XFAIL: 0 # FAIL: 1 # XPASS: 0 # ERROR: 0 ============================================================================ See gnulib/tests/test-suite.log Please report to libvir-list(a)redhat.com ============================================================================ make[5]: *** [test-suite.log] Error 1 make[5]: Leaving directory `<https://ci.centos.org/job/libvirt-master-check/systems=libvirt-centos-7/ws/…'> make[4]: *** [check-TESTS] Error 2 make[4]: Leaving directory `<https://ci.centos.org/job/libvirt-master-check/systems=libvirt-centos-7/ws/…'> make[3]: *** [check-am] Error 2 make[3]: Leaving directory `<https://ci.centos.org/job/libvirt-master-check/systems=libvirt-centos-7/ws/…'> make[2]: *** [check-recursive] Error 1 make[2]: Leaving directory `<https://ci.centos.org/job/libvirt-master-check/systems=libvirt-centos-7/ws/…'> make[1]: *** [check] Error 2 make[1]: Leaving directory `<https://ci.centos.org/job/libvirt-master-check/systems=libvirt-centos-7/ws/…'> make: *** [check-recursive] Error 1 + cat tests/test-suite.log cat: tests/test-suite.log: No such file or directory + true + exit 1 Build step 'Execute shell' marked build as failure
1 1
0 0
  • ← Newer
  • 1
  • 2
  • 3
  • 4
  • 5
  • Older →

HyperKitty Powered by HyperKitty version 1.3.12.