libvirt List Archives
Sign In Sign Up
Manage this list Sign In Sign Up

Keyboard Shortcuts

Thread View

  • j: Next unread message
  • k: Previous unread message
  • j a: Jump to all threads
  • j l: Jump to MailingList overview

CI

Thread Start a new thread
Download
Threads by month
  • ----- 2025 -----
  • August
  • July
  • June
  • May
  • April
  • March
  • February
  • January
  • ----- 2024 -----
  • December
  • November
  • October
  • September
  • August
  • July
  • June
  • May
  • April
  • March
  • February
  • January
  • ----- 2023 -----
  • December
  • November
  • October
  • September
  • August
  • July
  • June
  • May
  • April
  • March
  • February
  • January
  • ----- 2022 -----
  • December
  • November
  • October
  • September
  • August
  • July
  • June
  • May
  • April
  • March
  • February
  • January
  • ----- 2021 -----
  • December
  • November
  • October
  • September
  • August
  • July
  • June
  • May
  • April
  • March
  • February
  • January
  • ----- 2020 -----
  • December
  • November
  • October
  • September
  • August
  • July
  • June
  • May
  • April
  • March
  • February
  • January
  • ----- 2019 -----
  • December
  • November
  • October
  • September
  • August
  • July
  • June
  • May
  • April
  • March
  • February
  • January
  • ----- 2018 -----
  • December
  • November
  • October
  • September
  • August
  • July
  • June
  • May
  • April
  • March
  • February
  • January
  • ----- 2017 -----
  • December
  • November
  • October
  • September
  • August
  • July
  • June
  • May
  • April
  • March
  • February
  • January
  • ----- 2016 -----
  • December
  • November
  • October
  • September
  • August
  • July
ci@lists.libvirt.org

October 2023

  • 2 participants
  • 746 discussions
[Libvirt-ci] Build failed in Jenkins: libvirt-master-build » libvirt-centos-6 #637
by ci@centos.org 26 Oct '23

26 Oct '23
See <https://ci.centos.org/job/libvirt-master-build/systems=libvirt-centos-6/637…> ------------------------------------------ [...truncated 74.65 KB...] Removing m4/sys_ioctl_h.m4 Removing m4/sys_select_h.m4 Removing m4/sys_socket_h.m4 Removing m4/sys_stat_h.m4 Removing m4/sys_time_h.m4 Removing m4/sys_types_h.m4 Removing m4/sys_uio_h.m4 Removing m4/sys_utsname_h.m4 Removing m4/sys_wait_h.m4 Removing m4/tempname.m4 Removing m4/termios_h.m4 Removing m4/thread.m4 Removing m4/threadlib.m4 Removing m4/time_h.m4 Removing m4/time_r.m4 Removing m4/timegm.m4 Removing m4/tm_gmtoff.m4 Removing m4/ttyname_r.m4 Removing m4/uintmax_t.m4 Removing m4/uname.m4 Removing m4/ungetc.m4 Removing m4/unistd_h.m4 Removing m4/unlockpt.m4 Removing m4/usleep.m4 Removing m4/vasnprintf.m4 Removing m4/vasprintf.m4 Removing m4/visibility.m4 Removing m4/vsnprintf.m4 Removing m4/wait-process.m4 Removing m4/waitpid.m4 Removing m4/warn-on-use.m4 Removing m4/warnings.m4 Removing m4/wchar_h.m4 Removing m4/wchar_t.m4 Removing m4/wchar_t.m4~ Removing m4/wcrtomb.m4 Removing m4/wctob.m4 Removing m4/wctomb.m4 Removing m4/wctype_h.m4 Removing m4/wint_t.m4 Removing m4/wint_t.m4~ Removing m4/write.m4 Removing m4/xalloc.m4 Removing m4/xsize.m4 Removing m4/xsize.m4~ Removing maint.mk Removing po/.gitignore Removing po/Makefile.in.in Removing po/Makevars Removing po/Makevars.template Removing po/Rules-quot Removing po/af.gmo Removing po/am.gmo Removing po/anp.gmo Removing po/ar.gmo Removing po/as.gmo Removing po/ast.gmo Removing po/bal.gmo Removing po/be.gmo Removing po/bg.gmo Removing po/bn.gmo Removing po/bn_IN.gmo Removing po/bo.gmo Removing po/boldquot.sed Removing po/br.gmo Removing po/brx.gmo Removing po/bs.gmo Removing po/ca.gmo Removing po/cs.gmo Removing po/cy.gmo Removing po/da.gmo Removing po/de.gmo Removing po/de_CH.gmo Removing po/el.gmo Removing po/en(a)boldquot.header Removing po/en(a)quot.header Removing po/en_GB.gmo Removing po/eo.gmo Removing po/es.gmo Removing po/et.gmo Removing po/eu.gmo Removing po/fa.gmo Removing po/fi.gmo Removing po/fr.gmo Removing po/gl.gmo Removing po/gu.gmo Removing po/he.gmo Removing po/hi.gmo Removing po/hr.gmo Removing po/hu.gmo Removing po/ia.gmo Removing po/id.gmo Removing po/ilo.gmo Removing po/insert-header.sin Removing po/is.gmo Removing po/it.gmo Removing po/ja.gmo Removing po/ka.gmo Removing po/kk.gmo Removing po/km.gmo Removing po/kn.gmo Removing po/ko.gmo Removing po/kw.gmo Removing po/kw(a)kkcor.gmo Removing po/kw(a)uccor.gmo Removing po/kw_GB.gmo Removing po/ky.gmo Removing po/lt.gmo Removing po/lv.gmo Removing po/mai.gmo Removing po/mk.gmo Removing po/ml.gmo Removing po/mn.gmo Removing po/mr.gmo Removing po/ms.gmo Removing po/nb.gmo Removing po/nds.gmo Removing po/ne.gmo Removing po/nl.gmo Removing po/nn.gmo Removing po/nso.gmo Removing po/or.gmo Removing po/pa.gmo Removing po/pl.gmo Removing po/pt.gmo Removing po/pt_BR.gmo Removing po/quot.sed Removing po/remove-potcdate.sin Removing po/ro.gmo Removing po/ru.gmo Removing po/si.gmo Removing po/sk.gmo Removing po/sl.gmo Removing po/sq.gmo Removing po/sr.gmo Removing po/sr(a)latin.gmo Removing po/sv.gmo Removing po/ta.gmo Removing po/te.gmo Removing po/tg.gmo Removing po/th.gmo Removing po/tr.gmo Removing po/tw.gmo Removing po/uk.gmo Removing po/ur.gmo Removing po/vi.gmo Removing po/wba.gmo Removing po/yo.gmo Removing po/zh_CN.gmo Removing po/zh_HK.gmo Removing po/zh_TW.gmo Removing po/zu.gmo Removing src/Makefile.in Removing src/access/org.libvirt.api.policy Removing src/access/viraccessapicheck.c Removing src/access/viraccessapicheck.h Removing src/access/viraccessapichecklxc.c Removing src/access/viraccessapichecklxc.h Removing src/access/viraccessapicheckqemu.c Removing src/access/viraccessapicheckqemu.h Removing src/admin/admin_client.h Removing src/admin/admin_protocol.c Removing src/admin/admin_protocol.h Removing src/esx/esx_vi.generated.c Removing src/esx/esx_vi.generated.h Removing src/esx/esx_vi_methods.generated.c Removing src/esx/esx_vi_methods.generated.h Removing src/esx/esx_vi_methods.generated.macro Removing src/esx/esx_vi_types.generated.c Removing src/esx/esx_vi_types.generated.h Removing src/esx/esx_vi_types.generated.typedef Removing src/esx/esx_vi_types.generated.typeenum Removing src/esx/esx_vi_types.generated.typefromstring Removing src/esx/esx_vi_types.generated.typetostring Removing src/hyperv/hyperv_wmi_classes.generated.c Removing src/hyperv/hyperv_wmi_classes.generated.h Removing src/hyperv/hyperv_wmi_classes.generated.typedef Removing src/locking/lock_daemon_dispatch_stubs.h Removing src/locking/lock_protocol.c Removing src/locking/lock_protocol.h Removing src/logging/log_daemon_dispatch_stubs.h Removing src/logging/log_protocol.c Removing src/logging/log_protocol.h Removing src/lxc/lxc_controller_dispatch.h Removing src/lxc/lxc_monitor_dispatch.h Removing src/lxc/lxc_monitor_protocol.c Removing src/lxc/lxc_monitor_protocol.h Removing src/remote/lxc_client_bodies.h Removing src/remote/lxc_protocol.c Removing src/remote/lxc_protocol.h Removing src/remote/qemu_client_bodies.h Removing src/remote/qemu_protocol.c Removing src/remote/qemu_protocol.h Removing src/remote/remote_client_bodies.h Removing src/remote/remote_protocol.c Removing src/remote/remote_protocol.h Removing src/rpc/virkeepaliveprotocol.c Removing src/rpc/virkeepaliveprotocol.h Removing src/rpc/virnetprotocol.c Removing src/rpc/virnetprotocol.h Removing tests/Makefile.in Removing tools/Makefile.in stderr: warning: failed to remove 'autom4te.cache/' warning: failed to remove 'build/' warning: failed to remove 'gnulib/lib/glthread/' warning: failed to remove 'gnulib/tests/glthread/' at org.jenkinsci.plugins.gitclient.CliGitAPIImpl.launchCommandIn(CliGitAPIImpl.java:1833) at org.jenkinsci.plugins.gitclient.CliGitAPIImpl.launchCommandIn(CliGitAPIImpl.java:1801) at org.jenkinsci.plugins.gitclient.CliGitAPIImpl.launchCommandIn(CliGitAPIImpl.java:1797) at org.jenkinsci.plugins.gitclient.CliGitAPIImpl.launchCommand(CliGitAPIImpl.java:1442) at org.jenkinsci.plugins.gitclient.CliGitAPIImpl.launchCommand(CliGitAPIImpl.java:1454) at org.jenkinsci.plugins.gitclient.CliGitAPIImpl.clean(CliGitAPIImpl.java:706) at hudson.plugins.git.GitAPI.clean(GitAPI.java:311) at sun.reflect.NativeMethodAccessorImpl.invoke0(Native Method) at sun.reflect.NativeMethodAccessorImpl.invoke(NativeMethodAccessorImpl.java:57) at sun.reflect.DelegatingMethodAccessorImpl.invoke(DelegatingMethodAccessorImpl.java:43) at java.lang.reflect.Method.invoke(Method.java:606) at hudson.remoting.RemoteInvocationHandler$RPCRequest.perform(RemoteInvocationHandler.java:320) at hudson.remoting.RemoteInvocationHandler$RPCRequest.call(RemoteInvocationHandler.java:295) at hudson.remoting.RemoteInvocationHandler$RPCRequest.call(RemoteInvocationHandler.java:254) at hudson.remoting.UserRequest.perform(UserRequest.java:121) at hudson.remoting.UserRequest.perform(UserRequest.java:49) at hudson.remoting.Request$2.run(Request.java:324) at hudson.remoting.InterceptingExecutorService$1.call(InterceptingExecutorService.java:68) at java.util.concurrent.FutureTask.run(FutureTask.java:262) at java.util.concurrent.ThreadPoolExecutor.runWorker(ThreadPoolExecutor.java:1145) at java.util.concurrent.ThreadPoolExecutor$Worker.run(ThreadPoolExecutor.java:615) at hudson.remoting.Engine$1$1.run(Engine.java:63) at java.lang.Thread.run(Thread.java:748) at ......remote call to Channel to /172.19.1.12(Native Method) at hudson.remoting.Channel.attachCallSiteStackTrace(Channel.java:1545) at hudson.remoting.UserResponse.retrieve(UserRequest.java:253) at hudson.remoting.Channel.call(Channel.java:830) at hudson.remoting.RemoteInvocationHandler.invoke(RemoteInvocationHandler.java:257) at com.sun.proxy.$Proxy74.clean(Unknown Source) at org.jenkinsci.plugins.gitclient.RemoteGitImpl.clean(RemoteGitImpl.java:450) at hudson.plugins.git.extensions.impl.CleanCheckout.onCheckoutCompleted(CleanCheckout.java:28) at hudson.plugins.git.GitSCM.checkout(GitSCM.java:1176) at hudson.scm.SCM.checkout(SCM.java:496) at hudson.model.AbstractProject.checkout(AbstractProject.java:1281) at hudson.model.AbstractBuild$AbstractBuildExecution.defaultCheckout(AbstractBuild.java:604) at jenkins.scm.SCMCheckoutStrategy.checkout(SCMCheckoutStrategy.java:86) at hudson.model.AbstractBuild$AbstractBuildExecution.run(AbstractBuild.java:529) at hudson.model.Run.execute(Run.java:1728) at hudson.matrix.MatrixRun.run(MatrixRun.java:146) at hudson.model.ResourceController.execute(ResourceController.java:98) at hudson.model.Executor.run(Executor.java:405)
1 1
0 0
[Libvirt-ci] Build failed in Jenkins: libvirt-master-mingw » libvirt-fedora-rawhide #1196
by ci@centos.org 26 Oct '23

26 Oct '23
See <https://ci.centos.org/job/libvirt-master-mingw/systems=libvirt-fedora-rawhi…> Changes: [mkletzan] Report more correct information for cache control ------------------------------------------ [...truncated 41.59 KB...] Copying file gnulib/lib/timegm.c Copying file gnulib/lib/ttyname_r.c Copying file gnulib/lib/uname.c Copying file gnulib/lib/unistd.c Copying file gnulib/lib/unistd.in.h Copying file gnulib/lib/unsetenv.c Copying file gnulib/lib/unused-parameter.h Copying file gnulib/lib/usleep.c Copying file gnulib/lib/vasnprintf.c Copying file gnulib/lib/vasnprintf.h Copying file gnulib/lib/vasprintf.c Copying file gnulib/lib/verify.h Copying file gnulib/lib/vsnprintf.c Copying file gnulib/lib/w32sock.h Copying file gnulib/lib/waitpid.c Copying file gnulib/lib/warn-on-use.h Copying file gnulib/lib/wchar.in.h Copying file gnulib/lib/wcrtomb.c Copying file gnulib/lib/wctype-h.c Copying file gnulib/lib/wctype.in.h Copying file gnulib/lib/xalloc-oversized.h Copying file gnulib/lib/xsize.c Copying file gnulib/lib/xsize.h Copying file gnulib/tests/_Noreturn.h Copying file gnulib/tests/arg-nonnull.h Copying file gnulib/tests/c++defs.h Copying file gnulib/tests/ctype.in.h Copying file gnulib/tests/dup.c Copying file gnulib/tests/error.c Copying file gnulib/tests/error.h Copying file gnulib/tests/exitfail.c Copying file gnulib/tests/exitfail.h Copying file gnulib/tests/fatal-signal.c Copying file gnulib/tests/fatal-signal.h Copying file gnulib/tests/fdopen.c Copying file gnulib/tests/float+.h Copying file gnulib/tests/fpucw.h Copying file gnulib/tests/ftruncate.c Copying file gnulib/tests/getpagesize.c Copying file gnulib/tests/getprogname.c Copying file gnulib/tests/getprogname.h Copying file gnulib/tests/getsockopt.c Copying file gnulib/tests/glthread/thread.c Copying file gnulib/tests/glthread/thread.h Copying file gnulib/tests/grantpt.c Copying file gnulib/tests/infinity.h Copying file gnulib/tests/init.sh Copying file gnulib/tests/inttypes.in.h Copying file gnulib/tests/isblank.c Copying file gnulib/tests/isnan.c Copying file gnulib/tests/isnand-nolibm.h Copying file gnulib/tests/isnand.c Copying file gnulib/tests/isnanf-nolibm.h Copying file gnulib/tests/isnanf.c Copying file gnulib/tests/isnanl-nolibm.h Copying file gnulib/tests/isnanl.c Copying file gnulib/tests/localename.c Copying file gnulib/tests/localename.h Copying file gnulib/tests/macros.h Copying file gnulib/tests/math.c Copying file gnulib/tests/math.in.h Copying file gnulib/tests/minus-zero.h Copying file gnulib/tests/nan.h Copying file gnulib/tests/nanosleep.c Copying file gnulib/tests/nap.h Copying file gnulib/tests/null-ptr.h Copying file gnulib/tests/ptsname.c Copying file gnulib/tests/ptsname_r.c Copying file gnulib/tests/pty-private.h Copying file gnulib/tests/putenv.c Copying file gnulib/tests/randomd.c Copying file gnulib/tests/read.c Copying file gnulib/tests/same-inode.h Copying file gnulib/tests/setlocale.c Copying file gnulib/tests/signature.h Copying file gnulib/tests/signbitd.c Copying file gnulib/tests/signbitf.c Copying file gnulib/tests/signbitl.c Copying file gnulib/tests/socket-client.h Copying file gnulib/tests/socket-server.h Copying file gnulib/tests/spawn.in.h Copying file gnulib/tests/spawn_faction_addclose.c Copying file gnulib/tests/spawn_faction_adddup2.c Copying file gnulib/tests/spawn_faction_addopen.c Copying file gnulib/tests/spawn_faction_destroy.c Copying file gnulib/tests/spawn_faction_init.c Copying file gnulib/tests/spawn_int.h Copying file gnulib/tests/spawnattr_destroy.c Copying file gnulib/tests/spawnattr_init.c Copying file gnulib/tests/spawnattr_setflags.c Copying file gnulib/tests/spawnattr_setsigmask.c Copying file gnulib/tests/spawni.c Copying file gnulib/tests/spawnp.c Copying file gnulib/tests/symlink.c Copying file gnulib/tests/test-accept.c Copying file gnulib/tests/test-alloca-opt.c Copying file gnulib/tests/test-areadlink.c Copying file gnulib/tests/test-areadlink.h Copying file gnulib/tests/test-arpa_inet.c Copying file gnulib/tests/test-base64.c Copying file gnulib/tests/test-binary-io.c Copying file gnulib/tests/test-binary-io.sh Copying file gnulib/tests/test-bind.c Copying file gnulib/tests/test-bitrotate.c Copying file gnulib/tests/test-btowc.c Copying file gnulib/tests/test-btowc1.sh Copying file gnulib/tests/test-btowc2.sh Copying file gnulib/tests/test-byteswap.c Copying file gnulib/tests/test-c-ctype.c Copying file gnulib/tests/test-c-strcase.sh Copying file gnulib/tests/test-c-strcasecmp.c Copying file gnulib/tests/test-c-strcasestr.c Copying file gnulib/tests/test-c-strncasecmp.c Copying file gnulib/tests/test-canonicalize-lgpl.c Copying file gnulib/tests/test-chown.c Copying file gnulib/tests/test-chown.h Copying file gnulib/tests/test-cloexec.c Copying file gnulib/tests/test-close.c Copying file gnulib/tests/test-connect.c Copying file gnulib/tests/test-count-leading-zeros.c Copying file gnulib/tests/test-count-one-bits.c Copying file gnulib/tests/test-ctype.c Copying file gnulib/tests/test-dup.c Copying file gnulib/tests/test-dup2.c Copying file gnulib/tests/test-environ.c Copying file gnulib/tests/test-errno.c Copying file gnulib/tests/test-fclose.c Copying file gnulib/tests/test-fcntl-h.c Copying file gnulib/tests/test-fcntl.c Copying file gnulib/tests/test-fdatasync.c Copying file gnulib/tests/test-fdopen.c Copying file gnulib/tests/test-fflush.c Copying file gnulib/tests/test-fflush2.c Copying file gnulib/tests/test-fflush2.sh Copying file gnulib/tests/test-ffs.c Copying file gnulib/tests/test-ffsl.c Copying file gnulib/tests/test-fgetc.c Copying file gnulib/tests/test-float.c Copying file gnulib/tests/test-fnmatch.c Copying file gnulib/tests/test-fpurge.c Copying file gnulib/tests/test-fputc.c Copying file gnulib/tests/test-fread.c Copying file gnulib/tests/test-freading.c Copying file gnulib/tests/test-fseek.c Copying file gnulib/tests/test-fseek.sh Copying file gnulib/tests/test-fseek2.sh Copying file gnulib/tests/test-fseeko.c Copying file gnulib/tests/test-fseeko.sh Copying file gnulib/tests/test-fseeko2.sh Copying file gnulib/tests/test-fseeko3.c Copying file gnulib/tests/test-fseeko3.sh Copying file gnulib/tests/test-fseeko4.c Copying file gnulib/tests/test-fseeko4.sh Copying file gnulib/tests/test-fstat.c Copying file gnulib/tests/test-fsync.c Copying file gnulib/tests/test-ftell.c Copying file gnulib/tests/test-ftell.sh Copying file gnulib/tests/test-ftell2.sh Copying file gnulib/tests/test-ftell3.c Copying file gnulib/tests/test-ftello.c Copying file gnulib/tests/test-ftello.sh Copying file gnulib/tests/test-ftello2.sh Copying file gnulib/tests/test-ftello3.c Copying file gnulib/tests/test-ftello4.c Copying file gnulib/tests/test-ftello4.sh Copying file gnulib/tests/test-ftruncate.c Copying file gnulib/tests/test-ftruncate.sh Copying file gnulib/tests/test-func.c Copying file gnulib/tests/test-fwrite.c Copying file gnulib/tests/test-getaddrinfo.c Copying file gnulib/tests/test-getcwd-lgpl.c Copying file gnulib/tests/test-getdelim.c Copying file gnulib/tests/test-getdtablesize.c Copying file gnulib/tests/test-getgroups.c Copying file gnulib/tests/test-gethostname.c Copying file gnulib/tests/test-getline.c Copying file gnulib/tests/test-getopt-main.h Copying file gnulib/tests/test-getopt-posix.c Copying file gnulib/tests/test-getopt.h Copying file gnulib/tests/test-getpeername.c Copying file gnulib/tests/test-getprogname.c Copying file gnulib/tests/test-getsockname.c Copying file gnulib/tests/test-getsockopt.c Copying file gnulib/tests/test-gettimeofday.c Copying file gnulib/tests/test-grantpt.c Copying file gnulib/tests/test-ignore-value.c Copying file gnulib/tests/test-inet_ntop.c Copying file gnulib/tests/test-inet_pton.c Copying file gnulib/tests/test-init.sh Copying file gnulib/tests/test-intprops.c Copying file gnulib/tests/test-inttypes.c Copying file gnulib/tests/test-ioctl.c Copying file gnulib/tests/test-isatty.c Copying file gnulib/tests/test-isblank.c Copying file gnulib/tests/test-isnand-nolibm.c Copying file gnulib/tests/test-isnand.h Copying file gnulib/tests/test-isnanf-nolibm.c Copying file gnulib/tests/test-isnanf.h Copying file gnulib/tests/test-isnanl-nolibm.c Copying file gnulib/tests/test-isnanl.h Copying file gnulib/tests/test-langinfo.c Copying file gnulib/tests/test-ldexp.c FATAL: command execution failed java.nio.channels.ClosedChannelException at org.jenkinsci.remoting.protocol.NetworkLayer.onRecvClosed(NetworkLayer.java:154) at org.jenkinsci.remoting.protocol.impl.NIONetworkLayer.ready(NIONetworkLayer.java:142) at org.jenkinsci.remoting.protocol.IOHub$OnReady.run(IOHub.java:721) at jenkins.util.ContextResettingExecutorService$1.run(ContextResettingExecutorService.java:28) at java.util.concurrent.ThreadPoolExecutor.runWorker(ThreadPoolExecutor.java:1145) at java.util.concurrent.ThreadPoolExecutor$Worker.run(ThreadPoolExecutor.java:615) at java.lang.Thread.run(Thread.java:745) Caused: java.io.IOException: Backing channel 'JNLP4-connect connection from 172.19.1.11/172.19.1.11:54918' is disconnected. at hudson.remoting.RemoteInvocationHandler.channelOrFail(RemoteInvocationHandler.java:192) at hudson.remoting.RemoteInvocationHandler.invoke(RemoteInvocationHandler.java:257) at com.sun.proxy.$Proxy80.isAlive(Unknown Source) at hudson.Launcher$RemoteLauncher$ProcImpl.isAlive(Launcher.java:1043) at hudson.Launcher$RemoteLauncher$ProcImpl.join(Launcher.java:1035) at hudson.tasks.CommandInterpreter.join(CommandInterpreter.java:155) at hudson.tasks.CommandInterpreter.perform(CommandInterpreter.java:109) at hudson.tasks.CommandInterpreter.perform(CommandInterpreter.java:66) at hudson.tasks.BuildStepMonitor$1.perform(BuildStepMonitor.java:20) at hudson.model.AbstractBuild$AbstractBuildExecution.perform(AbstractBuild.java:779) at hudson.model.Build$BuildExecution.build(Build.java:206) at hudson.model.Build$BuildExecution.doRun(Build.java:163) at hudson.model.AbstractBuild$AbstractBuildExecution.run(AbstractBuild.java:534) at hudson.model.Run.execute(Run.java:1728) at hudson.matrix.MatrixRun.run(MatrixRun.java:146) at hudson.model.ResourceController.execute(ResourceController.java:98) at hudson.model.Executor.run(Executor.java:405) Build step 'Execute shell' marked build as failure FATAL: channel is already closed java.nio.channels.ClosedChannelException at org.jenkinsci.remoting.protocol.NetworkLayer.onRecvClosed(NetworkLayer.java:154) at org.jenkinsci.remoting.protocol.impl.NIONetworkLayer.ready(NIONetworkLayer.java:142) at org.jenkinsci.remoting.protocol.IOHub$OnReady.run(IOHub.java:721) at jenkins.util.ContextResettingExecutorService$1.run(ContextResettingExecutorService.java:28) at java.util.concurrent.ThreadPoolExecutor.runWorker(ThreadPoolExecutor.java:1145) at java.util.concurrent.ThreadPoolExecutor$Worker.run(ThreadPoolExecutor.java:615) at java.lang.Thread.run(Thread.java:745) Caused: hudson.remoting.ChannelClosedException: channel is already closed at hudson.remoting.Channel.send(Channel.java:605) at hudson.remoting.Request.call(Request.java:130) at hudson.remoting.Channel.call(Channel.java:829) at hudson.Launcher$RemoteLauncher.kill(Launcher.java:984) at hudson.model.AbstractBuild$AbstractBuildExecution.run(AbstractBuild.java:540) at hudson.model.Run.execute(Run.java:1728) at hudson.matrix.MatrixRun.run(MatrixRun.java:146) at hudson.model.ResourceController.execute(ResourceController.java:98) at hudson.model.Executor.run(Executor.java:405)
1 1
0 0
[Libvirt-ci] Build failed in Jenkins: libvirt-master-build » libvirt-fedora-rawhide #636
by ci@centos.org 26 Oct '23

26 Oct '23
See <https://ci.centos.org/job/libvirt-master-build/systems=libvirt-fedora-rawhi…> Changes: [mkletzan] Report more correct information for cache control ------------------------------------------ [...truncated 50.55 KB...] Copying file gnulib/tests/test-nonblocking-pipe-child.c Copying file gnulib/tests/test-nonblocking-pipe-main.c Copying file gnulib/tests/test-nonblocking-pipe.h Copying file gnulib/tests/test-nonblocking-pipe.sh Copying file gnulib/tests/test-nonblocking-reader.h Copying file gnulib/tests/test-nonblocking-socket-child.c Copying file gnulib/tests/test-nonblocking-socket-main.c Copying file gnulib/tests/test-nonblocking-socket.h Copying file gnulib/tests/test-nonblocking-socket.sh Copying file gnulib/tests/test-nonblocking-writer.h Copying file gnulib/tests/test-nonblocking.c Copying file gnulib/tests/test-open.c Copying file gnulib/tests/test-open.h Copying file gnulib/tests/test-openpty.c Copying file gnulib/tests/test-passfd.c Copying file gnulib/tests/test-pathmax.c Copying file gnulib/tests/test-perror.c Copying file gnulib/tests/test-perror.sh Copying file gnulib/tests/test-perror2.c Copying file gnulib/tests/test-pipe.c Copying file gnulib/tests/test-pipe2.c Copying file gnulib/tests/test-poll-h.c Copying file gnulib/tests/test-poll.c Copying file gnulib/tests/test-posix_openpt.c Copying file gnulib/tests/test-posix_spawn1.c Copying file gnulib/tests/test-posix_spawn1.in.sh Copying file gnulib/tests/test-posix_spawn2.c Copying file gnulib/tests/test-posix_spawn2.in.sh Copying file gnulib/tests/test-posix_spawn_file_actions_addclose.c Copying file gnulib/tests/test-posix_spawn_file_actions_adddup2.c Copying file gnulib/tests/test-posix_spawn_file_actions_addopen.c Copying file gnulib/tests/test-pthread_sigmask1.c Copying file gnulib/tests/test-pthread_sigmask2.c Copying file gnulib/tests/test-ptsname.c Copying file gnulib/tests/test-ptsname_r.c Copying file gnulib/tests/test-raise.c Copying file gnulib/tests/test-random_r.c Copying file gnulib/tests/test-rawmemchr.c Copying file gnulib/tests/test-read.c Copying file gnulib/tests/test-readlink.c Copying file gnulib/tests/test-readlink.h Copying file gnulib/tests/test-recv.c Copying file gnulib/tests/test-regex.c Copying file gnulib/tests/test-sched.c Copying file gnulib/tests/test-select-fd.c Copying file gnulib/tests/test-select-in.sh Copying file gnulib/tests/test-select-out.sh Copying file gnulib/tests/test-select-stdin.c Copying file gnulib/tests/test-select.c Copying file gnulib/tests/test-select.h Copying file gnulib/tests/test-send.c Copying file gnulib/tests/test-setenv.c Copying file gnulib/tests/test-setlocale1.c Copying file gnulib/tests/test-setlocale1.sh Copying file gnulib/tests/test-setlocale2.c Copying file gnulib/tests/test-setlocale2.sh Copying file gnulib/tests/test-setsockopt.c Copying file gnulib/tests/test-sigaction.c Copying file gnulib/tests/test-signal-h.c Copying file gnulib/tests/test-signbit.c Copying file gnulib/tests/test-sigpipe.c Copying file gnulib/tests/test-sigpipe.sh Copying file gnulib/tests/test-sigprocmask.c Copying file gnulib/tests/test-sleep.c Copying file gnulib/tests/test-snprintf.c Copying file gnulib/tests/test-sockets.c Copying file gnulib/tests/test-spawn.c Copying file gnulib/tests/test-stat-time.c Copying file gnulib/tests/test-stat.c Copying file gnulib/tests/test-stat.h Copying file gnulib/tests/test-stdalign.c Copying file gnulib/tests/test-stdbool.c Copying file gnulib/tests/test-stddef.c Copying file gnulib/tests/test-stdint.c Copying file gnulib/tests/test-stdio.c Copying file gnulib/tests/test-stdlib.c Copying file gnulib/tests/test-strchrnul.c Copying file gnulib/tests/test-strerror.c Copying file gnulib/tests/test-strerror_r.c Copying file gnulib/tests/test-string.c Copying file gnulib/tests/test-strings.c Copying file gnulib/tests/test-strnlen.c Copying file gnulib/tests/test-symlink.c Copying file gnulib/tests/test-symlink.h Copying file gnulib/tests/test-sys_ioctl.c Copying file gnulib/tests/test-sys_select.c Copying file gnulib/tests/test-sys_socket.c Copying file gnulib/tests/test-sys_stat.c Copying file gnulib/tests/test-sys_time.c Copying file gnulib/tests/test-sys_types.c Copying file gnulib/tests/test-sys_uio.c Copying file gnulib/tests/test-sys_utsname.c Copying file gnulib/tests/test-sys_wait.c Copying file gnulib/tests/test-sys_wait.h Copying file gnulib/tests/test-termios.c Copying file gnulib/tests/test-thread_create.c Copying file gnulib/tests/test-thread_self.c Copying file gnulib/tests/test-time.c Copying file gnulib/tests/test-ttyname_r.c Copying file gnulib/tests/test-uname.c Copying file gnulib/tests/test-unistd.c Copying file gnulib/tests/test-unlockpt.c Copying file gnulib/tests/test-unsetenv.c Copying file gnulib/tests/test-usleep.c Copying file gnulib/tests/test-vasnprintf.c Copying file gnulib/tests/test-vasprintf.c Copying file gnulib/tests/test-vc-list-files-cvs.sh Copying file gnulib/tests/test-vc-list-files-git.sh Copying file gnulib/tests/test-verify-try.c Copying file gnulib/tests/test-verify.c Copying file gnulib/tests/test-verify.sh Copying file gnulib/tests/test-vsnprintf.c Copying file gnulib/tests/test-wchar.c Copying file gnulib/tests/test-wcrtomb-w32-1.sh Copying file gnulib/tests/test-wcrtomb-w32-2.sh Copying file gnulib/tests/test-wcrtomb-w32-3.sh Copying file gnulib/tests/test-wcrtomb-w32-4.sh Copying file gnulib/tests/test-wcrtomb-w32-5.sh Copying file gnulib/tests/test-wcrtomb-w32.c Copying file gnulib/tests/test-wcrtomb.c Copying file gnulib/tests/test-wcrtomb.sh Copying file gnulib/tests/test-wctype-h.c Copying file gnulib/tests/test-write.c Copying file gnulib/tests/test-xalloc-die.c Copying file gnulib/tests/test-xalloc-die.sh Copying file gnulib/tests/unlockpt.c Copying file gnulib/tests/unused-parameter.h Copying file gnulib/tests/w32sock.h Copying file gnulib/tests/wait-process.c Copying file gnulib/tests/wait-process.h Copying file gnulib/tests/warn-on-use.h Copying file gnulib/tests/wctob.c Copying file gnulib/tests/wctomb-impl.h Copying file gnulib/tests/wctomb.c Copying file gnulib/tests/write.c Copying file gnulib/tests/xalloc-die.c Copying file gnulib/tests/xalloc.h Copying file gnulib/tests/xmalloc.c Copying file gnulib/tests/zerosize-ptr.h Copying file m4/00gnulib.m4 Copying file m4/absolute-header.m4 Copying file m4/alloca.m4 Copying file m4/arpa_inet_h.m4 Copying file m4/asm-underscore.m4 Copying file m4/autobuild.m4 Copying file m4/base64.m4 Copying file m4/btowc.m4 Copying file m4/builtin-expect.m4 Copying file m4/byteswap.m4 Copying file m4/calloc.m4 Copying file m4/canonicalize.m4 Copying file m4/chown.m4 Copying file m4/clock_time.m4 Copying file m4/close.m4 Replacing file m4/codeset.m4 (non-gnulib code backed up in m4/codeset.m4~) !! Copying file m4/configmake.m4 Copying file m4/count-leading-zeros.m4 Copying file m4/count-one-bits.m4 Copying file m4/ctype.m4 Copying file m4/dirname.m4 Copying file m4/double-slash-root.m4 Copying file m4/dup.m4 Copying file m4/dup2.m4 Copying file m4/eealloc.m4 Copying file m4/environ.m4 Copying file m4/errno_h.m4 Copying file m4/error.m4 Copying file m4/execinfo.m4 Copying file m4/exponentd.m4 Copying file m4/exponentf.m4 Copying file m4/exponentl.m4 Copying file m4/extensions.m4 Copying file m4/extern-inline.m4 Copying file m4/fatal-signal.m4 Copying file m4/fclose.m4 Copying file m4/fcntl-o.m4 Copying file m4/fcntl.m4 Copying file m4/fcntl_h.m4 Copying file m4/fdatasync.m4 Copying file m4/fdopen.m4 Copying file m4/fflush.m4 Copying file m4/ffs.m4 Copying file m4/ffsl.m4 Copying file m4/flexmember.m4 Copying file m4/float_h.m4 Copying file m4/fnmatch.m4 Copying file m4/fpieee.m4 Copying file m4/fpurge.m4 Copying file m4/freading.m4 Copying file m4/fseek.m4 Copying file m4/fseeko.m4 Copying file m4/fstat.m4 Copying file m4/fsync.m4 Copying file m4/ftell.m4 Copying file m4/ftello.m4 Copying file m4/ftruncate.m4 Copying file m4/func.m4 Copying file m4/getaddrinfo.m4 Copying file m4/getcwd.m4 Copying file m4/getdelim.m4 FATAL: command execution failed java.nio.channels.ClosedChannelException at org.jenkinsci.remoting.protocol.NetworkLayer.onRecvClosed(NetworkLayer.java:154) at org.jenkinsci.remoting.protocol.impl.NIONetworkLayer.ready(NIONetworkLayer.java:142) at org.jenkinsci.remoting.protocol.IOHub$OnReady.run(IOHub.java:721) at jenkins.util.ContextResettingExecutorService$1.run(ContextResettingExecutorService.java:28) at java.util.concurrent.ThreadPoolExecutor.runWorker(ThreadPoolExecutor.java:1145) at java.util.concurrent.ThreadPoolExecutor$Worker.run(ThreadPoolExecutor.java:615) at java.lang.Thread.run(Thread.java:745) Caused: hudson.remoting.ChannelClosedException: channel is already closed at hudson.remoting.Channel.send(Channel.java:605) at hudson.remoting.Request.call(Request.java:130) at hudson.remoting.Channel.call(Channel.java:829) at hudson.remoting.RemoteInvocationHandler.invoke(RemoteInvocationHandler.java:257) at com.sun.proxy.$Proxy80.isAlive(Unknown Source) at hudson.Launcher$RemoteLauncher$ProcImpl.isAlive(Launcher.java:1043) at hudson.Launcher$RemoteLauncher$ProcImpl.join(Launcher.java:1035) at hudson.tasks.CommandInterpreter.join(CommandInterpreter.java:155) at hudson.tasks.CommandInterpreter.perform(CommandInterpreter.java:109) at hudson.tasks.CommandInterpreter.perform(CommandInterpreter.java:66) at hudson.tasks.BuildStepMonitor$1.perform(BuildStepMonitor.java:20) at hudson.model.AbstractBuild$AbstractBuildExecution.perform(AbstractBuild.java:779) at hudson.model.Build$BuildExecution.build(Build.java:206) at hudson.model.Build$BuildExecution.doRun(Build.java:163) at hudson.model.AbstractBuild$AbstractBuildExecution.run(AbstractBuild.java:534) at hudson.model.Run.execute(Run.java:1728) at hudson.matrix.MatrixRun.run(MatrixRun.java:146) at hudson.model.ResourceController.execute(ResourceController.java:98) at hudson.model.Executor.run(Executor.java:405) Build step 'Execute shell' marked build as failure FATAL: channel is already closed java.nio.channels.ClosedChannelException at org.jenkinsci.remoting.protocol.NetworkLayer.onRecvClosed(NetworkLayer.java:154) at org.jenkinsci.remoting.protocol.impl.NIONetworkLayer.ready(NIONetworkLayer.java:142) at org.jenkinsci.remoting.protocol.IOHub$OnReady.run(IOHub.java:721) at jenkins.util.ContextResettingExecutorService$1.run(ContextResettingExecutorService.java:28) at java.util.concurrent.ThreadPoolExecutor.runWorker(ThreadPoolExecutor.java:1145) at java.util.concurrent.ThreadPoolExecutor$Worker.run(ThreadPoolExecutor.java:615) at java.lang.Thread.run(Thread.java:745) Caused: hudson.remoting.ChannelClosedException: channel is already closed at hudson.remoting.Channel.send(Channel.java:605) at hudson.remoting.Request.call(Request.java:130) at hudson.remoting.Channel.call(Channel.java:829) at hudson.Launcher$RemoteLauncher.kill(Launcher.java:984) at hudson.model.AbstractBuild$AbstractBuildExecution.run(AbstractBuild.java:540) at hudson.model.Run.execute(Run.java:1728) at hudson.matrix.MatrixRun.run(MatrixRun.java:146) at hudson.model.ResourceController.execute(ResourceController.java:98) at hudson.model.Executor.run(Executor.java:405)
1 1
0 0
[Libvirt-ci] Jenkins build is back to normal : libvirt-master-build » libvirt-fedora-24 #637
by ci@centos.org 26 Oct '23

26 Oct '23
See <https://ci.centos.org/job/libvirt-master-build/systems=libvirt-fedora-24/63…>
1 0
0 0
[Libvirt-ci] Build failed in Jenkins: libvirt-master-build » libvirt-fedora-23 #636
by ci@centos.org 26 Oct '23

26 Oct '23
See <https://ci.centos.org/job/libvirt-master-build/systems=libvirt-fedora-23/63…> Changes: [mkletzan] Report more correct information for cache control ------------------------------------------ [...truncated 140.56 KB...] CC libvirt_setuid_rpc_client_la-libvirt-domain-snapshot.lo CC libvirt_setuid_rpc_client_la-libvirt-host.lo CC libvirt_setuid_rpc_client_la-libvirt-interface.lo CC libvirt_setuid_rpc_client_la-libvirt-network.lo CC libvirt_setuid_rpc_client_la-libvirt-nodedev.lo CC libvirt_setuid_rpc_client_la-libvirt-nwfilter.lo CC libvirt_setuid_rpc_client_la-libvirt-secret.lo CC libvirt_setuid_rpc_client_la-libvirt-storage.lo CC libvirt_setuid_rpc_client_la-libvirt-stream.lo CC libvirt_setuid_rpc_client_la-libvirt-lxc.lo CC util/libvirt_nss_la-viralloc.lo CC util/libvirt_nss_la-viratomic.lo CC util/libvirt_nss_la-virbitmap.lo CC util/libvirt_nss_la-virbuffer.lo CC util/libvirt_nss_la-vircommand.lo CC util/libvirt_nss_la-virerror.lo CC util/libvirt_nss_la-virfile.lo CC util/libvirt_nss_la-virhash.lo CC util/libvirt_nss_la-virhashcode.lo CC util/libvirt_nss_la-virjson.lo CC util/libvirt_nss_la-virkmod.lo CC util/libvirt_nss_la-virlease.lo CC util/libvirt_nss_la-virlog.lo CC util/libvirt_nss_la-virmacmap.lo CC util/libvirt_nss_la-virobject.lo CC util/libvirt_nss_la-virpidfile.lo CC util/libvirt_nss_la-virprocess.lo CC util/libvirt_nss_la-virrandom.lo CC util/libvirt_nss_la-virsocketaddr.lo CC util/libvirt_nss_la-virstring.lo CC util/libvirt_nss_la-virthread.lo CC util/libvirt_nss_la-virthreadjob.lo CC util/libvirt_nss_la-virtime.lo CC util/libvirt_nss_la-virutil.lo CC storage/libvirt_storage_backend_fs_la-storage_backend_fs.lo CC storage/libvirt_storage_backend_logical_la-storage_backend_logical.lo CC storage/libvirt_storage_backend_iscsi_la-storage_backend_iscsi.lo CC storage/libvirt_storage_backend_scsi_la-storage_backend_scsi.lo CC storage/libvirt_storage_backend_mpath_la-storage_backend_mpath.lo CC storage/libvirt_storage_backend_disk_la-storage_backend_disk.lo CC storage/libvirt_storage_backend_rbd_la-storage_backend_rbd.lo CC storage/libvirt_storage_backend_sheepdog_la-storage_backend_sheepdog.lo CC storage/libvirt_storage_backend_gluster_la-storage_backend_gluster.lo CC util/libvirt_iohelper-iohelper.o CC network/libvirt_leaseshelper-leaseshelper.o CC storage/libvirt_parthelper-parthelper.o CC locking/libvirt_sanlock_helper-sanlock_helper.o CC lxc/libvirt_lxc-lxc_monitor_protocol.o CC lxc/libvirt_lxc-lxc_conf.o CC lxc/libvirt_lxc-lxc_container.o CC lxc/libvirt_lxc-lxc_cgroup.o CC lxc/libvirt_lxc-lxc_domain.o CC lxc/libvirt_lxc-lxc_fuse.o CC lxc/libvirt_lxc-lxc_controller.o CC libvirt_lxc-datatypes.o CC locking/virtlockd-lock_daemon.o CC locking/virtlockd-lock_daemon_config.o CC locking/virtlockd-lock_daemon_dispatch.o CC locking/virtlockd-lock_protocol.o CC logging/virtlogd-log_daemon.o CC logging/virtlogd-log_daemon_config.o CC logging/virtlogd-log_daemon_dispatch.o CC logging/virtlogd-log_handler.o CC logging/virtlogd-log_protocol.o GEN util/virkeycode-linux.pod GEN util/virkeycode-osx.pod GEN util/virkeycode-atset1.pod GEN util/virkeycode-atset2.pod GEN util/virkeycode-atset3.pod GEN util/virkeycode-xt.pod GEN util/virkeycode-xtkbd.pod GEN util/virkeycode-usb.pod GEN util/virkeycode-win32.pod GEN util/virkeycode-rfb.pod GEN util/virkeyname-linux.pod GEN util/virkeyname-osx.pod GEN util/virkeyname-win32.pod GEN virtlockd.8.in GEN virtlogd.8.in GEN test_libvirtd_libxl.aug GEN test_libvirtd_qemu.aug GEN test_libvirtd_lxc.aug GEN test_libvirt_lockd.aug GEN test_virtlockd.aug GEN test_virtlogd.aug GEN test_libvirt_sanlock.aug GEN libvirt_qemu_probes.stp CC util/libvirt_util_la-viralloc.lo CC util/libvirt_util_la-virarch.lo CC util/libvirt_util_la-viratomic.lo CC util/libvirt_util_la-viraudit.lo CC util/libvirt_util_la-virauth.lo CC util/libvirt_util_la-virauthconfig.lo CC util/libvirt_util_la-virbitmap.lo CC util/libvirt_util_la-virbuffer.lo CC util/libvirt_util_la-virperf.lo CC util/libvirt_util_la-vircgroup.lo CC util/libvirt_util_la-virclosecallbacks.lo CC util/libvirt_util_la-vircommand.lo CC util/libvirt_util_la-virconf.lo CC util/libvirt_util_la-vircrypto.lo CC util/libvirt_util_la-virdbus.lo CC util/libvirt_util_la-virdnsmasq.lo CC util/libvirt_util_la-virebtables.lo CC util/libvirt_util_la-virerror.lo CC util/libvirt_util_la-virevent.lo CC util/libvirt_util_la-vireventpoll.lo CC util/libvirt_util_la-virfcp.lo CC util/libvirt_util_la-virfdstream.lo CC util/libvirt_util_la-virfile.lo CC util/libvirt_util_la-virfirewall.lo CC util/libvirt_util_la-virfirmware.lo CC util/libvirt_util_la-virgettext.lo CC util/libvirt_util_la-virgic.lo CC util/libvirt_util_la-virhash.lo CC util/libvirt_util_la-virhashcode.lo CC util/libvirt_util_la-virhook.lo CC util/libvirt_util_la-virhostcpu.lo CC util/libvirt_util_la-virhostdev.lo CC util/libvirt_util_la-virhostmem.lo CC util/libvirt_util_la-viridentity.lo CC util/libvirt_util_la-virinitctl.lo CC util/libvirt_util_la-viriptables.lo CC util/libvirt_util_la-viriscsi.lo CC util/libvirt_util_la-virjson.lo CC util/libvirt_util_la-virkeycode.lo CC util/libvirt_util_la-virkeyfile.lo CC util/libvirt_util_la-virlease.lo CC util/libvirt_util_la-virlockspace.lo CC util/libvirt_util_la-virlog.lo CC util/libvirt_util_la-virmacaddr.lo CC util/libvirt_util_la-virmacmap.lo CC util/libvirt_util_la-virnetdev.lo CC util/libvirt_util_la-virnetdevbandwidth.lo CC util/libvirt_util_la-virnetdevbridge.lo CC util/libvirt_util_la-virnetdevip.lo CC util/libvirt_util_la-virnetdevmacvlan.lo CC util/libvirt_util_la-virnetdevmidonet.lo CC util/libvirt_util_la-virnetdevopenvswitch.lo CC util/libvirt_util_la-virnetdevtap.lo CC util/libvirt_util_la-virnetdevveth.lo CC util/libvirt_util_la-virnetdevvlan.lo CC util/libvirt_util_la-virnetdevvportprofile.lo CC util/libvirt_util_la-virnetlink.lo CC util/libvirt_util_la-virnodesuspend.lo CC util/libvirt_util_la-virkmod.lo CC util/libvirt_util_la-virnuma.lo CC util/libvirt_util_la-virobject.lo CC util/libvirt_util_la-virpci.lo CC util/libvirt_util_la-virpidfile.lo CC util/libvirt_util_la-virpolkit.lo CC util/libvirt_util_la-virportallocator.lo CC util/libvirt_util_la-virprocess.lo CC util/libvirt_util_la-virqemu.lo CC util/libvirt_util_la-virrandom.lo CC util/libvirt_util_la-virrotatingfile.lo CC util/libvirt_util_la-virscsi.lo CC util/libvirt_util_la-virscsihost.lo CC util/libvirt_util_la-virscsivhost.lo CC util/libvirt_util_la-virseclabel.lo CC util/libvirt_util_la-virsecret.lo CC util/libvirt_util_la-virsexpr.lo CC util/libvirt_util_la-virsocketaddr.lo CC util/libvirt_util_la-virstorageencryption.lo CC util/libvirt_util_la-virstoragefile.lo CC util/libvirt_util_la-virstring.lo CC util/libvirt_util_la-virsysinfo.lo CC util/libvirt_util_la-virsystemd.lo CC util/libvirt_util_la-virthread.lo CC util/libvirt_util_la-virthreadjob.lo CC util/libvirt_util_la-virthreadpool.lo CC util/libvirt_util_la-virtime.lo CC util/libvirt_util_la-virtpm.lo CC util/libvirt_util_la-virtypedparam.lo CC util/libvirt_util_la-virusb.lo CC util/libvirt_util_la-viruri.lo CC util/libvirt_util_la-virutil.lo CC util/libvirt_util_la-viruuid.lo CC util/libvirt_util_la-virvhba.lo CC util/libvirt_util_la-virxml.lo CC util/libvirt_util_la-virmdev.lo CC conf/libvirt_conf_la-netdev_bandwidth_conf.lo CC conf/libvirt_conf_la-netdev_vport_profile_conf.lo CC conf/libvirt_conf_la-netdev_vlan_conf.lo CC conf/libvirt_conf_la-capabilities.lo CC conf/libvirt_conf_la-domain_addr.lo CC conf/libvirt_conf_la-domain_capabilities.lo CC conf/libvirt_conf_la-domain_conf.lo CC conf/libvirt_conf_la-domain_audit.lo CC conf/libvirt_conf_la-domain_nwfilter.lo CC conf/libvirt_conf_la-virsavecookie.lo CC conf/libvirt_conf_la-snapshot_conf.lo CC conf/libvirt_conf_la-numa_conf.lo CC conf/libvirt_conf_la-virdomainobjlist.lo CC conf/libvirt_conf_la-object_event.lo CC conf/libvirt_conf_la-domain_event.lo CC conf/libvirt_conf_la-network_event.lo CC conf/libvirt_conf_la-storage_event.lo CC conf/libvirt_conf_la-node_device_event.lo CC conf/libvirt_conf_la-secret_event.lo CC conf/libvirt_conf_la-network_conf.lo CC conf/libvirt_conf_la-virnetworkobj.lo FATAL: command execution failed java.nio.channels.ClosedChannelException at org.jenkinsci.remoting.protocol.NetworkLayer.onRecvClosed(NetworkLayer.java:154) at org.jenkinsci.remoting.protocol.impl.NIONetworkLayer.ready(NIONetworkLayer.java:142) at org.jenkinsci.remoting.protocol.IOHub$OnReady.run(IOHub.java:721) at jenkins.util.ContextResettingExecutorService$1.run(ContextResettingExecutorService.java:28) at java.util.concurrent.ThreadPoolExecutor.runWorker(ThreadPoolExecutor.java:1145) at java.util.concurrent.ThreadPoolExecutor$Worker.run(ThreadPoolExecutor.java:615) at java.lang.Thread.run(Thread.java:745) Caused: java.io.IOException: Backing channel 'JNLP4-connect connection from fedora-23.n64.pufty.ci.centos.org/172.19.1.19:59880' is disconnected. at hudson.remoting.RemoteInvocationHandler.channelOrFail(RemoteInvocationHandler.java:192) at hudson.remoting.RemoteInvocationHandler.invoke(RemoteInvocationHandler.java:257) at com.sun.proxy.$Proxy80.isAlive(Unknown Source) at hudson.Launcher$RemoteLauncher$ProcImpl.isAlive(Launcher.java:1043) at hudson.Launcher$RemoteLauncher$ProcImpl.join(Launcher.java:1035) at hudson.tasks.CommandInterpreter.join(CommandInterpreter.java:155) at hudson.tasks.CommandInterpreter.perform(CommandInterpreter.java:109) at hudson.tasks.CommandInterpreter.perform(CommandInterpreter.java:66) at hudson.tasks.BuildStepMonitor$1.perform(BuildStepMonitor.java:20) at hudson.model.AbstractBuild$AbstractBuildExecution.perform(AbstractBuild.java:779) at hudson.model.Build$BuildExecution.build(Build.java:206) at hudson.model.Build$BuildExecution.doRun(Build.java:163) at hudson.model.AbstractBuild$AbstractBuildExecution.run(AbstractBuild.java:534) at hudson.model.Run.execute(Run.java:1728) at hudson.matrix.MatrixRun.run(MatrixRun.java:146) at hudson.model.ResourceController.execute(ResourceController.java:98) at hudson.model.Executor.run(Executor.java:405) Build step 'Execute shell' marked build as failure FATAL: channel is already closed java.nio.channels.ClosedChannelException at org.jenkinsci.remoting.protocol.NetworkLayer.onRecvClosed(NetworkLayer.java:154) at org.jenkinsci.remoting.protocol.impl.NIONetworkLayer.ready(NIONetworkLayer.java:142) at org.jenkinsci.remoting.protocol.IOHub$OnReady.run(IOHub.java:721) at jenkins.util.ContextResettingExecutorService$1.run(ContextResettingExecutorService.java:28) at java.util.concurrent.ThreadPoolExecutor.runWorker(ThreadPoolExecutor.java:1145) at java.util.concurrent.ThreadPoolExecutor$Worker.run(ThreadPoolExecutor.java:615) at java.lang.Thread.run(Thread.java:745) Caused: hudson.remoting.ChannelClosedException: channel is already closed at hudson.remoting.Channel.send(Channel.java:605) at hudson.remoting.Request.call(Request.java:130) at hudson.remoting.Channel.call(Channel.java:829) at hudson.Launcher$RemoteLauncher.kill(Launcher.java:984) at hudson.model.AbstractBuild$AbstractBuildExecution.run(AbstractBuild.java:540) at hudson.model.Run.execute(Run.java:1728) at hudson.matrix.MatrixRun.run(MatrixRun.java:146) at hudson.model.ResourceController.execute(ResourceController.java:98) at hudson.model.Executor.run(Executor.java:405)
1 1
0 0
[Libvirt-ci] Build failed in Jenkins: libosinfo-master-check » libvirt-fedora-24 #59
by ci@centos.org 26 Oct '23

26 Oct '23
See <https://ci.centos.org/job/libosinfo-master-check/systems=libvirt-fedora-24/…> ------------------------------------------ Started by upstream project "libosinfo-master-check" build number 59 originally caused by: Started by upstream project "libosinfo-master-syntax-check" build number 64 originally caused by: Started by upstream project "libosinfo-master-build" build number 71 originally caused by: Started by user Libvirt [EnvInject] - Loading node environment variables. Building remotely on libvirt-fedora-24 (libvirt) in workspace <https://ci.centos.org/job/libosinfo-master-check/systems=libvirt-fedora-24/…> [libosinfo-master] $ /bin/sh -xe /tmp/hudson6700248123647707049.sh + MAKE=make ++ uname + unamestr=Linux + '[' Linux = FreeBSD ']' + export OSINFO_SYSTEM_DIR=/home/jenkins/build/libvirt/share/osinfo + OSINFO_SYSTEM_DIR=/home/jenkins/build/libvirt/share/osinfo + cd build + make -j3 check GEN public-submodule-commit Making check in osinfo make[1]: Entering directory '<https://ci.centos.org/job/libosinfo-master-check/systems=libvirt-fedora-24/…'> make check-am make[2]: Entering directory '<https://ci.centos.org/job/libosinfo-master-check/systems=libvirt-fedora-24/…'> make check-local make[3]: Entering directory '<https://ci.centos.org/job/libosinfo-master-check/systems=libvirt-fedora-24/…'> GEN check-symsorting GEN check-symfile make[3]: Leaving directory '<https://ci.centos.org/job/libosinfo-master-check/systems=libvirt-fedora-24/…'> make[2]: Leaving directory '<https://ci.centos.org/job/libosinfo-master-check/systems=libvirt-fedora-24/…'> make[1]: Leaving directory '<https://ci.centos.org/job/libosinfo-master-check/systems=libvirt-fedora-24/…'> Making check in tests make[1]: Entering directory '<https://ci.centos.org/job/libosinfo-master-check/systems=libvirt-fedora-24/…'> make test-entity test-device test-list test-devicelist test-filter test-product test-os test-oslist test-productfilter test-platform test-platformlist test-db test-loader test-isodetect test-mediauris test-treeuris test-install-script make[2]: Entering directory '<https://ci.centos.org/job/libosinfo-master-check/systems=libvirt-fedora-24/…'> CC test_entity-test-entity.o CC test_device-test-device.o CC test_list-test-list.o CC test_devicelist-test-devicelist.o CC test_filter-test-filter.o CC test_product-test-product.o CC test_os-test-os.o CC test_oslist-test-oslist.o CC test_productfilter-test-productfilter.o CC test_platform-test-platform.o CC test_platformlist-test-platformlist.o CC test_db-test-db.o CC test_loader-test-loader.o CC test_isodetect-test-isodetect.o CC test_mediauris-test-mediauris.o CC test_treeuris-test-treeuris.o CC test_install_script-test-install-script.o CCLD test-entity CCLD test-device CCLD test-list CCLD test-devicelist CCLD test-filter CCLD test-product CCLD test-os CCLD test-oslist CCLD test-productfilter CCLD test-platform CCLD test-platformlist CCLD test-db CCLD test-loader CCLD test-isodetect CCLD test-mediauris CCLD test-treeuris CCLD test-install-script make[2]: Leaving directory '<https://ci.centos.org/job/libosinfo-master-check/systems=libvirt-fedora-24/…'> make check-TESTS make[2]: Entering directory '<https://ci.centos.org/job/libosinfo-master-check/systems=libvirt-fedora-24/…'> make[3]: Entering directory '<https://ci.centos.org/job/libosinfo-master-check/systems=libvirt-fedora-24/…'> PASS: test-device PASS: test-list PASS: test-entity PASS: test-filter PASS: test-devicelist PASS: test-product PASS: test-os PASS: test-oslist PASS: test-productfilter PASS: test-platform PASS: test-platformlist PASS: test-db SKIP: test-mediauris SKIP: test-treeuris PASS: test-install-script FAIL: test-loader PASS: test-isodetect ============================================================================ Testsuite summary for libosinfo 1.1.0 ============================================================================ # TOTAL: 17 # PASS: 14 # SKIP: 2 # XFAIL: 0 # FAIL: 1 # XPASS: 0 # ERROR: 0 ============================================================================ See tests/test-suite.log Please report to libosinfo(a)redhat.com ============================================================================ Makefile:1250: recipe for target 'test-suite.log' failed make[3]: *** [test-suite.log] Error 1 make[3]: Leaving directory '<https://ci.centos.org/job/libosinfo-master-check/systems=libvirt-fedora-24/…'> Makefile:1356: recipe for target 'check-TESTS' failed make[2]: *** [check-TESTS] Error 2 make[2]: Leaving directory '<https://ci.centos.org/job/libosinfo-master-check/systems=libvirt-fedora-24/…'> Makefile:1541: recipe for target 'check-am' failed make[1]: *** [check-am] Error 2 make[1]: Leaving directory '<https://ci.centos.org/job/libosinfo-master-check/systems=libvirt-fedora-24/…'> Makefile:595: recipe for target 'check-recursive' failed make: *** [check-recursive] Error 1 + cat tests/test-suite.log =========================================== libosinfo 1.1.0: tests/test-suite.log =========================================== # TOTAL: 17 # PASS: 14 # SKIP: 2 # XFAIL: 0 # FAIL: 1 # XPASS: 0 # ERROR: 0 .. contents:: :depth: 2 FAIL: test-loader ================= Running suite(s): Loader 0%: Checks: 1, Failures: 0, Errors: 1 ../../tests/test-loader.c:36:E:Core:test_basic:0: (after this point) Test timeout expired FAIL test-loader (exit status: 1) SKIP: test-mediauris ==================== SKIP test-mediauris (exit status: 77) SKIP: test-treeuris =================== SKIP test-treeuris (exit status: 77) + exit 1 Build step 'Execute shell' marked build as failure
1 1
0 0
[Libvirt-ci] Build failed in Jenkins: libosinfo-master-check » libvirt-fedora-rawhide #58
by ci@centos.org 26 Oct '23

26 Oct '23
See <https://ci.centos.org/job/libosinfo-master-check/systems=libvirt-fedora-raw…> ------------------------------------------ Started by upstream project "libosinfo-master-check" build number 58 originally caused by: Started by upstream project "libosinfo-master-syntax-check" build number 63 originally caused by: Started by upstream project "libosinfo-master-build" build number 69 originally caused by: Started by upstream project "osinfo-db-master-build" build number 199 originally caused by: Started by upstream project "osinfo-db-tools-master-build" build number 20 originally caused by: Started by user Libvirt [EnvInject] - Loading node environment variables. Building remotely on libvirt-fedora-rawhide (libvirt) in workspace <https://ci.centos.org/job/libosinfo-master-check/systems=libvirt-fedora-raw…> [libosinfo-master] $ /bin/sh -xe /tmp/hudson5959423808762506823.sh + MAKE=make ++ uname + unamestr=Linux + '[' Linux = FreeBSD ']' + export OSINFO_SYSTEM_DIR=/home/jenkins/build/libvirt/share/osinfo + OSINFO_SYSTEM_DIR=/home/jenkins/build/libvirt/share/osinfo + cd build + make -j3 check GEN public-submodule-commit Making check in osinfo make[1]: Entering directory '<https://ci.centos.org/job/libosinfo-master-check/systems=libvirt-fedora-raw…'> make check-am make[2]: Entering directory '<https://ci.centos.org/job/libosinfo-master-check/systems=libvirt-fedora-raw…'> make check-local make[3]: Entering directory '<https://ci.centos.org/job/libosinfo-master-check/systems=libvirt-fedora-raw…'> GEN check-symsorting GEN check-symfile make[3]: Leaving directory '<https://ci.centos.org/job/libosinfo-master-check/systems=libvirt-fedora-raw…'> make[2]: Leaving directory '<https://ci.centos.org/job/libosinfo-master-check/systems=libvirt-fedora-raw…'> make[1]: Leaving directory '<https://ci.centos.org/job/libosinfo-master-check/systems=libvirt-fedora-raw…'> Making check in tests make[1]: Entering directory '<https://ci.centos.org/job/libosinfo-master-check/systems=libvirt-fedora-raw…'> make test-entity test-device test-list test-devicelist test-filter test-product test-os test-oslist test-productfilter test-platform test-platformlist test-db test-loader test-isodetect test-mediauris test-treeuris test-install-script make[2]: Entering directory '<https://ci.centos.org/job/libosinfo-master-check/systems=libvirt-fedora-raw…'> CC test_entity-test-entity.o CC test_device-test-device.o CC test_list-test-list.o CC test_devicelist-test-devicelist.o CC test_filter-test-filter.o CC test_product-test-product.o CC test_os-test-os.o CC test_oslist-test-oslist.o CC test_productfilter-test-productfilter.o CC test_platform-test-platform.o CC test_platformlist-test-platformlist.o CC test_db-test-db.o CC test_loader-test-loader.o CC test_isodetect-test-isodetect.o CC test_mediauris-test-mediauris.o CC test_treeuris-test-treeuris.o CC test_install_script-test-install-script.o CCLD test-entity CCLD test-device CCLD test-list CCLD test-devicelist CCLD test-filter CCLD test-product CCLD test-os CCLD test-oslist CCLD test-productfilter CCLD test-platform CCLD test-platformlist CCLD test-db CCLD test-loader CCLD test-isodetect CCLD test-mediauris CCLD test-treeuris CCLD test-install-script make[2]: Leaving directory '<https://ci.centos.org/job/libosinfo-master-check/systems=libvirt-fedora-raw…'> make check-TESTS make[2]: Entering directory '<https://ci.centos.org/job/libosinfo-master-check/systems=libvirt-fedora-raw…'> make[3]: Entering directory '<https://ci.centos.org/job/libosinfo-master-check/systems=libvirt-fedora-raw…'> PASS: test-device PASS: test-list PASS: test-entity PASS: test-filter PASS: test-devicelist PASS: test-product PASS: test-os PASS: test-oslist PASS: test-platform PASS: test-productfilter PASS: test-platformlist PASS: test-db SKIP: test-mediauris SKIP: test-treeuris PASS: test-loader PASS: test-install-script PASS: test-isodetect ============================================================================ Testsuite summary for libosinfo 1.1.0 ============================================================================ # TOTAL: 17 # PASS: 15 # SKIP: 2 # XFAIL: 0 # FAIL: 0 # XPASS: 0 # ERROR: 0 ============================================================================ make[3]: Leaving directory '<https://ci.centos.org/job/libosinfo-master-check/systems=libvirt-fedora-raw…'> make[2]: Leaving directory '<https://ci.centos.org/job/libosinfo-master-check/systems=libvirt-fedora-raw…'> make[1]: Leaving directory '<https://ci.centos.org/job/libosinfo-master-check/systems=libvirt-fedora-raw…'> Making check in tools make[1]: Entering directory '<https://ci.centos.org/job/libosinfo-master-check/systems=libvirt-fedora-raw…'> make[1]: Nothing to be done for 'check'. make[1]: Leaving directory '<https://ci.centos.org/job/libosinfo-master-check/systems=libvirt-fedora-raw…'> Making check in docs make[1]: Entering directory '<https://ci.centos.org/job/libosinfo-master-check/systems=libvirt-fedora-raw…'> Making check in reference make[2]: Entering directory '<https://ci.centos.org/job/libosinfo-master-check/systems=libvirt-fedora-raw…'> make[2]: Leaving directory '<https://ci.centos.org/job/libosinfo-master-check/systems=libvirt-fedora-raw…'> make[2]: Entering directory '<https://ci.centos.org/job/libosinfo-master-check/systems=libvirt-fedora-raw…'> make[2]: Nothing to be done for 'check-am'. make[2]: Leaving directory '<https://ci.centos.org/job/libosinfo-master-check/systems=libvirt-fedora-raw…'> make[1]: Leaving directory '<https://ci.centos.org/job/libosinfo-master-check/systems=libvirt-fedora-raw…'> Making check in po make[1]: Entering directory '<https://ci.centos.org/job/libosinfo-master-check/systems=libvirt-fedora-raw…'> INTLTOOL_EXTRACT="/usr/bin/intltool-extract" XGETTEXT="/usr/bin/xgettext" srcdir=../../po /usr/bin/intltool-update --gettext-package libosinfo --pot rm -f missing notexist srcdir=../../po /usr/bin/intltool-update -m Unescaped left brace in regex is illegal here in regex; marked by <-- HERE in m/\${ <-- HERE ?PACKAGE_NAME}?/ at /usr/bin/intltool-update line 1082, <CONF> line 299. make[1]: *** [Makefile:167: check] Error 255 make[1]: Leaving directory '<https://ci.centos.org/job/libosinfo-master-check/systems=libvirt-fedora-raw…'> make: *** [Makefile:595: check-recursive] Error 1 + cat tests/test-suite.log =========================================== libosinfo 1.1.0: tests/test-suite.log =========================================== # TOTAL: 17 # PASS: 15 # SKIP: 2 # XFAIL: 0 # FAIL: 0 # XPASS: 0 # ERROR: 0 .. contents:: :depth: 2 SKIP: test-mediauris ==================== SKIP test-mediauris (exit status: 77) SKIP: test-treeuris =================== SKIP test-treeuris (exit status: 77) + exit 1 Build step 'Execute shell' marked build as failure
1 2
0 0
[Libvirt-ci] Build failed in Jenkins: libosinfo-master-build » libvirt-fedora-25 #70
by ci@centos.org 26 Oct '23

26 Oct '23
See <https://ci.centos.org/job/libosinfo-master-build/systems=libvirt-fedora-25/…> ------------------------------------------ Started by upstream project "libosinfo-master-build" build number 70 originally caused by: Started by upstream project "osinfo-db-master-build" build number 200 originally caused by: Started by upstream project "osinfo-db-tools-master-build" build number 23 originally caused by: Started by user Libvirt [EnvInject] - Loading node environment variables. Building remotely on libvirt-fedora-25 (libvirt) in workspace <https://ci.centos.org/job/libosinfo-master-build/systems=libvirt-fedora-25/…> > git rev-parse --is-inside-work-tree # timeout=10 Fetching changes from the remote Git repository > git config remote.origin.url git://n64.pufty.ci.centos.org/libosinfo.git # timeout=10 Fetching upstream changes from git://n64.pufty.ci.centos.org/libosinfo.git > git --version # timeout=10 > git fetch --tags --progress git://n64.pufty.ci.centos.org/libosinfo.git +refs/heads/*:refs/remotes/origin/* Checking out Revision ddd7dee2b51e661dc19f6419e041c9aeef3b23bf (refs/remotes/origin/master) > git config core.sparsecheckout # timeout=10 > git checkout -f ddd7dee2b51e661dc19f6419e041c9aeef3b23bf First time build. Skipping changelog. Cleaning workspace > git rev-parse --verify HEAD # timeout=10 Resetting working tree > git reset --hard # timeout=10 > git clean -fdx # timeout=10 [libosinfo-master] $ /bin/sh -xe /tmp/hudson3670524197379987947.sh + MAKE=make ++ uname + unamestr=Linux + '[' Linux = FreeBSD ']' + export OSINFO_SYSTEM_DIR=/home/jenkins/build/libvirt/share/osinfo + OSINFO_SYSTEM_DIR=/home/jenkins/build/libvirt/share/osinfo + mkdir build + cd build + ../autogen.sh --prefix=/home/jenkins/build/libvirt /usr/bin/gnome-autogen.sh checking for automake >= 1.11.2... testing automake... found 1.15 checking for autoreconf >= 2.53... testing autoreconf... found 2.69 checking for intltool >= 0.25... testing intltoolize... found 0.51.0 checking for pkg-config >= 0.14.0... testing pkg-config... found 0.29.1 checking for gtk-doc >= 1.0... testing gtkdocize... not found. ***Error***: You must have gtk-doc >= 1.0 installed to build libosinfo. Download the appropriate package for from your distribution or get the source tarball at http://ftp.gnome.org/pub/GNOME/sources/gtk-doc/ Build step 'Execute shell' marked build as failure
1 1
0 0
[Libvirt-ci] Build failed in Jenkins: osinfo-db-master-rpm » libvirt-fedora-25 #44
by ci@centos.org 26 Oct '23

26 Oct '23
See <https://ci.centos.org/job/osinfo-db-master-rpm/systems=libvirt-fedora-25/44…> ------------------------------------------ Started by upstream project "osinfo-db-master-rpm" build number 44 originally caused by: Started by upstream project "osinfo-db-master-build" build number 200 originally caused by: Started by upstream project "osinfo-db-tools-master-build" build number 23 originally caused by: Started by user Libvirt [EnvInject] - Loading node environment variables. Building remotely on libvirt-fedora-25 (libvirt) in workspace <https://ci.centos.org/job/osinfo-db-master-rpm/systems=libvirt-fedora-25/ws/> [osinfo-db-master] $ /bin/sh -xe /tmp/hudson4852672715877167027.sh + export PATH=/home/jenkins/build/libvirt/bin:/home/jenkins/build/libvirt/bin:/usr/local/sbin:/usr/local/bin:/usr/sbin:/usr/bin:/home/jenkins/.local/bin:/home/jenkins/bin + PATH=/home/jenkins/build/libvirt/bin:/home/jenkins/build/libvirt/bin:/usr/local/sbin:/usr/local/bin:/usr/sbin:/usr/bin:/home/jenkins/.local/bin:/home/jenkins/bin + rm -f osinfo-db-20170616.tar.xz + make osinfo-db.spec make: 'osinfo-db.spec' is up to date. + perl -i -p -e 's/BuildRequires: osinfo-db-tools.*//' osinfo-db.spec + make rpm EXP osinfo-db-20170616.tar.xz rpmbuild --define "_sourcedir `pwd`" -ba osinfo-db.spec /bin/sh: rpmbuild: command not found Makefile:64: recipe for target 'rpm' failed make: *** [rpm] Error 127 Build step 'Execute shell' marked build as failure
1 1
0 0
[Libvirt-ci] Build failed in Jenkins: osinfo-db-tools-master-rpm » libvirt-fedora-25 #17
by ci@centos.org 26 Oct '23

26 Oct '23
See <https://ci.centos.org/job/osinfo-db-tools-master-rpm/systems=libvirt-fedora…> ------------------------------------------ Started by upstream project "osinfo-db-tools-master-rpm" build number 17 originally caused by: Started by user Libvirt [EnvInject] - Loading node environment variables. Building remotely on libvirt-fedora-25 (libvirt) in workspace <https://ci.centos.org/job/osinfo-db-tools-master-rpm/systems=libvirt-fedora…> [osinfo-db-tools-master] $ /bin/sh -xe /tmp/hudson3600793406701974520.sh + MAKE=make ++ uname + unamestr=Linux + '[' Linux = FreeBSD ']' + cd build + sed -i -e 's/BuildRequires: osinfo-db.*//' osinfo-db-tools.spec + sed -i -e 's/BuildRequires: libvirt.*devel.*//' osinfo-db-tools.spec + sed -i -e 's/BuildRequires: pkgconfig(libvirt.*).*//' osinfo-db-tools.spec + rm -f '*.tar.gz' + make -j3 dist make dist-gzip am__post_remove_distdir='@:' make[1]: Entering directory '<https://ci.centos.org/job/osinfo-db-tools-master-rpm/systems=libvirt-fedora…'> if test -d "osinfo-db-tools-1.2.0"; then find "osinfo-db-tools-1.2.0" -type d ! -perm -200 -exec chmod u+w {} ';' && rm -rf "osinfo-db-tools-1.2.0" || { sleep 5 && rm -rf "osinfo-db-tools-1.2.0"; }; else :; fi test -d "osinfo-db-tools-1.2.0" || mkdir "osinfo-db-tools-1.2.0" (cd tools && make top_distdir=../osinfo-db-tools-1.2.0 distdir=../osinfo-db-tools-1.2.0/tools \ am__remove_distdir=: am__skip_length_check=: am__skip_mode_fix=: distdir) make[2]: Entering directory '<https://ci.centos.org/job/osinfo-db-tools-master-rpm/systems=libvirt-fedora…'> make[2]: Leaving directory '<https://ci.centos.org/job/osinfo-db-tools-master-rpm/systems=libvirt-fedora…'> (cd docs && make top_distdir=../osinfo-db-tools-1.2.0 distdir=../osinfo-db-tools-1.2.0/docs \ am__remove_distdir=: am__skip_length_check=: am__skip_mode_fix=: distdir) make[2]: Entering directory '<https://ci.centos.org/job/osinfo-db-tools-master-rpm/systems=libvirt-fedora…'> make[2]: Leaving directory '<https://ci.centos.org/job/osinfo-db-tools-master-rpm/systems=libvirt-fedora…'> (cd po && make top_distdir=../osinfo-db-tools-1.2.0 distdir=../osinfo-db-tools-1.2.0/po \ am__remove_distdir=: am__skip_length_check=: am__skip_mode_fix=: distdir) make[2]: Entering directory '<https://ci.centos.org/job/osinfo-db-tools-master-rpm/systems=libvirt-fedora…'> dists="Makefile.in.in POTFILES.in af.po am.po anp.po ar.po as.po ast.po bal.po be.po bg.po bn_IN.po bn.po bo.po br.po brx.po bs.po ca.po cs.po cy.po da.po de_CH.po de.po el.po en_GB.po eo.po es.po et.po eu.po fa.po fi.po fr.po gl.po gu.po he.po hi.po hr.po hu.po ia.po id.po ilo.po is.po it.po ja.po ka.po kk.po km.po kn.po ko.po kw_GB.po kw(a)kkcor.po kw.po kw(a)uccor.po ky.po lt.po lv.po mai.po mk.po ml.po mn.po mr.po ms.po nb.po nds.po ne.po nl.po nn.po nso.po or.po pa.po pl.po pt_BR.po pt.po ro.po ru.po si.po sk.po sl.po sq.po sr(a)latin.po sr.po sv.po ta.po te.po tg.po th.po tr.po tw.po uk.po ur.po vi.po wba.po yo.po zh_CN.po zh_HK.po zh_TW.po zu.po "; \ extra_dists="ChangeLog POTFILES.skip Makevars LINGUAS"; \ for file in $extra_dists; do \ test -f ../../po/$file && dists="$dists ../../po/$file"; \ done; \ for file in $dists; do \ test -f $file || file="../../po/$file"; \ ln $file ../osinfo-db-tools-1.2.0/po 2> /dev/null \ || cp -p $file ../osinfo-db-tools-1.2.0/po; \ done make[2]: Leaving directory '<https://ci.centos.org/job/osinfo-db-tools-master-rpm/systems=libvirt-fedora…'> make \ top_distdir="osinfo-db-tools-1.2.0" distdir="osinfo-db-tools-1.2.0" \ dist-hook make[2]: Entering directory '<https://ci.centos.org/job/osinfo-db-tools-master-rpm/systems=libvirt-fedora…'> if test -d ../.git; then \ ../build-aux/gitlog-to-changelog \ > osinfo-db-tools-1.2.0/cl-t; \ rm -f osinfo-db-tools-1.2.0/ChangeLog; \ mv osinfo-db-tools-1.2.0/cl-t osinfo-db-tools-1.2.0/ChangeLog; \ fi GEN gen-AUTHORS make[2]: Leaving directory '<https://ci.centos.org/job/osinfo-db-tools-master-rpm/systems=libvirt-fedora…'> test -n "" \ || find "osinfo-db-tools-1.2.0" -type d ! -perm -755 \ -exec chmod u+rwx,go+rx {} \; -o \ ! -type d ! -perm -444 -links 1 -exec chmod a+r {} \; -o \ ! -type d ! -perm -400 -exec chmod a+r {} \; -o \ ! -type d ! -perm -444 -exec /bin/sh <https://ci.centos.org/job/osinfo-db-tools-master-rpm/systems=libvirt-fedora…> -c -m a+r {} {} \; \ || chmod -R a+r "osinfo-db-tools-1.2.0" tardir=osinfo-db-tools-1.2.0 && tar --format=ustar -chf - "$tardir" | eval GZIP= gzip '--no-name --best --rsyncable' -c >osinfo-db-tools-1.2.0.tar.gz make[1]: Leaving directory '<https://ci.centos.org/job/osinfo-db-tools-master-rpm/systems=libvirt-fedora…'> if test -d "osinfo-db-tools-1.2.0"; then find "osinfo-db-tools-1.2.0" -type d ! -perm -200 -exec chmod u+w {} ';' && rm -rf "osinfo-db-tools-1.2.0" || { sleep 5 && rm -rf "osinfo-db-tools-1.2.0"; }; else :; fi + rpmbuild -ta osinfo-db-tools-1.2.0.tar.gz /tmp/hudson3600793406701974520.sh: line 14: rpmbuild: command not found Build step 'Execute shell' marked build as failure
1 1
0 0
  • ← Newer
  • 1
  • 2
  • 3
  • 4
  • 5
  • 6
  • 7
  • ...
  • 75
  • Older →

HyperKitty Powered by HyperKitty version 1.3.12.