libvirt List Archives
Sign In Sign Up
Manage this list Sign In Sign Up

Keyboard Shortcuts

Thread View

  • j: Next unread message
  • k: Previous unread message
  • j a: Jump to all threads
  • j l: Jump to MailingList overview

CI

Thread Start a new thread
Download
Threads by month
  • ----- 2025 -----
  • August
  • July
  • June
  • May
  • April
  • March
  • February
  • January
  • ----- 2024 -----
  • December
  • November
  • October
  • September
  • August
  • July
  • June
  • May
  • April
  • March
  • February
  • January
  • ----- 2023 -----
  • December
  • November
  • October
  • September
  • August
  • July
  • June
  • May
  • April
  • March
  • February
  • January
  • ----- 2022 -----
  • December
  • November
  • October
  • September
  • August
  • July
  • June
  • May
  • April
  • March
  • February
  • January
  • ----- 2021 -----
  • December
  • November
  • October
  • September
  • August
  • July
  • June
  • May
  • April
  • March
  • February
  • January
  • ----- 2020 -----
  • December
  • November
  • October
  • September
  • August
  • July
  • June
  • May
  • April
  • March
  • February
  • January
  • ----- 2019 -----
  • December
  • November
  • October
  • September
  • August
  • July
  • June
  • May
  • April
  • March
  • February
  • January
  • ----- 2018 -----
  • December
  • November
  • October
  • September
  • August
  • July
  • June
  • May
  • April
  • March
  • February
  • January
  • ----- 2017 -----
  • December
  • November
  • October
  • September
  • August
  • July
  • June
  • May
  • April
  • March
  • February
  • January
  • ----- 2016 -----
  • December
  • November
  • October
  • September
  • August
  • July
ci@lists.libvirt.org

October 2023

  • 2 participants
  • 746 discussions
[Libvirt-ci] Build failed in Jenkins: libvirt-tck-master-rpm » libvirt-fedora-25 #463
by ci@centos.org 26 Oct '23

26 Oct '23
See <https://ci.centos.org/job/libvirt-tck-master-rpm/systems=libvirt-fedora-25/…> ------------------------------------------ Started by upstream project "libvirt-tck-master-rpm" build number 463 originally caused by: Started by upstream project "libvirt-tck-master-test" build number 467 originally caused by: Started by user Libvirt [EnvInject] - Loading node environment variables. Building remotely on libvirt-fedora-25 (libvirt) in workspace <https://ci.centos.org/job/libvirt-tck-master-rpm/systems=libvirt-fedora-25/…> [libvirt-tck-master] $ /bin/sh -xe /tmp/hudson5805890841394827541.sh + sed -i -e 's/BuildRequires: *perl-Sys-Virt.*//' perl-Sys-Virt-TCK.spec + sed -i -e 's/BuildRequires: *perl(Sys::Virt).*//' perl-Sys-Virt-TCK.spec + sed -i -e 's/BuildRequires: *libvirt.*devel.*//' perl-Sys-Virt-TCK.spec + rm -f '*.tar.gz' + perl Build dist IMPORTANT NOTE: The 'passthrough' style of Makefile.PL is deprecated and may be removed in a future version of Module::Build in favor of the 'configure_requires' property. See Module::Build::Compat documentation for details. Module::Build was not found in configure_requires! Adding it now automatically as: configure_requires => { 'Module::Build' => 0.42 } Creating Makefile.PL Created META.yml and META.json Creating Sys-Virt-TCK-v0.1.0 Creating Sys-Virt-TCK-v0.1.0.tar.gz + rpmbuild -ta Sys-Virt-TCK-v0.1.0.tar.gz error: Failed build dependencies: perl(Config::Record) is needed by perl-Sys-Virt-TCK-0.1.0-1.noarch perl(Sub::Uplevel) is needed by perl-Sys-Virt-TCK-0.1.0-1.noarch Build step 'Execute shell' marked build as failure
1 1
0 0
[Libvirt-ci] Build failed in Jenkins: virt-manager-master-check » libvirt-fedora-25 #567
by ci@centos.org 26 Oct '23

26 Oct '23
See <https://ci.centos.org/job/virt-manager-master-check/systems=libvirt-fedora-…> ------------------------------------------ Started by upstream project "virt-manager-master-check" build number 567 originally caused by: Started by upstream project "virt-manager-master-build" build number 572 originally caused by: Started by upstream project "libvirt-python-master-build" build number 460 originally caused by: Started by user Libvirt [EnvInject] - Loading node environment variables. Building remotely on libvirt-fedora-25 (libvirt) in workspace <https://ci.centos.org/job/virt-manager-master-check/systems=libvirt-fedora-…> [virt-manager-master] $ /bin/sh -xe /tmp/hudson8090575064295708838.sh + python setup.py test running test Traceback (most recent call last): File "setup.py", line 679, in <module> distclass=VMMDistribution, File "/usr/lib64/python2.7/distutils/core.py", line 151, in setup dist.run_commands() File "/usr/lib64/python2.7/distutils/dist.py", line 953, in run_commands self.run_command(cmd) File "/usr/lib64/python2.7/distutils/dist.py", line 972, in run_command cmd_obj.run() File "setup.py", line 520, in run TestBaseCommand.run(self) File "setup.py", line 437, in run import tests as testsmodule File "<https://ci.centos.org/job/virt-manager-master-check/systems=libvirt-fedora-…",> line 33, in <module> from tests import utils File "<https://ci.centos.org/job/virt-manager-master-check/systems=libvirt-fedora-…",> line 21, in <module> import virtinst File "<https://ci.centos.org/job/virt-manager-master-check/systems=libvirt-fedora-…",> line 42, in <module> from virtinst.osdict import OSDB File "<https://ci.centos.org/job/virt-manager-master-check/systems=libvirt-fedora-…",> line 26, in <module> import gi ImportError: No module named gi Build step 'Execute shell' marked build as failure
1 2
0 0
[Libvirt-ci] Build failed in Jenkins: libvirt-tck-master-test » libvirt-fedora-25 #464
by ci@centos.org 26 Oct '23

26 Oct '23
See <https://ci.centos.org/job/libvirt-tck-master-test/systems=libvirt-fedora-25…> ------------------------------------------ Started by upstream project "libvirt-tck-master-test" build number 464 originally caused by: Started by upstream project "libvirt-tck-master-build" build number 465 originally caused by: Started by user Libvirt [EnvInject] - Loading node environment variables. Building remotely on libvirt-fedora-25 (libvirt) in workspace <https://ci.centos.org/job/libvirt-tck-master-test/systems=libvirt-fedora-25…> [libvirt-tck-master] $ /bin/sh -xe /tmp/hudson7033856547837293418.sh + perl Build test t/005-pod.t ................... ok t/010-pod-coverage.t .......... skipped: Haven't written POD yet # Failed test 'use Sys::Virt::TCK::Capabilities;' # at t/050-capabilities.t line 18. # Tried to use 'Sys::Virt::TCK::Capabilities'. # Error: Can't locate XML/Twig.pm in @INC (you may need to install the XML::Twig module) (@INC contains: <https://ci.centos.org/job/libvirt-tck-master-test/systems=libvirt-fedora-25…> <https://ci.centos.org/job/libvirt-tck-master-test/systems=libvirt-fedora-25…> <https://ci.centos.org/job/libvirt-tck-master-test/systems=libvirt-fedora-25…> /home/jenkins/build/libvirt/lib/perl5/x86_64-linux-thread-multi /home/jenkins/build/libvirt/lib/perl5 /home/jenkins/build/libvirt/lib64/perl5 /home/jenkins/build/libvirt/lib/perl5/x86_64-linux-thread-multi /home/jenkins/build/libvirt/lib/perl5/x86_64-linux-thread-multi /home/jenkins/build/libvirt/lib/perl5 /home/jenkins/build/libvirt/lib64/perl5 /usr/local/lib64/perl5 /usr/local/share/perl5 /usr/lib64/perl5/vendor_perl /usr/share/perl5/vendor_perl /usr/lib64/perl5 /usr/share/perl5 .) at <https://ci.centos.org/job/libvirt-tck-master-test/systems=libvirt-fedora-25…> line 19. # BEGIN failed--compilation aborted at <https://ci.centos.org/job/libvirt-tck-master-test/systems=libvirt-fedora-25…> line 19. # Compilation failed in require at t/050-capabilities.t line 18. # BEGIN failed--compilation aborted at t/050-capabilities.t line 18. Can't locate object method "new" via package "Sys::Virt::TCK::Capabilities" at t/050-capabilities.t line 264. # Looks like your test exited with 255 just after 1. t/050-capabilities.t .......... Dubious, test returned 255 (wstat 65280, 0xff00) Failed 77/77 subtests # Failed test 'use Sys::Virt::TCK::DomainBuilder;' # at t/070-domain-builder.t line 18. # Tried to use 'Sys::Virt::TCK::DomainBuilder'. # Error: Can't locate IO/String.pm in @INC (you may need to install the IO::String module) (@INC contains: <https://ci.centos.org/job/libvirt-tck-master-test/systems=libvirt-fedora-25…> <https://ci.centos.org/job/libvirt-tck-master-test/systems=libvirt-fedora-25…> <https://ci.centos.org/job/libvirt-tck-master-test/systems=libvirt-fedora-25…> /home/jenkins/build/libvirt/lib/perl5/x86_64-linux-thread-multi /home/jenkins/build/libvirt/lib/perl5 /home/jenkins/build/libvirt/lib64/perl5 /home/jenkins/build/libvirt/lib/perl5/x86_64-linux-thread-multi /home/jenkins/build/libvirt/lib/perl5/x86_64-linux-thread-multi /home/jenkins/build/libvirt/lib/perl5 /home/jenkins/build/libvirt/lib64/perl5 /usr/local/lib64/perl5 /usr/local/share/perl5 /usr/lib64/perl5/vendor_perl /usr/share/perl5/vendor_perl /usr/lib64/perl5 /usr/share/perl5 .) at <https://ci.centos.org/job/libvirt-tck-master-test/systems=libvirt-fedora-25…> line 20. # BEGIN failed--compilation aborted at <https://ci.centos.org/job/libvirt-tck-master-test/systems=libvirt-fedora-25…> line 20. # Compilation failed in require at t/070-domain-builder.t line 18. # BEGIN failed--compilation aborted at t/070-domain-builder.t line 18. Can't locate object method "new" via package "Sys::Virt::TCK::DomainBuilder" at t/070-domain-builder.t line 55. # Looks like your test exited with 255 just after 1. t/070-domain-builder.t ........ Dubious, test returned 255 (wstat 65280, 0xff00) Failed 2/2 subtests # Failed test 'use Sys::Virt::TCK::NetworkBuilder;' # at t/080-network-builder.t line 18. # Tried to use 'Sys::Virt::TCK::NetworkBuilder'. # Error: Can't locate IO/String.pm in @INC (you may need to install the IO::String module) (@INC contains: <https://ci.centos.org/job/libvirt-tck-master-test/systems=libvirt-fedora-25…> <https://ci.centos.org/job/libvirt-tck-master-test/systems=libvirt-fedora-25…> <https://ci.centos.org/job/libvirt-tck-master-test/systems=libvirt-fedora-25…> /home/jenkins/build/libvirt/lib/perl5/x86_64-linux-thread-multi /home/jenkins/build/libvirt/lib/perl5 /home/jenkins/build/libvirt/lib64/perl5 /home/jenkins/build/libvirt/lib/perl5/x86_64-linux-thread-multi /home/jenkins/build/libvirt/lib/perl5/x86_64-linux-thread-multi /home/jenkins/build/libvirt/lib/perl5 /home/jenkins/build/libvirt/lib64/perl5 /usr/local/lib64/perl5 /usr/local/share/perl5 /usr/lib64/perl5/vendor_perl /usr/share/perl5/vendor_perl /usr/lib64/perl5 /usr/share/perl5 .) at <https://ci.centos.org/job/libvirt-tck-master-test/systems=libvirt-fedora-25…> line 20. # BEGIN failed--compilation aborted at <https://ci.centos.org/job/libvirt-tck-master-test/systems=libvirt-fedora-25…> line 20. # Compilation failed in require at t/080-network-builder.t line 18. # BEGIN failed--compilation aborted at t/080-network-builder.t line 18. Can't locate object method "new" via package "Sys::Virt::TCK::NetworkBuilder" at t/080-network-builder.t line 37. # Looks like your test exited with 255 just after 1. t/080-network-builder.t ....... Dubious, test returned 255 (wstat 65280, 0xff00) Failed 2/2 subtests # Failed test 'use Sys::Virt::TCK::StoragePoolBuilder;' # at t/090-storage-pool-builder.t line 20. # Tried to use 'Sys::Virt::TCK::StoragePoolBuilder'. # Error: Can't locate IO/String.pm in @INC (you may need to install the IO::String module) (@INC contains: <https://ci.centos.org/job/libvirt-tck-master-test/systems=libvirt-fedora-25…> <https://ci.centos.org/job/libvirt-tck-master-test/systems=libvirt-fedora-25…> <https://ci.centos.org/job/libvirt-tck-master-test/systems=libvirt-fedora-25…> /home/jenkins/build/libvirt/lib/perl5/x86_64-linux-thread-multi /home/jenkins/build/libvirt/lib/perl5 /home/jenkins/build/libvirt/lib64/perl5 /home/jenkins/build/libvirt/lib/perl5/x86_64-linux-thread-multi /home/jenkins/build/libvirt/lib/perl5/x86_64-linux-thread-multi /home/jenkins/build/libvirt/lib/perl5 /home/jenkins/build/libvirt/lib64/perl5 /usr/local/lib64/perl5 /usr/local/share/perl5 /usr/lib64/perl5/vendor_perl /usr/share/perl5/vendor_perl /usr/lib64/perl5 /usr/share/perl5 .) at <https://ci.centos.org/job/libvirt-tck-master-test/systems=libvirt-fedora-25…> line 20. # BEGIN failed--compilation aborted at <https://ci.centos.org/job/libvirt-tck-master-test/systems=libvirt-fedora-25…> line 20. # Compilation failed in require at t/090-storage-pool-builder.t line 20. # BEGIN failed--compilation aborted at t/090-storage-pool-builder.t line 20. Can't locate object method "new" via package "Sys::Virt::TCK::StoragePoolBuilder" at t/090-storage-pool-builder.t line 37. # Looks like your test exited with 255 just after 1. t/090-storage-pool-builder.t .. Dubious, test returned 255 (wstat 65280, 0xff00) Failed 8/8 subtests # Failed test 'use Sys::Virt::TCK::StorageVolBuilder;' # at t/100-storage-vol-builder.t line 18. # Tried to use 'Sys::Virt::TCK::StorageVolBuilder'. # Error: Can't locate IO/String.pm in @INC (you may need to install the IO::String module) (@INC contains: <https://ci.centos.org/job/libvirt-tck-master-test/systems=libvirt-fedora-25…> <https://ci.centos.org/job/libvirt-tck-master-test/systems=libvirt-fedora-25…> <https://ci.centos.org/job/libvirt-tck-master-test/systems=libvirt-fedora-25…> /home/jenkins/build/libvirt/lib/perl5/x86_64-linux-thread-multi /home/jenkins/build/libvirt/lib/perl5 /home/jenkins/build/libvirt/lib64/perl5 /home/jenkins/build/libvirt/lib/perl5/x86_64-linux-thread-multi /home/jenkins/build/libvirt/lib/perl5/x86_64-linux-thread-multi /home/jenkins/build/libvirt/lib/perl5 /home/jenkins/build/libvirt/lib64/perl5 /usr/local/lib64/perl5 /usr/local/share/perl5 /usr/lib64/perl5/vendor_perl /usr/share/perl5/vendor_perl /usr/lib64/perl5 /usr/share/perl5 .) at <https://ci.centos.org/job/libvirt-tck-master-test/systems=libvirt-fedora-25…> line 20. # BEGIN failed--compilation aborted at <https://ci.centos.org/job/libvirt-tck-master-test/systems=libvirt-fedora-25…> line 20. # Compilation failed in require at t/100-storage-vol-builder.t line 18. # BEGIN failed--compilation aborted at t/100-storage-vol-builder.t line 18. Can't locate object method "new" via package "Sys::Virt::TCK::StorageVolBuilder" at t/100-storage-vol-builder.t line 37. # Looks like your test exited with 255 just after 1. t/100-storage-vol-builder.t ... Dubious, test returned 255 (wstat 65280, 0xff00) Failed 2/2 subtests Test Summary Report ------------------- t/050-capabilities.t (Wstat: 65280 Tests: 1 Failed: 1) Failed test: 1 Non-zero exit status: 255 Parse errors: Bad plan. You planned 77 tests but ran 1. t/070-domain-builder.t (Wstat: 65280 Tests: 1 Failed: 1) Failed test: 1 Non-zero exit status: 255 Parse errors: Bad plan. You planned 2 tests but ran 1. t/080-network-builder.t (Wstat: 65280 Tests: 1 Failed: 1) Failed test: 1 Non-zero exit status: 255 Parse errors: Bad plan. You planned 2 tests but ran 1. t/090-storage-pool-builder.t (Wstat: 65280 Tests: 1 Failed: 1) Failed test: 1 Non-zero exit status: 255 Parse errors: Bad plan. You planned 8 tests but ran 1. t/100-storage-vol-builder.t (Wstat: 65280 Tests: 1 Failed: 1) Failed test: 1 Non-zero exit status: 255 Parse errors: Bad plan. You planned 2 tests but ran 1. Files=7, Tests=100, 1 wallclock secs ( 0.09 usr 0.03 sys + 1.31 cusr 0.17 csys = 1.60 CPU) Result: FAIL Failed 5/7 test programs. 5/100 subtests failed. Build step 'Execute shell' marked build as failure
1 3
0 0
[Libvirt-ci] Build failed in Jenkins: virt-manager-master-check » libvirt-fedora-24 #566
by ci@centos.org 26 Oct '23

26 Oct '23
See <https://ci.centos.org/job/virt-manager-master-check/systems=libvirt-fedora-…> ------------------------------------------ Started by upstream project "virt-manager-master-check" build number 566 originally caused by: Started by upstream project "virt-manager-master-build" build number 570 originally caused by: Started by upstream project "libosinfo-master-build" build number 69 originally caused by: Started by upstream project "osinfo-db-master-build" build number 199 originally caused by: Started by upstream project "osinfo-db-tools-master-build" build number 20 originally caused by: Started by user Libvirt [EnvInject] - Loading node environment variables. Building remotely on libvirt-fedora-24 (libvirt) in workspace <https://ci.centos.org/job/virt-manager-master-check/systems=libvirt-fedora-…> [virt-manager-master] $ /bin/sh -xe /tmp/hudson8983282207464304958.sh + python setup.py test running test Traceback (most recent call last): File "setup.py", line 679, in <module> distclass=VMMDistribution, File "/usr/lib64/python2.7/distutils/core.py", line 151, in setup dist.run_commands() File "/usr/lib64/python2.7/distutils/dist.py", line 953, in run_commands self.run_command(cmd) File "/usr/lib64/python2.7/distutils/dist.py", line 972, in run_command cmd_obj.run() File "setup.py", line 520, in run TestBaseCommand.run(self) File "setup.py", line 437, in run import tests as testsmodule File "<https://ci.centos.org/job/virt-manager-master-check/systems=libvirt-fedora-…",> line 33, in <module> from tests import utils File "<https://ci.centos.org/job/virt-manager-master-check/systems=libvirt-fedora-…",> line 21, in <module> import virtinst File "<https://ci.centos.org/job/virt-manager-master-check/systems=libvirt-fedora-…",> line 39, in <module> from virtinst import util File "<https://ci.centos.org/job/virt-manager-master-check/systems=libvirt-fedora-…",> line 27, in <module> import libvirt ImportError: No module named libvirt Build step 'Execute shell' marked build as failure
1 1
0 0
[Libvirt-ci] Build failed in Jenkins: virt-manager-master-check » libvirt-fedora-23 #566
by ci@centos.org 26 Oct '23

26 Oct '23
See <https://ci.centos.org/job/virt-manager-master-check/systems=libvirt-fedora-…> ------------------------------------------ Started by upstream project "virt-manager-master-check" build number 566 originally caused by: Started by upstream project "virt-manager-master-build" build number 570 originally caused by: Started by upstream project "libosinfo-master-build" build number 69 originally caused by: Started by upstream project "osinfo-db-master-build" build number 199 originally caused by: Started by upstream project "osinfo-db-tools-master-build" build number 20 originally caused by: Started by user Libvirt [EnvInject] - Loading node environment variables. Building remotely on libvirt-fedora-23 (libvirt) in workspace <https://ci.centos.org/job/virt-manager-master-check/systems=libvirt-fedora-…> [virt-manager-master] $ /bin/sh -xe /tmp/hudson5572239978037370538.sh + python setup.py test running test Traceback (most recent call last): File "setup.py", line 679, in <module> distclass=VMMDistribution, File "/usr/lib64/python2.7/distutils/core.py", line 151, in setup dist.run_commands() File "/usr/lib64/python2.7/distutils/dist.py", line 953, in run_commands self.run_command(cmd) File "/usr/lib64/python2.7/distutils/dist.py", line 972, in run_command cmd_obj.run() File "setup.py", line 520, in run TestBaseCommand.run(self) File "setup.py", line 437, in run import tests as testsmodule File "<https://ci.centos.org/job/virt-manager-master-check/systems=libvirt-fedora-…",> line 33, in <module> from tests import utils File "<https://ci.centos.org/job/virt-manager-master-check/systems=libvirt-fedora-…",> line 21, in <module> import virtinst File "<https://ci.centos.org/job/virt-manager-master-check/systems=libvirt-fedora-…",> line 39, in <module> from virtinst import util File "<https://ci.centos.org/job/virt-manager-master-check/systems=libvirt-fedora-…",> line 27, in <module> import libvirt ImportError: No module named libvirt Build step 'Execute shell' marked build as failure
1 1
0 0
[Libvirt-ci] Build failed in Jenkins: virt-manager-master-check » libvirt-fedora-rawhide #566
by ci@centos.org 26 Oct '23

26 Oct '23
See <https://ci.centos.org/job/virt-manager-master-check/systems=libvirt-fedora-…> ------------------------------------------ Started by upstream project "virt-manager-master-check" build number 566 originally caused by: Started by upstream project "virt-manager-master-build" build number 570 originally caused by: Started by upstream project "libosinfo-master-build" build number 69 originally caused by: Started by upstream project "osinfo-db-master-build" build number 199 originally caused by: Started by upstream project "osinfo-db-tools-master-build" build number 20 originally caused by: Started by user Libvirt [EnvInject] - Loading node environment variables. Building remotely on libvirt-fedora-rawhide (libvirt) in workspace <https://ci.centos.org/job/virt-manager-master-check/systems=libvirt-fedora-…> [virt-manager-master] $ /bin/sh -xe /tmp/hudson1744970245567089815.sh + python setup.py test running test Traceback (most recent call last): File "setup.py", line 679, in <module> distclass=VMMDistribution, File "/usr/lib64/python2.7/distutils/core.py", line 151, in setup dist.run_commands() File "/usr/lib64/python2.7/distutils/dist.py", line 953, in run_commands self.run_command(cmd) File "/usr/lib64/python2.7/distutils/dist.py", line 972, in run_command cmd_obj.run() File "setup.py", line 520, in run TestBaseCommand.run(self) File "setup.py", line 437, in run import tests as testsmodule File "<https://ci.centos.org/job/virt-manager-master-check/systems=libvirt-fedora-…",> line 33, in <module> from tests import utils File "<https://ci.centos.org/job/virt-manager-master-check/systems=libvirt-fedora-…",> line 21, in <module> import virtinst File "<https://ci.centos.org/job/virt-manager-master-check/systems=libvirt-fedora-…",> line 39, in <module> from virtinst import util File "<https://ci.centos.org/job/virt-manager-master-check/systems=libvirt-fedora-…",> line 27, in <module> import libvirt ImportError: No module named libvirt Build step 'Execute shell' marked build as failure
1 1
0 0
[Libvirt-ci] Build failed in Jenkins: libvirt-cim-master-rpm » libvirt-fedora-25 #408
by ci@centos.org 26 Oct '23

26 Oct '23
See <https://ci.centos.org/job/libvirt-cim-master-rpm/systems=libvirt-fedora-25/…> ------------------------------------------ Started by upstream project "libvirt-cim-master-rpm" build number 408 originally caused by: Started by upstream project "libvirt-cim-master-build" build number 443 originally caused by: Started by user Libvirt [EnvInject] - Loading node environment variables. Building remotely on libvirt-fedora-25 (libvirt) in workspace <https://ci.centos.org/job/libvirt-cim-master-rpm/systems=libvirt-fedora-25/…> [libvirt-cim-master] $ /bin/sh -xe /tmp/hudson3491774447639736517.sh + sed -i -e 's/.*libvirt-devel.*//' libvirt-cim.spec.in + make -j3 rpm Making clean in libxkutil make[1]: Entering directory '<https://ci.centos.org/job/libvirt-cim-master-rpm/systems=libvirt-fedora-25/…'> test -z "libxkutil.la" || rm -f libxkutil.la rm -rf .libs _libs rm -f xml_parse_test rm -f *.o rm -f *.lo rm -f ./so_locations make[1]: Leaving directory '<https://ci.centos.org/job/libvirt-cim-master-rpm/systems=libvirt-fedora-25/…'> Making clean in src make[1]: Entering directory '<https://ci.centos.org/job/libvirt-cim-master-rpm/systems=libvirt-fedora-25/…'> rm -rf .libs _libs test -z "libVirt_ComputerSystem.la libVirt_Device.la libVirt_RASD.la libVirt_HostSystem.la libVirt_VSSD.la libVirt_EnabledLogicalElementCapabilities.la libVirt_DevicePool.la libVirt_RegisteredProfile.la libVirt_VSMigrationCapabilities.la libVirt_VSMigrationSettingData.la libVirt_VirtualSystemSnapshotServiceCapabilities.la libVirt_SystemDevice.la libVirt_ComputerSystemIndication.la libVirt_ResourceAllocationSettingDataIndication.la libVirt_SwitchService.la libVirt_ComputerSystemMigrationIndication.la libVirt_VirtualSystemManagementCapabilities.la libVirt_AllocationCapabilities.la libVirt_ReferencedProfile.la libVirt_VirtualSystemSnapshotService.la libVirt_VirtualSystemManagementService.la libVirt_ResourcePoolConfigurationService.la libVirt_ResourcePoolConfigurationCapabilities.la libVirt_VSMigrationService.la libVirt_ConsoleRedirectionService.la libVirt_ConsoleRedirectionServiceCapabilities.la libVirt_KVMRedirectionSAP.la libVirt_SettingsDefineCapabilities.la libVirt_HostedDependency.la libVirt_ElementConformsToProfile.la libVirt_HostedResourcePool.la libVirt_ElementCapabilities.la libVirt_VSSDComponent.la libVirt_SettingsDefineState.la libVirt_ResourceAllocationFromPool.la libVirt_ElementAllocatedFromPool.la libVirt_HostedService.la libVirt_ElementSettingData.la libVirt_ConcreteComponent.la libVirt_ServiceAffectsElement.la libVirt_HostedAccessPoint.la libVirt_ServiceAccessBySAP.la libVirt_SAPAvailableForElement.la libVirt_FilterList.la libVirt_FilterEntry.la libVirt_EntriesInFilterList.la libVirt_NestedFilterList.la libVirt_HostedFilterList.la libVirt_AppliedFilterList.la" || rm -f libVirt_ComputerSystem.la libVirt_Device.la libVirt_RASD.la libVirt_HostSystem.la libVirt_VSSD.la libVirt_EnabledLogicalElementCapabilities.la libVirt_DevicePool.la libVirt_RegisteredProfile.la libVirt_VSMigrationCapabilities.la libVirt_VSMigrationSettingData.la libVirt_VirtualSystemSnapshotServiceCapabilities.la libVirt_SystemDevice.la libVirt_ComputerSystemIndication.la libVirt_ResourceAllocationSettingDataIndication.la libVirt_SwitchService.la libVirt_ComputerSystemMigrationIndication.la libVirt_VirtualSystemManagementCapabilities.la libVirt_AllocationCapabilities.la libVirt_ReferencedProfile.la libVirt_VirtualSystemSnapshotService.la libVirt_VirtualSystemManagementService.la libVirt_ResourcePoolConfigurationService.la libVirt_ResourcePoolConfigurationCapabilities.la libVirt_VSMigrationService.la libVirt_ConsoleRedirectionService.la libVirt_ConsoleRedirectionServiceCapabilities.la libVirt_KVMRedirectionSAP.la libVirt_SettingsDefineCapabilities.la libVirt_HostedDependency.la libVirt_ElementConformsToProfile.la libVirt_HostedResourcePool.la libVirt_ElementCapabilities.la libVirt_VSSDComponent.la libVirt_SettingsDefineState.la libVirt_ResourceAllocationFromPool.la libVirt_ElementAllocatedFromPool.la libVirt_HostedService.la libVirt_ElementSettingData.la libVirt_ConcreteComponent.la libVirt_ServiceAffectsElement.la libVirt_HostedAccessPoint.la libVirt_ServiceAccessBySAP.la libVirt_SAPAvailableForElement.la libVirt_FilterList.la libVirt_FilterEntry.la libVirt_EntriesInFilterList.la libVirt_NestedFilterList.la libVirt_HostedFilterList.la libVirt_AppliedFilterList.la rm -f *.o rm -f *.lo rm -f ./so_locations make[1]: Leaving directory '<https://ci.centos.org/job/libvirt-cim-master-rpm/systems=libvirt-fedora-25/…'> Making clean in doc make[1]: Entering directory '<https://ci.centos.org/job/libvirt-cim-master-rpm/systems=libvirt-fedora-25/…'> rm -rf .libs _libs rm -f *.lo make[1]: Leaving directory '<https://ci.centos.org/job/libvirt-cim-master-rpm/systems=libvirt-fedora-25/…'> Making clean in base_schema make[1]: Entering directory '<https://ci.centos.org/job/libvirt-cim-master-rpm/systems=libvirt-fedora-25/…'> rm -rf .libs _libs rm -f *.lo make[1]: Leaving directory '<https://ci.centos.org/job/libvirt-cim-master-rpm/systems=libvirt-fedora-25/…'> make[1]: Entering directory '<https://ci.centos.org/job/libvirt-cim-master-rpm/systems=libvirt-fedora-25/…'> rm -rf .libs _libs rm -f rm -f *.lo rm -f rm -f make[1]: Leaving directory '<https://ci.centos.org/job/libvirt-cim-master-rpm/systems=libvirt-fedora-25/…'> make[1]: Entering directory '<https://ci.centos.org/job/libvirt-cim-master-rpm/systems=libvirt-fedora-25/…'> make dist-bzip2 dist-gzip am__post_remove_distdir='@:' make[2]: Entering directory '<https://ci.centos.org/job/libvirt-cim-master-rpm/systems=libvirt-fedora-25/…'> cd . && /bin/sh ./config.status libvirt-cim.spec config.status: creating libvirt-cim.spec if test -d "libvirt-cim-0.6.3"; then find "libvirt-cim-0.6.3" -type d ! -perm -200 -exec chmod u+w {} ';' && rm -rf "libvirt-cim-0.6.3" || { sleep 5 && rm -rf "libvirt-cim-0.6.3"; }; else :; fi test -d "libvirt-cim-0.6.3" || mkdir "libvirt-cim-0.6.3" (cd libxkutil && make top_distdir=../libvirt-cim-0.6.3 distdir=../libvirt-cim-0.6.3/libxkutil \ am__remove_distdir=: am__skip_length_check=: am__skip_mode_fix=: distdir) make[3]: Entering directory '<https://ci.centos.org/job/libvirt-cim-master-rpm/systems=libvirt-fedora-25/…'> make[3]: Leaving directory '<https://ci.centos.org/job/libvirt-cim-master-rpm/systems=libvirt-fedora-25/…'> (cd src && make top_distdir=../libvirt-cim-0.6.3 distdir=../libvirt-cim-0.6.3/src \ am__remove_distdir=: am__skip_length_check=: am__skip_mode_fix=: distdir) make[3]: Entering directory '<https://ci.centos.org/job/libvirt-cim-master-rpm/systems=libvirt-fedora-25/…'> make[3]: Leaving directory '<https://ci.centos.org/job/libvirt-cim-master-rpm/systems=libvirt-fedora-25/…'> (cd doc && make top_distdir=../libvirt-cim-0.6.3 distdir=../libvirt-cim-0.6.3/doc \ am__remove_distdir=: am__skip_length_check=: am__skip_mode_fix=: distdir) make[3]: Entering directory '<https://ci.centos.org/job/libvirt-cim-master-rpm/systems=libvirt-fedora-25/…'> make[3]: Leaving directory '<https://ci.centos.org/job/libvirt-cim-master-rpm/systems=libvirt-fedora-25/…'> (cd base_schema && make top_distdir=../libvirt-cim-0.6.3 distdir=../libvirt-cim-0.6.3/base_schema \ am__remove_distdir=: am__skip_length_check=: am__skip_mode_fix=: distdir) make[3]: Entering directory '<https://ci.centos.org/job/libvirt-cim-master-rpm/systems=libvirt-fedora-25/…'> make[3]: Leaving directory '<https://ci.centos.org/job/libvirt-cim-master-rpm/systems=libvirt-fedora-25/…'> test -n "" \ || find "libvirt-cim-0.6.3" -type d ! -perm -755 \ -exec chmod u+rwx,go+rx {} \; -o \ ! -type d ! -perm -444 -links 1 -exec chmod a+r {} \; -o \ ! -type d ! -perm -400 -exec chmod a+r {} \; -o \ ! -type d ! -perm -444 -exec /bin/sh <https://ci.centos.org/job/libvirt-cim-master-rpm/systems=libvirt-fedora-25/…> -c -m a+r {} {} \; \ || chmod -R a+r "libvirt-cim-0.6.3" tardir=libvirt-cim-0.6.3 && ${TAR-tar} chof - "$tardir" | BZIP2=${BZIP2--9} bzip2 -c >libvirt-cim-0.6.3.tar.bz2 tardir=libvirt-cim-0.6.3 && ${TAR-tar} chof - "$tardir" | eval GZIP= gzip --best -c >libvirt-cim-0.6.3.tar.gz make[2]: Leaving directory '<https://ci.centos.org/job/libvirt-cim-master-rpm/systems=libvirt-fedora-25/…'> if test -d "libvirt-cim-0.6.3"; then find "libvirt-cim-0.6.3" -type d ! -perm -200 -exec chmod u+w {} ';' && rm -rf "libvirt-cim-0.6.3" || { sleep 5 && rm -rf "libvirt-cim-0.6.3"; }; else :; fi make[1]: Leaving directory '<https://ci.centos.org/job/libvirt-cim-master-rpm/systems=libvirt-fedora-25/…'> error: Failed build dependencies: libconfig-devel is needed by libvirt-cim-0.6.3-1.fc25.x86_64 Makefile:1181: recipe for target 'rpm' failed make: *** [rpm] Error 1 Build step 'Execute shell' marked build as failure
1 1
0 0
[Libvirt-ci] Build failed in Jenkins: virt-manager-master-check » libvirt-centos-7 #566
by ci@centos.org 26 Oct '23

26 Oct '23
See <https://ci.centos.org/job/virt-manager-master-check/systems=libvirt-centos-…> ------------------------------------------ Started by upstream project "virt-manager-master-check" build number 566 originally caused by: Started by upstream project "virt-manager-master-build" build number 570 originally caused by: Started by upstream project "libosinfo-master-build" build number 69 originally caused by: Started by upstream project "osinfo-db-master-build" build number 199 originally caused by: Started by upstream project "osinfo-db-tools-master-build" build number 20 originally caused by: Started by user Libvirt [EnvInject] - Loading node environment variables. Building remotely on libvirt-centos-7 (libvirt) in workspace <https://ci.centos.org/job/virt-manager-master-check/systems=libvirt-centos-…> [virt-manager-master] $ /bin/sh -xe /tmp/hudson2684725981992061032.sh + python setup.py test running test Traceback (most recent call last): File "setup.py", line 679, in <module> distclass=VMMDistribution, File "/usr/lib64/python2.7/distutils/core.py", line 152, in setup dist.run_commands() File "/usr/lib64/python2.7/distutils/dist.py", line 953, in run_commands self.run_command(cmd) File "/usr/lib64/python2.7/distutils/dist.py", line 972, in run_command cmd_obj.run() File "setup.py", line 520, in run TestBaseCommand.run(self) File "setup.py", line 437, in run import tests as testsmodule File "<https://ci.centos.org/job/virt-manager-master-check/systems=libvirt-centos-…",> line 33, in <module> from tests import utils File "<https://ci.centos.org/job/virt-manager-master-check/systems=libvirt-centos-…",> line 21, in <module> import virtinst File "<https://ci.centos.org/job/virt-manager-master-check/systems=libvirt-centos-…",> line 39, in <module> from virtinst import util File "<https://ci.centos.org/job/virt-manager-master-check/systems=libvirt-centos-…",> line 27, in <module> import libvirt ImportError: No module named libvirt Build step 'Execute shell' marked build as failure
1 1
0 0
[Libvirt-ci] Build failed in Jenkins: libvirt-perl-master-rpm » libvirt-fedora-25 #380
by ci@centos.org 26 Oct '23

26 Oct '23
See <https://ci.centos.org/job/libvirt-perl-master-rpm/systems=libvirt-fedora-25…> ------------------------------------------ Started by upstream project "libvirt-perl-master-rpm" build number 380 originally caused by: Started by upstream project "libvirt-perl-master-test" build number 460 originally caused by: Started by user Libvirt [EnvInject] - Loading node environment variables. Building remotely on libvirt-fedora-25 (libvirt) in workspace <https://ci.centos.org/job/libvirt-perl-master-rpm/systems=libvirt-fedora-25…> [libvirt-perl-master] $ /bin/sh -xe /tmp/hudson7513888130212700707.sh + sed -i -e 's/BuildRequires: *perl-Sys-Virt.*//' perl-Sys-Virt.spec + sed -i -e 's/BuildRequires: *libvirt.*devel.*//' perl-Sys-Virt.spec + rm -f '*.tar.gz' + make -j3 dist rm -rf Sys-Virt-3.5.0 "/usr/bin/perl" "-MExtUtils::Manifest=manicopy,maniread" \ -e "manicopy(maniread(),'Sys-Virt-3.5.0', 'best');" mkdir Sys-Virt-3.5.0 mkdir Sys-Virt-3.5.0/examples mkdir Sys-Virt-3.5.0/lib mkdir Sys-Virt-3.5.0/lib/Sys mkdir Sys-Virt-3.5.0/lib/Sys/Virt mkdir Sys-Virt-3.5.0/t tar cvf Sys-Virt-3.5.0.tar Sys-Virt-3.5.0 Sys-Virt-3.5.0/ Sys-Virt-3.5.0/META.yml.PL Sys-Virt-3.5.0/perl-Sys-Virt.spec Sys-Virt-3.5.0/MYMETA.json Sys-Virt-3.5.0/MANIFEST.SKIP Sys-Virt-3.5.0/MANIFEST Sys-Virt-3.5.0/INSTALL Sys-Virt-3.5.0/README Sys-Virt-3.5.0/MYMETA.yml Sys-Virt-3.5.0/lib/ Sys-Virt-3.5.0/lib/Sys/ Sys-Virt-3.5.0/lib/Sys/Virt.pm Sys-Virt-3.5.0/lib/Sys/Virt/ Sys-Virt-3.5.0/lib/Sys/Virt/Stream.pm Sys-Virt-3.5.0/lib/Sys/Virt/DomainSnapshot.pm Sys-Virt-3.5.0/lib/Sys/Virt/NodeDevice.pm Sys-Virt-3.5.0/lib/Sys/Virt/Domain.pm Sys-Virt-3.5.0/lib/Sys/Virt/Interface.pm Sys-Virt-3.5.0/lib/Sys/Virt/Secret.pm Sys-Virt-3.5.0/lib/Sys/Virt/Network.pm Sys-Virt-3.5.0/lib/Sys/Virt/Event.pm Sys-Virt-3.5.0/lib/Sys/Virt/NWFilter.pm Sys-Virt-3.5.0/lib/Sys/Virt/StoragePool.pm Sys-Virt-3.5.0/lib/Sys/Virt/Error.pm Sys-Virt-3.5.0/lib/Sys/Virt/StorageVol.pm Sys-Virt-3.5.0/META.yml Sys-Virt-3.5.0/Makefile.PL Sys-Virt-3.5.0/t/ Sys-Virt-3.5.0/t/010-pod-coverage.t Sys-Virt-3.5.0/t/030-api-coverage.t Sys-Virt-3.5.0/t/300-networks.t Sys-Virt-3.5.0/t/100-connect.t Sys-Virt-3.5.0/t/500-storage-vols.t Sys-Virt-3.5.0/t/800-events.t Sys-Virt-3.5.0/t/005-pod.t Sys-Virt-3.5.0/t/400-storage-pools.t Sys-Virt-3.5.0/t/020-constants.t Sys-Virt-3.5.0/t/015-changes.t Sys-Virt-3.5.0/t/600-interfaces.t Sys-Virt-3.5.0/t/200-domains.t Sys-Virt-3.5.0/AUTHORS Sys-Virt-3.5.0/perl-Sys-Virt.spec.PL Sys-Virt-3.5.0/LICENSE Sys-Virt-3.5.0/examples/ Sys-Virt-3.5.0/examples/events.pl Sys-Virt-3.5.0/examples/fs-freeze.pl Sys-Virt-3.5.0/examples/emulator-pin.pl Sys-Virt-3.5.0/examples/vol-download-all.pl Sys-Virt-3.5.0/examples/hv-stat.pl Sys-Virt-3.5.0/examples/open-console.pl Sys-Virt-3.5.0/examples/vol-upload.pl Sys-Virt-3.5.0/examples/send-key.pl Sys-Virt-3.5.0/examples/node-ksm.pl Sys-Virt-3.5.0/examples/dom-migrate.pl Sys-Virt-3.5.0/examples/dom-ifinfo.pl Sys-Virt-3.5.0/examples/vol-upload-all.pl Sys-Virt-3.5.0/examples/dump-info.pl Sys-Virt-3.5.0/examples/node-alloc.pl Sys-Virt-3.5.0/examples/vol-download-nonblock.pl Sys-Virt-3.5.0/examples/devices.pl Sys-Virt-3.5.0/examples/node-devlist.pl Sys-Virt-3.5.0/examples/save-restore.pl Sys-Virt-3.5.0/examples/dhcp-leases.pl Sys-Virt-3.5.0/examples/vol-download.pl Sys-Virt-3.5.0/examples/dom-stats.pl Sys-Virt-3.5.0/examples/vcpuinfo.pl Sys-Virt-3.5.0/examples/dump-xml.pl Sys-Virt-3.5.0/examples/vol-sparse.pl Sys-Virt-3.5.0/examples/node-cpu.pl Sys-Virt-3.5.0/examples/dom-fsinfo.pl Sys-Virt-3.5.0/examples/vol-upload-nonblock.pl Sys-Virt-3.5.0/examples/auth.pl Sys-Virt-3.5.0/examples/node-info.pl Sys-Virt-3.5.0/examples/iothreadinfo.pl Sys-Virt-3.5.0/HACKING Sys-Virt-3.5.0/Virt.xs Sys-Virt-3.5.0/Changes Sys-Virt-3.5.0/typemap rm -rf Sys-Virt-3.5.0 gzip --best Sys-Virt-3.5.0.tar Created Sys-Virt-3.5.0.tar.gz + rpmbuild -ta Sys-Virt-3.5.0.tar.gz error: Failed build dependencies: perl(Test::CPAN::Changes) is needed by perl-Sys-Virt-3.5.0-1.fc25.x86_64 Build step 'Execute shell' marked build as failure
1 1
0 0
[Libvirt-ci] Build failed in Jenkins: libvirt-sandbox-master-syntax-check » libvirt-fedora-24 #439
by ci@centos.org 26 Oct '23

26 Oct '23
See <https://ci.centos.org/job/libvirt-sandbox-master-syntax-check/systems=libvi…> ------------------------------------------ Started by upstream project "libvirt-sandbox-master-syntax-check" build number 439 originally caused by: Started by upstream project "libvirt-sandbox-master-build" build number 441 originally caused by: Started by upstream project "libvirt-glib-master-build" build number 443 originally caused by: Started by upstream project "libvirt-master-build" build number 635 originally caused by: Started by an SCM change Started by an SCM change Started by an SCM change Started by an SCM change Started by an SCM change [EnvInject] - Loading node environment variables. Building remotely on libvirt-fedora-24 (libvirt) in workspace <https://ci.centos.org/job/libvirt-sandbox-master-syntax-check/systems=libvi…> [libvirt-sandbox-master] $ /bin/sh -xe /tmp/hudson910371059473008323.sh + MAKE=make ++ uname + unamestr=Linux + '[' Linux = FreeBSD ']' + cd build /tmp/hudson910371059473008323.sh: line 8: cd: build: No such file or directory Build step 'Execute shell' marked build as failure
1 1
0 0
  • ← Newer
  • 1
  • 2
  • 3
  • 4
  • 5
  • ...
  • 75
  • Older →

HyperKitty Powered by HyperKitty version 1.3.12.