libvirt List Archives
Sign In Sign Up
Manage this list Sign In Sign Up

Keyboard Shortcuts

Thread View

  • j: Next unread message
  • k: Previous unread message
  • j a: Jump to all threads
  • j l: Jump to MailingList overview

CI

Thread Start a new thread
Download
Threads by month
  • ----- 2025 -----
  • August
  • July
  • June
  • May
  • April
  • March
  • February
  • January
  • ----- 2024 -----
  • December
  • November
  • October
  • September
  • August
  • July
  • June
  • May
  • April
  • March
  • February
  • January
  • ----- 2023 -----
  • December
  • November
  • October
  • September
  • August
  • July
  • June
  • May
  • April
  • March
  • February
  • January
  • ----- 2022 -----
  • December
  • November
  • October
  • September
  • August
  • July
  • June
  • May
  • April
  • March
  • February
  • January
  • ----- 2021 -----
  • December
  • November
  • October
  • September
  • August
  • July
  • June
  • May
  • April
  • March
  • February
  • January
  • ----- 2020 -----
  • December
  • November
  • October
  • September
  • August
  • July
  • June
  • May
  • April
  • March
  • February
  • January
  • ----- 2019 -----
  • December
  • November
  • October
  • September
  • August
  • July
  • June
  • May
  • April
  • March
  • February
  • January
  • ----- 2018 -----
  • December
  • November
  • October
  • September
  • August
  • July
  • June
  • May
  • April
  • March
  • February
  • January
  • ----- 2017 -----
  • December
  • November
  • October
  • September
  • August
  • July
  • June
  • May
  • April
  • March
  • February
  • January
  • ----- 2016 -----
  • December
  • November
  • October
  • September
  • August
  • July
ci@lists.libvirt.org

March 2019

  • 2 participants
  • 151 discussions
[Libvirt-ci] Build failed in Jenkins: libvirt-go-build » libvirt-debian-8 #311
by ci@centos.org 13 Mar '19

13 Mar '19
See <https://ci.centos.org/job/libvirt-go-build/systems=libvirt-debian-8/311/dis…> Changes: [berrange] Add VIR_DOMAIN_SNAPSHOT_LIST_TOPOLOGICAL constant ------------------------------------------ Started by upstream project "libvirt-go-build" build number 311 originally caused by: Started by an SCM change [EnvInject] - Loading node environment variables. Building remotely on libvirt-debian-8 (libvirt) in workspace <https://ci.centos.org/job/libvirt-go-build/systems=libvirt-debian-8/ws/> No credentials specified > git rev-parse --is-inside-work-tree # timeout=10 Fetching changes from the remote Git repository > git config remote.origin.url https://github.com/libvirt/libvirt-go.git # timeout=10 Fetching upstream changes from https://github.com/libvirt/libvirt-go.git > git --version # timeout=10 > git fetch --tags --progress https://github.com/libvirt/libvirt-go.git +refs/heads/*:refs/remotes/origin/* Checking out Revision 1e45bd527c6739894734760e4c0fd7a5111877d0 (refs/remotes/origin/master) > git config core.sparsecheckout # timeout=10 > git checkout -f 1e45bd527c6739894734760e4c0fd7a5111877d0 Commit message: "Add VIR_DOMAIN_SNAPSHOT_LIST_TOPOLOGICAL constant" > git rev-list --no-walk b3f8da01e8475f12b959d063bf932dc05df37f1c # timeout=10 Cleaning workspace > git rev-parse --verify HEAD # timeout=10 Resetting working tree > git reset --hard # timeout=10 > git clean -fdx # timeout=10 [libvirt-go] $ /bin/sh -xe /tmp/jenkins4559133480970017992.sh + go build -v _<https://ci.centos.org/job/libvirt-go-build/systems=libvirt-debian-8/ws/> # _<https://ci.centos.org/job/libvirt-go-build/systems=libvirt-debian-8/ws/> In file included from /home/jenkins/build/libvirt/include/libvirt/libvirt.h:37:0, from ./domain_snapshot_wrapper.h:29, from ./domain_snapshot.go:33: /home/jenkins/build/libvirt/include/libvirt/libvirt-domain-snapshot.h:139:5: error: expected identifier before '(' token VIR_DOMAIN_SNAPSHOT_LIST_TOPOLOGICAL = (1 << 10), /* Ensure parents occur ^ Build step 'Execute shell' marked build as failure
1 1
0 0
[Libvirt-ci] Build failed in Jenkins: libvirt-perl-check » libvirt-freebsd-12 #311
by ci@centos.org 13 Mar '19

13 Mar '19
See <https://ci.centos.org/job/libvirt-perl-check/systems=libvirt-freebsd-12/311…> ------------------------------------------ Started by upstream project "libvirt-perl-check" build number 311 originally caused by: Started by upstream project "libvirt-perl-build" build number 311 originally caused by: Started by upstream project "libvirt-build" build number 377 originally caused by: Started by an SCM change [EnvInject] - Loading node environment variables. Building remotely on libvirt-freebsd-12 (libvirt) in workspace <https://ci.centos.org/job/libvirt-perl-check/systems=libvirt-freebsd-12/ws/> [libvirt-perl] $ /bin/sh -xe /tmp/jenkins5355426863108420146.sh + export 'TEST_MAINTAINER=1' + perl Build test t/005-pod.t ............ ok t/010-pod-coverage.t ... ok t/015-changes.t ........ ok t/020-constants.t ...... ok # Failed test 'VIR_DOMAIN_SNAPSHOT_LIST_TOPOLOGICAL' # at t/030-api-coverage.t line 175. # Looks like you failed 1 test of 1654. t/030-api-coverage.t ... Dubious, test returned 1 (wstat 256, 0x100) Failed 1/1654 subtests t/100-connect.t ........ ok t/200-domains.t ........ ok t/300-networks.t ....... ok t/400-storage-pools.t .. ok t/500-storage-vols.t ... ok t/600-interfaces.t ..... ok t/800-events.t ......... ok Test Summary Report ------------------- t/030-api-coverage.t (Wstat: 256 Tests: 1654 Failed: 1) Failed test: 1038 Non-zero exit status: 1 Files=12, Tests=1908, 38 wallclock secs ( 0.86 usr 0.36 sys + 18.70 cusr 1.78 csys = 21.70 CPU) Result: FAIL Failed 1/12 test programs. 1/1908 subtests failed. Build step 'Execute shell' marked build as failure
1 2
0 0
[Libvirt-ci] Build failed in Jenkins: libvirt-perl-check » libvirt-freebsd-11 #311
by ci@centos.org 13 Mar '19

13 Mar '19
See <https://ci.centos.org/job/libvirt-perl-check/systems=libvirt-freebsd-11/311…> ------------------------------------------ Started by upstream project "libvirt-perl-check" build number 311 originally caused by: Started by upstream project "libvirt-perl-build" build number 311 originally caused by: Started by upstream project "libvirt-build" build number 377 originally caused by: Started by an SCM change [EnvInject] - Loading node environment variables. Building remotely on libvirt-freebsd-11 (libvirt) in workspace <https://ci.centos.org/job/libvirt-perl-check/systems=libvirt-freebsd-11/ws/> [libvirt-perl] $ /bin/sh -xe /tmp/jenkins4653058632013931283.sh + export 'TEST_MAINTAINER=1' + perl Build test t/005-pod.t ............ ok t/010-pod-coverage.t ... ok t/015-changes.t ........ ok t/020-constants.t ...... ok # Failed test 'VIR_DOMAIN_SNAPSHOT_LIST_TOPOLOGICAL' # at t/030-api-coverage.t line 175. # Looks like you failed 1 test of 1654. t/030-api-coverage.t ... Dubious, test returned 1 (wstat 256, 0x100) Failed 1/1654 subtests t/100-connect.t ........ ok t/200-domains.t ........ ok t/300-networks.t ....... ok t/400-storage-pools.t .. ok t/500-storage-vols.t ... ok t/600-interfaces.t ..... ok t/800-events.t ......... ok Test Summary Report ------------------- t/030-api-coverage.t (Wstat: 256 Tests: 1654 Failed: 1) Failed test: 1038 Non-zero exit status: 1 Files=12, Tests=1908, 43 wallclock secs ( 1.10 usr 0.41 sys + 20.28 cusr 2.14 csys = 23.93 CPU) Result: FAIL Failed 1/12 test programs. 1/1908 subtests failed. Build step 'Execute shell' marked build as failure
1 2
0 0
[Libvirt-ci] Build failed in Jenkins: libvirt-perl-check » libvirt-fedora-28 #311
by ci@centos.org 13 Mar '19

13 Mar '19
See <https://ci.centos.org/job/libvirt-perl-check/systems=libvirt-fedora-28/311/…> ------------------------------------------ Started by upstream project "libvirt-perl-check" build number 311 originally caused by: Started by upstream project "libvirt-perl-build" build number 311 originally caused by: Started by upstream project "libvirt-build" build number 377 originally caused by: Started by an SCM change [EnvInject] - Loading node environment variables. Building remotely on libvirt-fedora-28 (libvirt) in workspace <https://ci.centos.org/job/libvirt-perl-check/systems=libvirt-fedora-28/ws/> [libvirt-perl] $ /bin/sh -xe /tmp/jenkins3639534612168714322.sh + export TEST_MAINTAINER=1 + TEST_MAINTAINER=1 + perl Build test t/005-pod.t ............ ok t/010-pod-coverage.t ... ok t/015-changes.t ........ ok t/020-constants.t ...... ok # Failed test 'VIR_DOMAIN_SNAPSHOT_LIST_TOPOLOGICAL' # at t/030-api-coverage.t line 175. # Looks like you failed 1 test of 1654. t/030-api-coverage.t ... Dubious, test returned 1 (wstat 256, 0x100) Failed 1/1654 subtests t/100-connect.t ........ ok t/200-domains.t ........ ok t/300-networks.t ....... ok t/400-storage-pools.t .. ok t/500-storage-vols.t ... ok t/600-interfaces.t ..... ok t/800-events.t ......... ok Test Summary Report ------------------- t/030-api-coverage.t (Wstat: 256 Tests: 1654 Failed: 1) Failed test: 1038 Non-zero exit status: 1 Files=12, Tests=1908, 70 wallclock secs ( 0.46 usr 0.07 sys + 8.89 cusr 0.61 csys = 10.03 CPU) Result: FAIL Failed 1/12 test programs. 1/1908 subtests failed. Build step 'Execute shell' marked build as failure
1 2
0 0
[Libvirt-ci] Build failed in Jenkins: libvirt-perl-check » libvirt-fedora-29 #311
by ci@centos.org 13 Mar '19

13 Mar '19
See <https://ci.centos.org/job/libvirt-perl-check/systems=libvirt-fedora-29/311/…> ------------------------------------------ Started by upstream project "libvirt-perl-check" build number 311 originally caused by: Started by upstream project "libvirt-perl-build" build number 311 originally caused by: Started by upstream project "libvirt-build" build number 377 originally caused by: Started by an SCM change [EnvInject] - Loading node environment variables. Building remotely on libvirt-fedora-29 (libvirt) in workspace <https://ci.centos.org/job/libvirt-perl-check/systems=libvirt-fedora-29/ws/> [libvirt-perl] $ /bin/sh -xe /tmp/jenkins2940415989470839359.sh + export TEST_MAINTAINER=1 + TEST_MAINTAINER=1 + perl Build test t/005-pod.t ............ ok t/010-pod-coverage.t ... ok t/015-changes.t ........ ok t/020-constants.t ...... ok # Failed test 'VIR_DOMAIN_SNAPSHOT_LIST_TOPOLOGICAL' # at t/030-api-coverage.t line 175. # Looks like you failed 1 test of 1654. t/030-api-coverage.t ... Dubious, test returned 1 (wstat 256, 0x100) Failed 1/1654 subtests t/100-connect.t ........ ok t/200-domains.t ........ ok t/300-networks.t ....... ok t/400-storage-pools.t .. ok t/500-storage-vols.t ... ok t/600-interfaces.t ..... ok t/800-events.t ......... ok Test Summary Report ------------------- t/030-api-coverage.t (Wstat: 256 Tests: 1654 Failed: 1) Failed test: 1038 Non-zero exit status: 1 Files=12, Tests=1908, 67 wallclock secs ( 0.48 usr 0.06 sys + 8.76 cusr 0.58 csys = 9.88 CPU) Result: FAIL Failed 1/12 test programs. 1/1908 subtests failed. Build step 'Execute shell' marked build as failure
1 2
0 0
[Libvirt-ci] Build failed in Jenkins: libvirt-perl-check » libvirt-centos-7 #311
by ci@centos.org 13 Mar '19

13 Mar '19
See <https://ci.centos.org/job/libvirt-perl-check/systems=libvirt-centos-7/311/d…> ------------------------------------------ Started by upstream project "libvirt-perl-check" build number 311 originally caused by: Started by upstream project "libvirt-perl-build" build number 311 originally caused by: Started by upstream project "libvirt-build" build number 377 originally caused by: Started by an SCM change [EnvInject] - Loading node environment variables. Building remotely on libvirt-centos-7 (libvirt) in workspace <https://ci.centos.org/job/libvirt-perl-check/systems=libvirt-centos-7/ws/> [libvirt-perl] $ /bin/sh -xe /tmp/jenkins6635810601181651194.sh + export TEST_MAINTAINER=1 + TEST_MAINTAINER=1 + perl Build test t/005-pod.t ............ ok t/010-pod-coverage.t ... ok t/015-changes.t ........ ok t/020-constants.t ...... ok # Failed test 'VIR_DOMAIN_SNAPSHOT_LIST_TOPOLOGICAL' # at t/030-api-coverage.t line 175. # Looks like you failed 1 test of 1654. t/030-api-coverage.t ... Dubious, test returned 1 (wstat 256, 0x100) Failed 1/1654 subtests t/100-connect.t ........ ok t/200-domains.t ........ ok t/300-networks.t ....... ok t/400-storage-pools.t .. ok t/500-storage-vols.t ... ok t/600-interfaces.t ..... ok t/800-events.t ......... ok Test Summary Report ------------------- t/030-api-coverage.t (Wstat: 256 Tests: 1654 Failed: 1) Failed test: 1038 Non-zero exit status: 1 Files=12, Tests=1908, 49 wallclock secs ( 0.42 usr 0.05 sys + 8.34 cusr 0.45 csys = 9.26 CPU) Result: FAIL Failed 1/12 test programs. 1/1908 subtests failed. Build step 'Execute shell' marked build as failure
1 2
0 0
[Libvirt-ci] Build failed in Jenkins: libvirt-perl-check » libvirt-debian-9 #311
by ci@centos.org 13 Mar '19

13 Mar '19
See <https://ci.centos.org/job/libvirt-perl-check/systems=libvirt-debian-9/311/d…> ------------------------------------------ Started by upstream project "libvirt-perl-check" build number 311 originally caused by: Started by upstream project "libvirt-perl-build" build number 311 originally caused by: Started by upstream project "libvirt-build" build number 377 originally caused by: Started by an SCM change [EnvInject] - Loading node environment variables. Building remotely on libvirt-debian-9 (libvirt) in workspace <https://ci.centos.org/job/libvirt-perl-check/systems=libvirt-debian-9/ws/> [libvirt-perl] $ /bin/sh -xe /tmp/jenkins4671317833985961436.sh + export TEST_MAINTAINER=1 + perl Build test t/005-pod.t ............ ok t/010-pod-coverage.t ... ok t/015-changes.t ........ ok t/020-constants.t ...... ok # Failed test 'VIR_DOMAIN_SNAPSHOT_LIST_TOPOLOGICAL' # at t/030-api-coverage.t line 175. # Looks like you failed 1 test of 1654. t/030-api-coverage.t ... Dubious, test returned 1 (wstat 256, 0x100) Failed 1/1654 subtests t/100-connect.t ........ ok t/200-domains.t ........ ok t/300-networks.t ....... ok t/400-storage-pools.t .. ok t/500-storage-vols.t ... ok t/600-interfaces.t ..... ok t/800-events.t ......... ok Test Summary Report ------------------- t/030-api-coverage.t (Wstat: 256 Tests: 1654 Failed: 1) Failed test: 1038 Non-zero exit status: 1 Files=12, Tests=1908, 42 wallclock secs ( 0.69 usr 0.07 sys + 13.96 cusr 0.66 csys = 15.38 CPU) Result: FAIL Failed 1/12 test programs. 1/1908 subtests failed. Build step 'Execute shell' marked build as failure
1 2
0 0
[Libvirt-ci] Build failed in Jenkins: libvirt-perl-check » libvirt-debian-8 #311
by ci@centos.org 13 Mar '19

13 Mar '19
See <https://ci.centos.org/job/libvirt-perl-check/systems=libvirt-debian-8/311/d…> ------------------------------------------ Started by upstream project "libvirt-perl-check" build number 311 originally caused by: Started by upstream project "libvirt-perl-build" build number 311 originally caused by: Started by upstream project "libvirt-build" build number 377 originally caused by: Started by an SCM change [EnvInject] - Loading node environment variables. Building remotely on libvirt-debian-8 (libvirt) in workspace <https://ci.centos.org/job/libvirt-perl-check/systems=libvirt-debian-8/ws/> [libvirt-perl] $ /bin/sh -xe /tmp/jenkins8369303856766780212.sh + export TEST_MAINTAINER=1 + perl Build test t/005-pod.t ............ ok t/010-pod-coverage.t ... ok t/015-changes.t ........ ok t/020-constants.t ...... ok # Failed test 'VIR_DOMAIN_SNAPSHOT_LIST_TOPOLOGICAL' # at t/030-api-coverage.t line 175. # Looks like you failed 1 test of 1654. t/030-api-coverage.t ... Dubious, test returned 1 (wstat 256, 0x100) Failed 1/1654 subtests t/100-connect.t ........ ok t/200-domains.t ........ ok t/300-networks.t ....... ok t/400-storage-pools.t .. ok t/500-storage-vols.t ... ok t/600-interfaces.t ..... ok t/800-events.t ......... ok Test Summary Report ------------------- t/030-api-coverage.t (Wstat: 256 Tests: 1654 Failed: 1) Failed test: 1038 Non-zero exit status: 1 Files=12, Tests=1908, 15 wallclock secs ( 0.82 usr 0.14 sys + 11.71 cusr 0.75 csys = 13.42 CPU) Result: FAIL Failed 1/12 test programs. 1/1908 subtests failed. Build step 'Execute shell' marked build as failure
1 2
0 0
[Libvirt-ci] Build failed in Jenkins: libvirt-go-xml-check » libvirt-fedora-rawhide #304
by ci@centos.org 13 Mar '19

13 Mar '19
See <https://ci.centos.org/job/libvirt-go-xml-check/systems=libvirt-fedora-rawhi…> ------------------------------------------ Started by upstream project "libvirt-go-xml-check" build number 304 originally caused by: Started by upstream project "libvirt-go-xml-build" build number 304 originally caused by: Started by upstream project "libvirt-build" build number 370 originally caused by: Started by an SCM change Started by an SCM change Started by an SCM change Started by an SCM change [EnvInject] - Loading node environment variables. Building remotely on libvirt-fedora-rawhide (libvirt) in workspace <https://ci.centos.org/job/libvirt-go-xml-check/systems=libvirt-fedora-rawhi…> [libvirt-go-xml] $ /bin/sh -xe /tmp/jenkins6419206165426909399.sh + export 'TEST_ARGS=-tags xmlroundtrip' + TEST_ARGS='-tags xmlroundtrip' + go test -tags xmlroundtrip --- FAIL: TestRoundTrip (11.92s) xml_test.go:400: testdata/libvirt/tests/qemuxml2argvdata/aarch64-virt-graphics.xml: /domain[0]/devices[0]/channel[0]/source[0]: element in expected XML missing in actual XML FAIL exit status 1 FAIL _<https://ci.centos.org/job/libvirt-go-xml-check/systems=libvirt-fedora-rawhi…> 12.059s Build step 'Execute shell' marked build as failure
1 9
0 0
[Libvirt-ci] Build failed in Jenkins: libvirt-go-xml-check » libvirt-fedora-29 #304
by ci@centos.org 13 Mar '19

13 Mar '19
See <https://ci.centos.org/job/libvirt-go-xml-check/systems=libvirt-fedora-29/30…> ------------------------------------------ Started by upstream project "libvirt-go-xml-check" build number 304 originally caused by: Started by upstream project "libvirt-go-xml-build" build number 304 originally caused by: Started by upstream project "libvirt-build" build number 370 originally caused by: Started by an SCM change Started by an SCM change Started by an SCM change Started by an SCM change [EnvInject] - Loading node environment variables. Building remotely on libvirt-fedora-29 (libvirt) in workspace <https://ci.centos.org/job/libvirt-go-xml-check/systems=libvirt-fedora-29/ws/> [libvirt-go-xml] $ /bin/sh -xe /tmp/jenkins8962560308631100095.sh + export 'TEST_ARGS=-tags xmlroundtrip' + TEST_ARGS='-tags xmlroundtrip' + go test -tags xmlroundtrip --- FAIL: TestRoundTrip (6.56s) xml_test.go:400: testdata/libvirt/tests/qemuxml2argvdata/aarch64-virt-graphics.xml: /domain[0]/devices[0]/channel[0]/source[0]: element in expected XML missing in actual XML FAIL exit status 1 FAIL _<https://ci.centos.org/job/libvirt-go-xml-check/systems=libvirt-fedora-29/ws/> 6.607s Build step 'Execute shell' marked build as failure
1 9
0 0
  • ← Newer
  • 1
  • ...
  • 8
  • 9
  • 10
  • 11
  • 12
  • 13
  • 14
  • 15
  • 16
  • Older →

HyperKitty Powered by HyperKitty version 1.3.12.