libvirt List Archives
Sign In Sign Up
Manage this list Sign In Sign Up

Keyboard Shortcuts

Thread View

  • j: Next unread message
  • k: Previous unread message
  • j a: Jump to all threads
  • j l: Jump to MailingList overview

CI

Thread Start a new thread
Download
Threads by month
  • ----- 2025 -----
  • August
  • July
  • June
  • May
  • April
  • March
  • February
  • January
  • ----- 2024 -----
  • December
  • November
  • October
  • September
  • August
  • July
  • June
  • May
  • April
  • March
  • February
  • January
  • ----- 2023 -----
  • December
  • November
  • October
  • September
  • August
  • July
  • June
  • May
  • April
  • March
  • February
  • January
  • ----- 2022 -----
  • December
  • November
  • October
  • September
  • August
  • July
  • June
  • May
  • April
  • March
  • February
  • January
  • ----- 2021 -----
  • December
  • November
  • October
  • September
  • August
  • July
  • June
  • May
  • April
  • March
  • February
  • January
  • ----- 2020 -----
  • December
  • November
  • October
  • September
  • August
  • July
  • June
  • May
  • April
  • March
  • February
  • January
  • ----- 2019 -----
  • December
  • November
  • October
  • September
  • August
  • July
  • June
  • May
  • April
  • March
  • February
  • January
  • ----- 2018 -----
  • December
  • November
  • October
  • September
  • August
  • July
  • June
  • May
  • April
  • March
  • February
  • January
  • ----- 2017 -----
  • December
  • November
  • October
  • September
  • August
  • July
  • June
  • May
  • April
  • March
  • February
  • January
  • ----- 2016 -----
  • December
  • November
  • October
  • September
  • August
  • July
ci@lists.libvirt.org

March 2019

  • 2 participants
  • 151 discussions
[Libvirt-ci] Build failed in Jenkins: libvirt-go-check » libvirt-freebsd-12 #305
by ci@centos.org 13 Mar '19

13 Mar '19
See <https://ci.centos.org/job/libvirt-go-check/systems=libvirt-freebsd-12/305/d…> ------------------------------------------ Started by upstream project "libvirt-go-check" build number 305 originally caused by: Started by upstream project "libvirt-go-build" build number 309 originally caused by: Started by upstream project "libvirt-build" build number 377 originally caused by: Started by an SCM change [EnvInject] - Loading node environment variables. Building remotely on libvirt-freebsd-12 (libvirt) in workspace <https://ci.centos.org/job/libvirt-go-check/systems=libvirt-freebsd-12/ws/> [libvirt-go] $ /bin/sh -xe /tmp/jenkins3882689155638546343.sh + export 'TEST_ARGS=-tags api' + go test -tags api Missing enum 'VIR_DOMAIN_SNAPSHOT_LIST_TOPOLOGICAL' --- FAIL: TestAPICoverage (0.43s) panic: Missing symbols found [recovered] panic: Missing symbols found goroutine 19 [running]: testing.tRunner.func1(0xc0000c8100) /usr/local/go/src/testing/testing.go:830 +0x388 panic(0x2234e0, 0x2988c0) /usr/local/go/src/runtime/panic.go:522 +0x1b5 _/usr<https://ci.centos.org/job/libvirt-go-check/systems=libvirt-freebsd-12/ws/.T…> /usr<https://ci.centos.org/job/libvirt-go-check/systems=libvirt-freebsd-12/ws/ap…>:501 +0x551 testing.tRunner(0xc0000c8100, 0x272f38) /usr/local/go/src/testing/testing.go:865 +0xc0 created by testing.(*T).Run /usr/local/go/src/testing/testing.go:916 +0x357 exit status 2 FAIL _/usr<https://ci.centos.org/job/libvirt-go-check/systems=libvirt-freebsd-12/ws/> 0.776s Build step 'Execute shell' marked build as failure
1 2
0 0
[Libvirt-ci] Build failed in Jenkins: libvirt-go-check » libvirt-debian-9 #305
by ci@centos.org 13 Mar '19

13 Mar '19
See <https://ci.centos.org/job/libvirt-go-check/systems=libvirt-debian-9/305/dis…> ------------------------------------------ Started by upstream project "libvirt-go-check" build number 305 originally caused by: Started by upstream project "libvirt-go-build" build number 309 originally caused by: Started by upstream project "libvirt-build" build number 377 originally caused by: Started by an SCM change [EnvInject] - Loading node environment variables. Building remotely on libvirt-debian-9 (libvirt) in workspace <https://ci.centos.org/job/libvirt-go-check/systems=libvirt-debian-9/ws/> [libvirt-go] $ /bin/sh -xe /tmp/jenkins7795887225231391887.sh + export TEST_ARGS=-tags api + go test -tags api Missing enum 'VIR_DOMAIN_SNAPSHOT_LIST_TOPOLOGICAL' --- FAIL: TestAPICoverage (0.53s) panic: Missing symbols found [recovered] panic: Missing symbols found goroutine 5 [running]: panic(0x55a1279ab1c0, 0xc420432550) /usr/lib/go-1.7/src/runtime/panic.go:500 +0x1a1 testing.tRunner.func1(0xc420078180) /usr/lib/go-1.7/src/testing/testing.go:579 +0x25d panic(0x55a1279ab1c0, 0xc420432550) /usr/lib/go-1.7/src/runtime/panic.go:458 +0x243 _<https://ci.centos.org/job/libvirt-go-check/systems=libvirt-debian-9/ws/.Tes…> <https://ci.centos.org/job/libvirt-go-check/systems=libvirt-debian-9/ws/api_…>:501 +0x5ff testing.tRunner(0xc420078180, 0x55a1279fe908) /usr/lib/go-1.7/src/testing/testing.go:610 +0x81 created by testing.(*T).Run /usr/lib/go-1.7/src/testing/testing.go:646 +0x2ec exit status 2 FAIL _<https://ci.centos.org/job/libvirt-go-check/systems=libvirt-debian-9/ws/> 0.573s Build step 'Execute shell' marked build as failure
1 2
0 0
[Libvirt-ci] Build failed in Jenkins: libvirt-go-check » libvirt-debian-8 #305
by ci@centos.org 13 Mar '19

13 Mar '19
See <https://ci.centos.org/job/libvirt-go-check/systems=libvirt-debian-8/305/dis…> ------------------------------------------ Started by upstream project "libvirt-go-check" build number 305 originally caused by: Started by upstream project "libvirt-go-build" build number 309 originally caused by: Started by upstream project "libvirt-build" build number 377 originally caused by: Started by an SCM change [EnvInject] - Loading node environment variables. Building remotely on libvirt-debian-8 (libvirt) in workspace <https://ci.centos.org/job/libvirt-go-check/systems=libvirt-debian-8/ws/> [libvirt-go] $ /bin/sh -xe /tmp/jenkins662580906834986855.sh + export TEST_ARGS=-tags api + go test -tags api Missing enum 'VIR_DOMAIN_SNAPSHOT_LIST_TOPOLOGICAL' --- FAIL: TestAPICoverage (1.06s) panic: Missing symbols found [recovered] panic: Missing symbols found goroutine 5 [running]: panic(0x5b5860, 0xc4200edfa0) /usr/lib/go-1.7/src/runtime/panic.go:500 +0x1a1 testing.tRunner.func1(0xc420078180) /usr/lib/go-1.7/src/testing/testing.go:579 +0x25d panic(0x5b5860, 0xc4200edfa0) /usr/lib/go-1.7/src/runtime/panic.go:458 +0x243 _<https://ci.centos.org/job/libvirt-go-check/systems=libvirt-debian-8/ws/.Tes…> <https://ci.centos.org/job/libvirt-go-check/systems=libvirt-debian-8/ws/api_…>:501 +0x5ff testing.tRunner(0xc420078180, 0x608fa8) /usr/lib/go-1.7/src/testing/testing.go:610 +0x81 created by testing.(*T).Run /usr/lib/go-1.7/src/testing/testing.go:646 +0x2ec exit status 2 FAIL _<https://ci.centos.org/job/libvirt-go-check/systems=libvirt-debian-8/ws/> 1.211s Build step 'Execute shell' marked build as failure
1 2
0 0
[Libvirt-ci] Build failed in Jenkins: libvirt-go-build » libvirt-fedora-rawhide #311
by ci@centos.org 13 Mar '19

13 Mar '19
See <https://ci.centos.org/job/libvirt-go-build/systems=libvirt-fedora-rawhide/3…> Changes: [berrange] Add VIR_DOMAIN_SNAPSHOT_LIST_TOPOLOGICAL constant ------------------------------------------ Started by upstream project "libvirt-go-build" build number 311 originally caused by: Started by an SCM change [EnvInject] - Loading node environment variables. Building remotely on libvirt-fedora-rawhide (libvirt) in workspace <https://ci.centos.org/job/libvirt-go-build/systems=libvirt-fedora-rawhide/w…> No credentials specified > git rev-parse --is-inside-work-tree # timeout=10 Fetching changes from the remote Git repository > git config remote.origin.url https://github.com/libvirt/libvirt-go.git # timeout=10 Fetching upstream changes from https://github.com/libvirt/libvirt-go.git > git --version # timeout=10 > git fetch --tags --force --progress https://github.com/libvirt/libvirt-go.git +refs/heads/*:refs/remotes/origin/* Checking out Revision 1e45bd527c6739894734760e4c0fd7a5111877d0 (refs/remotes/origin/master) > git config core.sparsecheckout # timeout=10 > git checkout -f 1e45bd527c6739894734760e4c0fd7a5111877d0 Commit message: "Add VIR_DOMAIN_SNAPSHOT_LIST_TOPOLOGICAL constant" > git rev-list --no-walk b3f8da01e8475f12b959d063bf932dc05df37f1c # timeout=10 Cleaning workspace > git rev-parse --verify HEAD # timeout=10 Resetting working tree > git reset --hard # timeout=10 > git clean -fdx # timeout=10 [libvirt-go] $ /bin/sh -xe /tmp/jenkins3136515320624787407.sh + go build -v _<https://ci.centos.org/job/libvirt-go-build/systems=libvirt-fedora-rawhide/w…> # _<https://ci.centos.org/job/libvirt-go-build/systems=libvirt-fedora-rawhide/w…> In file included from ./domain_snapshot.go:32: ./domain_snapshot_compat.h:31:47: error: expected identifier before '(' token 31 | # define VIR_DOMAIN_SNAPSHOT_LIST_TOPOLOGICAL (1 << 10) | ^ Build step 'Execute shell' marked build as failure
1 1
0 0
[Libvirt-ci] Build failed in Jenkins: libvirt-perl-check » libvirt-fedora-rawhide #311
by ci@centos.org 13 Mar '19

13 Mar '19
See <https://ci.centos.org/job/libvirt-perl-check/systems=libvirt-fedora-rawhide…> ------------------------------------------ Started by upstream project "libvirt-perl-check" build number 311 originally caused by: Started by upstream project "libvirt-perl-build" build number 311 originally caused by: Started by upstream project "libvirt-build" build number 377 originally caused by: Started by an SCM change [EnvInject] - Loading node environment variables. Building remotely on libvirt-fedora-rawhide (libvirt) in workspace <https://ci.centos.org/job/libvirt-perl-check/systems=libvirt-fedora-rawhide…> [libvirt-perl] $ /bin/sh -xe /tmp/jenkins239234531839816119.sh + export TEST_MAINTAINER=1 + TEST_MAINTAINER=1 + perl Build test t/005-pod.t ............ ok t/010-pod-coverage.t ... ok t/015-changes.t ........ ok t/020-constants.t ...... ok # Failed test 'VIR_DOMAIN_SNAPSHOT_LIST_TOPOLOGICAL' # at t/030-api-coverage.t line 175. # Looks like you failed 1 test of 1654. t/030-api-coverage.t ... Dubious, test returned 1 (wstat 256, 0x100) Failed 1/1654 subtests t/100-connect.t ........ ok t/200-domains.t ........ ok t/300-networks.t ....... ok t/400-storage-pools.t .. ok t/500-storage-vols.t ... ok t/600-interfaces.t ..... ok t/800-events.t ......... ok Test Summary Report ------------------- t/030-api-coverage.t (Wstat: 256 Tests: 1654 Failed: 1) Failed test: 1038 Non-zero exit status: 1 Files=12, Tests=1908, 61 wallclock secs ( 0.61 usr 0.16 sys + 9.70 cusr 2.30 csys = 12.77 CPU) Result: FAIL Failed 1/12 test programs. 1/1908 subtests failed. Build step 'Execute shell' marked build as failure
1 2
0 0
[Libvirt-ci] Build failed in Jenkins: libvirt-go-build » libvirt-fedora-28 #311
by ci@centos.org 13 Mar '19

13 Mar '19
See <https://ci.centos.org/job/libvirt-go-build/systems=libvirt-fedora-28/311/di…> Changes: [berrange] Add VIR_DOMAIN_SNAPSHOT_LIST_TOPOLOGICAL constant ------------------------------------------ Started by upstream project "libvirt-go-build" build number 311 originally caused by: Started by an SCM change [EnvInject] - Loading node environment variables. Building remotely on libvirt-fedora-28 (libvirt) in workspace <https://ci.centos.org/job/libvirt-go-build/systems=libvirt-fedora-28/ws/> No credentials specified > git rev-parse --is-inside-work-tree # timeout=10 Fetching changes from the remote Git repository > git config remote.origin.url https://github.com/libvirt/libvirt-go.git # timeout=10 Fetching upstream changes from https://github.com/libvirt/libvirt-go.git > git --version # timeout=10 > git fetch --tags --progress https://github.com/libvirt/libvirt-go.git +refs/heads/*:refs/remotes/origin/* Checking out Revision 1e45bd527c6739894734760e4c0fd7a5111877d0 (refs/remotes/origin/master) > git config core.sparsecheckout # timeout=10 > git checkout -f 1e45bd527c6739894734760e4c0fd7a5111877d0 Commit message: "Add VIR_DOMAIN_SNAPSHOT_LIST_TOPOLOGICAL constant" > git rev-list --no-walk b3f8da01e8475f12b959d063bf932dc05df37f1c # timeout=10 Cleaning workspace > git rev-parse --verify HEAD # timeout=10 Resetting working tree > git reset --hard # timeout=10 > git clean -fdx # timeout=10 [libvirt-go] $ /bin/sh -xe /tmp/jenkins2340243606761695676.sh + go build -v _<https://ci.centos.org/job/libvirt-go-build/systems=libvirt-fedora-28/ws/> # _<https://ci.centos.org/job/libvirt-go-build/systems=libvirt-fedora-28/ws/> In file included from ./domain_snapshot.go:32: ./domain_snapshot_compat.h:31:47: error: expected identifier before '(' token # define VIR_DOMAIN_SNAPSHOT_LIST_TOPOLOGICAL (1 << 10) ^ Build step 'Execute shell' marked build as failure
1 1
0 0
[Libvirt-ci] Build failed in Jenkins: libvirt-go-build » libvirt-fedora-29 #311
by ci@centos.org 13 Mar '19

13 Mar '19
See <https://ci.centos.org/job/libvirt-go-build/systems=libvirt-fedora-29/311/di…> Changes: [berrange] Add VIR_DOMAIN_SNAPSHOT_LIST_TOPOLOGICAL constant ------------------------------------------ Started by upstream project "libvirt-go-build" build number 311 originally caused by: Started by an SCM change [EnvInject] - Loading node environment variables. Building remotely on libvirt-fedora-29 (libvirt) in workspace <https://ci.centos.org/job/libvirt-go-build/systems=libvirt-fedora-29/ws/> No credentials specified > git rev-parse --is-inside-work-tree # timeout=10 Fetching changes from the remote Git repository > git config remote.origin.url https://github.com/libvirt/libvirt-go.git # timeout=10 Fetching upstream changes from https://github.com/libvirt/libvirt-go.git > git --version # timeout=10 > git fetch --tags --force --progress https://github.com/libvirt/libvirt-go.git +refs/heads/*:refs/remotes/origin/* Checking out Revision 1e45bd527c6739894734760e4c0fd7a5111877d0 (refs/remotes/origin/master) > git config core.sparsecheckout # timeout=10 > git checkout -f 1e45bd527c6739894734760e4c0fd7a5111877d0 Commit message: "Add VIR_DOMAIN_SNAPSHOT_LIST_TOPOLOGICAL constant" > git rev-list --no-walk b3f8da01e8475f12b959d063bf932dc05df37f1c # timeout=10 Cleaning workspace > git rev-parse --verify HEAD # timeout=10 Resetting working tree > git reset --hard # timeout=10 > git clean -fdx # timeout=10 [libvirt-go] $ /bin/sh -xe /tmp/jenkins7844822506270553475.sh + go build -v _<https://ci.centos.org/job/libvirt-go-build/systems=libvirt-fedora-29/ws/> # _<https://ci.centos.org/job/libvirt-go-build/systems=libvirt-fedora-29/ws/> In file included from ./domain_snapshot.go:32: ./domain_snapshot_compat.h:31:47: error: expected identifier before '(' token # define VIR_DOMAIN_SNAPSHOT_LIST_TOPOLOGICAL (1 << 10) ^ Build step 'Execute shell' marked build as failure
1 1
0 0
[Libvirt-ci] Build failed in Jenkins: libvirt-go-build » libvirt-freebsd-11 #311
by ci@centos.org 13 Mar '19

13 Mar '19
See <https://ci.centos.org/job/libvirt-go-build/systems=libvirt-freebsd-11/311/d…> Changes: [berrange] Add VIR_DOMAIN_SNAPSHOT_LIST_TOPOLOGICAL constant ------------------------------------------ Started by upstream project "libvirt-go-build" build number 311 originally caused by: Started by an SCM change [EnvInject] - Loading node environment variables. Building remotely on libvirt-freebsd-11 (libvirt) in workspace <https://ci.centos.org/job/libvirt-go-build/systems=libvirt-freebsd-11/ws/> No credentials specified > git rev-parse --is-inside-work-tree # timeout=10 Fetching changes from the remote Git repository > git config remote.origin.url https://github.com/libvirt/libvirt-go.git # timeout=10 Fetching upstream changes from https://github.com/libvirt/libvirt-go.git > git --version # timeout=10 > git fetch --tags --force --progress https://github.com/libvirt/libvirt-go.git +refs/heads/*:refs/remotes/origin/* Checking out Revision 1e45bd527c6739894734760e4c0fd7a5111877d0 (refs/remotes/origin/master) > git config core.sparsecheckout # timeout=10 > git checkout -f 1e45bd527c6739894734760e4c0fd7a5111877d0 Commit message: "Add VIR_DOMAIN_SNAPSHOT_LIST_TOPOLOGICAL constant" > git rev-list --no-walk b3f8da01e8475f12b959d063bf932dc05df37f1c # timeout=10 Cleaning workspace > git rev-parse --verify HEAD # timeout=10 Resetting working tree > git reset --hard # timeout=10 > git clean -fdx # timeout=10 [libvirt-go] $ /bin/sh -xe /tmp/jenkins8143177051283636353.sh + go build -v _/usr<https://ci.centos.org/job/libvirt-go-build/systems=libvirt-freebsd-11/ws/> # _/usr<https://ci.centos.org/job/libvirt-go-build/systems=libvirt-freebsd-11/ws/> In file included from ./domain_snapshot.go:33: In file included from ./domain_snapshot_wrapper.h:29: In file included from /home/jenkins/build/libvirt/include/libvirt/libvirt.h:37: /home/jenkins/build/libvirt/include/libvirt/libvirt-domain-snapshot.h:139:5: error: expected identifier VIR_DOMAIN_SNAPSHOT_LIST_TOPOLOGICAL = (1 << 10), /* Ensure parents occur ^ ./domain_snapshot_compat.h:31:47: note: expanded from macro 'VIR_DOMAIN_SNAPSHOT_LIST_TOPOLOGICAL' # define VIR_DOMAIN_SNAPSHOT_LIST_TOPOLOGICAL (1 << 10) ^ 1 error generated. Build step 'Execute shell' marked build as failure
1 1
0 0
[Libvirt-ci] Build failed in Jenkins: libvirt-go-build » libvirt-freebsd-12 #311
by ci@centos.org 13 Mar '19

13 Mar '19
See <https://ci.centos.org/job/libvirt-go-build/systems=libvirt-freebsd-12/311/d…> Changes: [berrange] Add VIR_DOMAIN_SNAPSHOT_LIST_TOPOLOGICAL constant ------------------------------------------ Started by upstream project "libvirt-go-build" build number 311 originally caused by: Started by an SCM change [EnvInject] - Loading node environment variables. Building remotely on libvirt-freebsd-12 (libvirt) in workspace <https://ci.centos.org/job/libvirt-go-build/systems=libvirt-freebsd-12/ws/> No credentials specified > git rev-parse --is-inside-work-tree # timeout=10 Fetching changes from the remote Git repository > git config remote.origin.url https://github.com/libvirt/libvirt-go.git # timeout=10 Fetching upstream changes from https://github.com/libvirt/libvirt-go.git > git --version # timeout=10 > git fetch --tags --force --progress https://github.com/libvirt/libvirt-go.git +refs/heads/*:refs/remotes/origin/* Checking out Revision 1e45bd527c6739894734760e4c0fd7a5111877d0 (refs/remotes/origin/master) > git config core.sparsecheckout # timeout=10 > git checkout -f 1e45bd527c6739894734760e4c0fd7a5111877d0 Commit message: "Add VIR_DOMAIN_SNAPSHOT_LIST_TOPOLOGICAL constant" > git rev-list --no-walk b3f8da01e8475f12b959d063bf932dc05df37f1c # timeout=10 Cleaning workspace > git rev-parse --verify HEAD # timeout=10 Resetting working tree > git reset --hard # timeout=10 > git clean -fdx # timeout=10 [libvirt-go] $ /bin/sh -xe /tmp/jenkins2480327763473321986.sh + go build -v _/usr<https://ci.centos.org/job/libvirt-go-build/systems=libvirt-freebsd-12/ws/> # _/usr<https://ci.centos.org/job/libvirt-go-build/systems=libvirt-freebsd-12/ws/> In file included from ./domain_snapshot.go:33: In file included from ./domain_snapshot_wrapper.h:29: In file included from /home/jenkins/build/libvirt/include/libvirt/libvirt.h:37: /home/jenkins/build/libvirt/include/libvirt/libvirt-domain-snapshot.h:139:5: error: expected identifier VIR_DOMAIN_SNAPSHOT_LIST_TOPOLOGICAL = (1 << 10), /* Ensure parents occur ^ ./domain_snapshot_compat.h:31:47: note: expanded from macro 'VIR_DOMAIN_SNAPSHOT_LIST_TOPOLOGICAL' # define VIR_DOMAIN_SNAPSHOT_LIST_TOPOLOGICAL (1 << 10) ^ 1 error generated. Build step 'Execute shell' marked build as failure
1 1
0 0
[Libvirt-ci] Build failed in Jenkins: libvirt-go-build » libvirt-debian-9 #311
by ci@centos.org 13 Mar '19

13 Mar '19
See <https://ci.centos.org/job/libvirt-go-build/systems=libvirt-debian-9/311/dis…> Changes: [berrange] Add VIR_DOMAIN_SNAPSHOT_LIST_TOPOLOGICAL constant ------------------------------------------ Started by upstream project "libvirt-go-build" build number 311 originally caused by: Started by an SCM change [EnvInject] - Loading node environment variables. Building remotely on libvirt-debian-9 (libvirt) in workspace <https://ci.centos.org/job/libvirt-go-build/systems=libvirt-debian-9/ws/> No credentials specified > git rev-parse --is-inside-work-tree # timeout=10 Fetching changes from the remote Git repository > git config remote.origin.url https://github.com/libvirt/libvirt-go.git # timeout=10 Fetching upstream changes from https://github.com/libvirt/libvirt-go.git > git --version # timeout=10 > git fetch --tags --progress https://github.com/libvirt/libvirt-go.git +refs/heads/*:refs/remotes/origin/* Checking out Revision 1e45bd527c6739894734760e4c0fd7a5111877d0 (refs/remotes/origin/master) > git config core.sparsecheckout # timeout=10 > git checkout -f 1e45bd527c6739894734760e4c0fd7a5111877d0 Commit message: "Add VIR_DOMAIN_SNAPSHOT_LIST_TOPOLOGICAL constant" > git rev-list --no-walk b3f8da01e8475f12b959d063bf932dc05df37f1c # timeout=10 Cleaning workspace > git rev-parse --verify HEAD # timeout=10 Resetting working tree > git reset --hard # timeout=10 > git clean -fdx # timeout=10 [libvirt-go] $ /bin/sh -xe /tmp/jenkins6630836730722044955.sh + go build -v _<https://ci.centos.org/job/libvirt-go-build/systems=libvirt-debian-9/ws/> # _<https://ci.centos.org/job/libvirt-go-build/systems=libvirt-debian-9/ws/> In file included from ./domain_snapshot.go:32:0: ./domain_snapshot_compat.h:31:47: error: expected identifier before '(' token # define VIR_DOMAIN_SNAPSHOT_LIST_TOPOLOGICAL (1 << 10) ^ Build step 'Execute shell' marked build as failure
1 1
0 0
  • ← Newer
  • 1
  • ...
  • 7
  • 8
  • 9
  • 10
  • 11
  • 12
  • 13
  • ...
  • 16
  • Older →

HyperKitty Powered by HyperKitty version 1.3.12.