libvirt List Archives
Sign In Sign Up
Manage this list Sign In Sign Up

Keyboard Shortcuts

Thread View

  • j: Next unread message
  • k: Previous unread message
  • j a: Jump to all threads
  • j l: Jump to MailingList overview

CI

Thread Start a new thread
Download
Threads by month
  • ----- 2025 -----
  • August
  • July
  • June
  • May
  • April
  • March
  • February
  • January
  • ----- 2024 -----
  • December
  • November
  • October
  • September
  • August
  • July
  • June
  • May
  • April
  • March
  • February
  • January
  • ----- 2023 -----
  • December
  • November
  • October
  • September
  • August
  • July
  • June
  • May
  • April
  • March
  • February
  • January
  • ----- 2022 -----
  • December
  • November
  • October
  • September
  • August
  • July
  • June
  • May
  • April
  • March
  • February
  • January
  • ----- 2021 -----
  • December
  • November
  • October
  • September
  • August
  • July
  • June
  • May
  • April
  • March
  • February
  • January
  • ----- 2020 -----
  • December
  • November
  • October
  • September
  • August
  • July
  • June
  • May
  • April
  • March
  • February
  • January
  • ----- 2019 -----
  • December
  • November
  • October
  • September
  • August
  • July
  • June
  • May
  • April
  • March
  • February
  • January
  • ----- 2018 -----
  • December
  • November
  • October
  • September
  • August
  • July
  • June
  • May
  • April
  • March
  • February
  • January
  • ----- 2017 -----
  • December
  • November
  • October
  • September
  • August
  • July
  • June
  • May
  • April
  • March
  • February
  • January
  • ----- 2016 -----
  • December
  • November
  • October
  • September
  • August
  • July
ci@lists.libvirt.org

February 2019

  • 2 participants
  • 132 discussions
[Libvirt-ci] Build failed in Jenkins: libvirt-go-check » libvirt-fedora-29 #218
by ci@centos.org 04 Feb '19

04 Feb '19
See <https://ci.centos.org/job/libvirt-go-check/systems=libvirt-fedora-29/218/di…> ------------------------------------------ Started by upstream project "libvirt-go-check" build number 218 originally caused by: Started by upstream project "libvirt-go-build" build number 222 originally caused by: Started by upstream project "libvirt-build" build number 281 originally caused by: Started by an SCM change Started by an SCM change Started by an SCM change Started by an SCM change Started by an SCM change Started by an SCM change Started by an SCM change Started by an SCM change [EnvInject] - Loading node environment variables. Building remotely on libvirt-fedora-29 (libvirt) in workspace <https://ci.centos.org/job/libvirt-go-check/systems=libvirt-fedora-29/ws/> [libvirt-go] $ /bin/sh -xe /tmp/jenkins4616726597452786890.sh + export 'TEST_ARGS=-tags api' + TEST_ARGS='-tags api' + go test -tags api Missing enum 'VIR_FROM_FIREWALLD' --- FAIL: TestAPICoverage (0.75s) panic: Missing symbols found [recovered] panic: Missing symbols found goroutine 19 [running]: testing.tRunner.func1(0xc0000c2100) /usr/lib/golang/src/testing/testing.go:792 +0x387 panic(0x5cca80, 0x639c80) /usr/lib/golang/src/runtime/panic.go:513 +0x1b9 _<https://ci.centos.org/job/libvirt-go-check/systems=libvirt-fedora-29/ws/.Te…> <https://ci.centos.org/job/libvirt-go-check/systems=libvirt-fedora-29/ws/api…>:501 +0x554 testing.tRunner(0xc0000c2100, 0x61b0e8) /usr/lib/golang/src/testing/testing.go:827 +0xbf created by testing.(*T).Run /usr/lib/golang/src/testing/testing.go:878 +0x35c exit status 2 FAIL _<https://ci.centos.org/job/libvirt-go-check/systems=libvirt-fedora-29/ws/> 1.105s Build step 'Execute shell' marked build as failure
1 3
0 0
[Libvirt-ci] Build failed in Jenkins: libvirt-go-check » libvirt-fedora-28 #218
by ci@centos.org 04 Feb '19

04 Feb '19
See <https://ci.centos.org/job/libvirt-go-check/systems=libvirt-fedora-28/218/di…> ------------------------------------------ Started by upstream project "libvirt-go-check" build number 218 originally caused by: Started by upstream project "libvirt-go-build" build number 222 originally caused by: Started by upstream project "libvirt-build" build number 281 originally caused by: Started by an SCM change Started by an SCM change Started by an SCM change Started by an SCM change Started by an SCM change Started by an SCM change Started by an SCM change Started by an SCM change [EnvInject] - Loading node environment variables. Building remotely on libvirt-fedora-28 (libvirt) in workspace <https://ci.centos.org/job/libvirt-go-check/systems=libvirt-fedora-28/ws/> [libvirt-go] $ /bin/sh -xe /tmp/jenkins6125292312953856296.sh + export 'TEST_ARGS=-tags api' + TEST_ARGS='-tags api' + go test -tags api Missing enum 'VIR_FROM_FIREWALLD' --- FAIL: TestAPICoverage (1.02s) panic: Missing symbols found [recovered] panic: Missing symbols found goroutine 5 [running]: testing.tRunner.func1(0xc4200aa0f0) /usr/lib/golang/src/testing/testing.go:742 +0x29d panic(0x5c3ba0, 0x6277b0) /usr/lib/golang/src/runtime/panic.go:502 +0x229 _<https://ci.centos.org/job/libvirt-go-check/systems=libvirt-fedora-28/ws/.Te…> <https://ci.centos.org/job/libvirt-go-check/systems=libvirt-fedora-28/ws/api…>:501 +0x548 testing.tRunner(0xc4200aa0f0, 0x612868) /usr/lib/golang/src/testing/testing.go:777 +0xd0 created by testing.(*T).Run /usr/lib/golang/src/testing/testing.go:824 +0x2e0 exit status 2 FAIL _<https://ci.centos.org/job/libvirt-go-check/systems=libvirt-fedora-28/ws/> 1.424s Build step 'Execute shell' marked build as failure
1 3
0 0
[Libvirt-ci] Build failed in Jenkins: libvirt-go-check » libvirt-debian-9 #218
by ci@centos.org 04 Feb '19

04 Feb '19
See <https://ci.centos.org/job/libvirt-go-check/systems=libvirt-debian-9/218/dis…> ------------------------------------------ Started by upstream project "libvirt-go-check" build number 218 originally caused by: Started by upstream project "libvirt-go-build" build number 222 originally caused by: Started by upstream project "libvirt-build" build number 281 originally caused by: Started by an SCM change Started by an SCM change Started by an SCM change Started by an SCM change Started by an SCM change Started by an SCM change Started by an SCM change Started by an SCM change [EnvInject] - Loading node environment variables. Building remotely on libvirt-debian-9 (libvirt) in workspace <https://ci.centos.org/job/libvirt-go-check/systems=libvirt-debian-9/ws/> [libvirt-go] $ /bin/sh -xe /tmp/jenkins5540084339614335836.sh + export TEST_ARGS=-tags api + go test -tags api Missing enum 'VIR_FROM_FIREWALLD' --- FAIL: TestAPICoverage (1.25s) panic: Missing symbols found [recovered] panic: Missing symbols found goroutine 19 [running]: panic(0x5557c04fe020, 0xc42021e2c0) /usr/lib/go-1.7/src/runtime/panic.go:500 +0x1a1 testing.tRunner.func1(0xc420086180) /usr/lib/go-1.7/src/testing/testing.go:579 +0x25d panic(0x5557c04fe020, 0xc42021e2c0) /usr/lib/go-1.7/src/runtime/panic.go:458 +0x243 _<https://ci.centos.org/job/libvirt-go-check/systems=libvirt-debian-9/ws/.Tes…> <https://ci.centos.org/job/libvirt-go-check/systems=libvirt-debian-9/ws/api_…>:501 +0x5ff testing.tRunner(0xc420086180, 0x5557c0551768) /usr/lib/go-1.7/src/testing/testing.go:610 +0x81 created by testing.(*T).Run /usr/lib/go-1.7/src/testing/testing.go:646 +0x2ec exit status 2 FAIL _<https://ci.centos.org/job/libvirt-go-check/systems=libvirt-debian-9/ws/> 1.726s Build step 'Execute shell' marked build as failure
1 3
0 0
[Libvirt-ci] Build failed in Jenkins: libvirt-perl-check » libvirt-fedora-rawhide #222
by ci@centos.org 04 Feb '19

04 Feb '19
See <https://ci.centos.org/job/libvirt-perl-check/systems=libvirt-fedora-rawhide…> ------------------------------------------ Started by upstream project "libvirt-perl-check" build number 222 originally caused by: Started by upstream project "libvirt-perl-build" build number 222 originally caused by: Started by upstream project "libvirt-build" build number 281 originally caused by: Started by an SCM change Started by an SCM change Started by an SCM change Started by an SCM change Started by an SCM change Started by an SCM change Started by an SCM change Started by an SCM change [EnvInject] - Loading node environment variables. Building remotely on libvirt-fedora-rawhide (libvirt) in workspace <https://ci.centos.org/job/libvirt-perl-check/systems=libvirt-fedora-rawhide…> [libvirt-perl] $ /bin/sh -xe /tmp/jenkins1712204867024761294.sh + export TEST_MAINTAINER=1 + TEST_MAINTAINER=1 + perl Build test t/005-pod.t ............ ok t/010-pod-coverage.t ... ok t/015-changes.t ........ ok t/020-constants.t ...... ok # Failed test 'VIR_FROM_FIREWALLD' # at t/030-api-coverage.t line 175. # Looks like you failed 1 test of 1648. t/030-api-coverage.t ... Dubious, test returned 1 (wstat 256, 0x100) Failed 1/1648 subtests t/100-connect.t ........ ok t/200-domains.t ........ ok t/300-networks.t ....... ok t/400-storage-pools.t .. ok t/500-storage-vols.t ... ok t/600-interfaces.t ..... ok t/800-events.t ......... ok Test Summary Report ------------------- t/030-api-coverage.t (Wstat: 256 Tests: 1648 Failed: 1) Failed test: 1194 Non-zero exit status: 1 Files=12, Tests=1902, 77 wallclock secs ( 0.48 usr 0.16 sys + 10.36 cusr 2.36 csys = 13.36 CPU) Result: FAIL Failed 1/12 test programs. 1/1902 subtests failed. Build step 'Execute shell' marked build as failure
1 3
0 0
[Libvirt-ci] Build failed in Jenkins: libvirt-go-check » libvirt-freebsd-11 #218
by ci@centos.org 04 Feb '19

04 Feb '19
See <https://ci.centos.org/job/libvirt-go-check/systems=libvirt-freebsd-11/218/d…> ------------------------------------------ Started by upstream project "libvirt-go-check" build number 218 originally caused by: Started by upstream project "libvirt-go-build" build number 222 originally caused by: Started by upstream project "libvirt-build" build number 281 originally caused by: Started by an SCM change Started by an SCM change Started by an SCM change Started by an SCM change Started by an SCM change Started by an SCM change Started by an SCM change Started by an SCM change [EnvInject] - Loading node environment variables. Building remotely on libvirt-freebsd-11 (libvirt) in workspace <https://ci.centos.org/job/libvirt-go-check/systems=libvirt-freebsd-11/ws/> [libvirt-go] $ /bin/sh -xe /tmp/jenkins8534563908391059375.sh + export 'TEST_ARGS=-tags api' + go test -tags api Missing enum 'VIR_FROM_FIREWALLD' --- FAIL: TestAPICoverage (0.45s) panic: Missing symbols found [recovered] panic: Missing symbols found goroutine 20 [running]: testing.tRunner.func1(0xc0000c4100) /usr/local/go/src/testing/testing.go:792 +0x387 panic(0x5cc620, 0x638e40) /usr/local/go/src/runtime/panic.go:513 +0x1b9 _/usr<https://ci.centos.org/job/libvirt-go-check/systems=libvirt-freebsd-11/ws/.T…> /usr<https://ci.centos.org/job/libvirt-go-check/systems=libvirt-freebsd-11/ws/ap…>:501 +0x554 testing.tRunner(0xc0000c4100, 0x61a460) /usr/local/go/src/testing/testing.go:827 +0xbf created by testing.(*T).Run /usr/local/go/src/testing/testing.go:878 +0x35c exit status 2 FAIL _/usr<https://ci.centos.org/job/libvirt-go-check/systems=libvirt-freebsd-11/ws/> 0.643s Build step 'Execute shell' marked build as failure
1 3
0 0
[Libvirt-ci] Build failed in Jenkins: libvirt-go-check » libvirt-freebsd-12 #218
by ci@centos.org 04 Feb '19

04 Feb '19
See <https://ci.centos.org/job/libvirt-go-check/systems=libvirt-freebsd-12/218/d…> ------------------------------------------ Started by upstream project "libvirt-go-check" build number 218 originally caused by: Started by upstream project "libvirt-go-build" build number 222 originally caused by: Started by upstream project "libvirt-build" build number 281 originally caused by: Started by an SCM change Started by an SCM change Started by an SCM change Started by an SCM change Started by an SCM change Started by an SCM change Started by an SCM change Started by an SCM change [EnvInject] - Loading node environment variables. Building remotely on libvirt-freebsd-12 (libvirt) in workspace <https://ci.centos.org/job/libvirt-go-check/systems=libvirt-freebsd-12/ws/> [libvirt-go] $ /bin/sh -xe /tmp/jenkins4699869851912857144.sh + export 'TEST_ARGS=-tags api' + go test -tags api Missing enum 'VIR_FROM_FIREWALLD' --- FAIL: TestAPICoverage (0.24s) panic: Missing symbols found [recovered] panic: Missing symbols found goroutine 19 [running]: testing.tRunner.func1(0xc0000c6100) /usr/local/go/src/testing/testing.go:792 +0x387 panic(0x222880, 0x28f0a0) /usr/local/go/src/runtime/panic.go:513 +0x1b9 _/usr<https://ci.centos.org/job/libvirt-go-check/systems=libvirt-freebsd-12/ws/.T…> /usr<https://ci.centos.org/job/libvirt-go-check/systems=libvirt-freebsd-12/ws/ap…>:501 +0x554 testing.tRunner(0xc0000c6100, 0x2706c0) /usr/local/go/src/testing/testing.go:827 +0xbf created by testing.(*T).Run /usr/local/go/src/testing/testing.go:878 +0x35c exit status 2 FAIL _/usr<https://ci.centos.org/job/libvirt-go-check/systems=libvirt-freebsd-12/ws/> 0.439s Build step 'Execute shell' marked build as failure
1 3
0 0
[Libvirt-ci] Build failed in Jenkins: libvirt-go-check » libvirt-debian-8 #218
by ci@centos.org 04 Feb '19

04 Feb '19
See <https://ci.centos.org/job/libvirt-go-check/systems=libvirt-debian-8/218/dis…> ------------------------------------------ Started by upstream project "libvirt-go-check" build number 218 originally caused by: Started by upstream project "libvirt-go-build" build number 222 originally caused by: Started by upstream project "libvirt-build" build number 281 originally caused by: Started by an SCM change Started by an SCM change Started by an SCM change Started by an SCM change Started by an SCM change Started by an SCM change Started by an SCM change Started by an SCM change [EnvInject] - Loading node environment variables. Building remotely on libvirt-debian-8 (libvirt) in workspace <https://ci.centos.org/job/libvirt-go-check/systems=libvirt-debian-8/ws/> [libvirt-go] $ /bin/sh -xe /tmp/jenkins9062441197390380548.sh + export TEST_ARGS=-tags api + go test -tags api Missing enum 'VIR_FROM_FIREWALLD' --- FAIL: TestAPICoverage (0.36s) panic: Missing symbols found [recovered] panic: Missing symbols found goroutine 5 [running]: panic(0x5b56c0, 0xc4200a8380) /usr/lib/go-1.7/src/runtime/panic.go:500 +0x1a1 testing.tRunner.func1(0xc420078180) /usr/lib/go-1.7/src/testing/testing.go:579 +0x25d panic(0x5b56c0, 0xc4200a8380) /usr/lib/go-1.7/src/runtime/panic.go:458 +0x243 _<https://ci.centos.org/job/libvirt-go-check/systems=libvirt-debian-8/ws/.Tes…> <https://ci.centos.org/job/libvirt-go-check/systems=libvirt-debian-8/ws/api_…>:501 +0x5ff testing.tRunner(0xc420078180, 0x608e08) /usr/lib/go-1.7/src/testing/testing.go:610 +0x81 created by testing.(*T).Run /usr/lib/go-1.7/src/testing/testing.go:646 +0x2ec exit status 2 FAIL _<https://ci.centos.org/job/libvirt-go-check/systems=libvirt-debian-8/ws/> 0.458s Build step 'Execute shell' marked build as failure
1 3
0 0
[Libvirt-ci] Build failed in Jenkins: libvirt-go-xml-check » libvirt-fedora-rawhide #222
by ci@centos.org 04 Feb '19

04 Feb '19
See <https://ci.centos.org/job/libvirt-go-xml-check/systems=libvirt-fedora-rawhi…> ------------------------------------------ Started by upstream project "libvirt-go-xml-check" build number 222 originally caused by: Started by upstream project "libvirt-go-xml-build" build number 222 originally caused by: Started by upstream project "libvirt-build" build number 280 originally caused by: Started by an SCM change Started by an SCM change Started by an SCM change [EnvInject] - Loading node environment variables. Building remotely on libvirt-fedora-rawhide (libvirt) in workspace <https://ci.centos.org/job/libvirt-go-xml-check/systems=libvirt-fedora-rawhi…> [libvirt-go-xml] $ /bin/sh -xe /tmp/jenkins7108680144513233144.sh + export 'TEST_ARGS=-tags xmlroundtrip' + TEST_ARGS='-tags xmlroundtrip' + go test -tags xmlroundtrip --- FAIL: TestRoundTrip (10.55s) xml_test.go:400: testdata/libvirt/tests/networkxml2xmlin/routed-network.xml: /network[0]/bridge[0]/@zone: attribute 'myzone' in expected XML missing in actual XML FAIL exit status 1 FAIL _<https://ci.centos.org/job/libvirt-go-xml-check/systems=libvirt-fedora-rawhi…> 10.735s Build step 'Execute shell' marked build as failure
1 4
0 0
[Libvirt-ci] Build failed in Jenkins: libvirt-perl-check » libvirt-fedora-29 #222
by ci@centos.org 04 Feb '19

04 Feb '19
See <https://ci.centos.org/job/libvirt-perl-check/systems=libvirt-fedora-29/222/…> ------------------------------------------ Started by upstream project "libvirt-perl-check" build number 222 originally caused by: Started by upstream project "libvirt-perl-build" build number 222 originally caused by: Started by upstream project "libvirt-build" build number 281 originally caused by: Started by an SCM change Started by an SCM change Started by an SCM change Started by an SCM change Started by an SCM change Started by an SCM change Started by an SCM change Started by an SCM change [EnvInject] - Loading node environment variables. Building remotely on libvirt-fedora-29 (libvirt) in workspace <https://ci.centos.org/job/libvirt-perl-check/systems=libvirt-fedora-29/ws/> [libvirt-perl] $ /bin/sh -xe /tmp/jenkins7734545476272705671.sh + export TEST_MAINTAINER=1 + TEST_MAINTAINER=1 + perl Build test t/005-pod.t ............ ok t/010-pod-coverage.t ... ok t/015-changes.t ........ ok t/020-constants.t ...... ok # Failed test 'VIR_FROM_FIREWALLD' # at t/030-api-coverage.t line 175. # Looks like you failed 1 test of 1648. t/030-api-coverage.t ... Dubious, test returned 1 (wstat 256, 0x100) Failed 1/1648 subtests t/100-connect.t ........ ok t/200-domains.t ........ ok t/300-networks.t ....... ok t/400-storage-pools.t .. ok t/500-storage-vols.t ... ok t/600-interfaces.t ..... ok t/800-events.t ......... ok Test Summary Report ------------------- t/030-api-coverage.t (Wstat: 256 Tests: 1648 Failed: 1) Failed test: 1194 Non-zero exit status: 1 Files=12, Tests=1902, 24 wallclock secs ( 0.38 usr 0.06 sys + 8.46 cusr 0.61 csys = 9.51 CPU) Result: FAIL Failed 1/12 test programs. 1/1902 subtests failed. Build step 'Execute shell' marked build as failure
1 3
0 0
[Libvirt-ci] Build failed in Jenkins: libvirt-perl-check » libvirt-fedora-28 #222
by ci@centos.org 04 Feb '19

04 Feb '19
See <https://ci.centos.org/job/libvirt-perl-check/systems=libvirt-fedora-28/222/…> ------------------------------------------ Started by upstream project "libvirt-perl-check" build number 222 originally caused by: Started by upstream project "libvirt-perl-build" build number 222 originally caused by: Started by upstream project "libvirt-build" build number 281 originally caused by: Started by an SCM change Started by an SCM change Started by an SCM change Started by an SCM change Started by an SCM change Started by an SCM change Started by an SCM change Started by an SCM change [EnvInject] - Loading node environment variables. Building remotely on libvirt-fedora-28 (libvirt) in workspace <https://ci.centos.org/job/libvirt-perl-check/systems=libvirt-fedora-28/ws/> [libvirt-perl] $ /bin/sh -xe /tmp/jenkins1479427210522168552.sh + export TEST_MAINTAINER=1 + TEST_MAINTAINER=1 + perl Build test t/005-pod.t ............ ok t/010-pod-coverage.t ... ok t/015-changes.t ........ ok t/020-constants.t ...... ok # Failed test 'VIR_FROM_FIREWALLD' # at t/030-api-coverage.t line 175. # Looks like you failed 1 test of 1648. t/030-api-coverage.t ... Dubious, test returned 1 (wstat 256, 0x100) Failed 1/1648 subtests t/100-connect.t ........ ok t/200-domains.t ........ ok t/300-networks.t ....... ok t/400-storage-pools.t .. ok t/500-storage-vols.t ... ok t/600-interfaces.t ..... ok t/800-events.t ......... ok Test Summary Report ------------------- t/030-api-coverage.t (Wstat: 256 Tests: 1648 Failed: 1) Failed test: 1194 Non-zero exit status: 1 Files=12, Tests=1902, 48 wallclock secs ( 0.49 usr 0.06 sys + 8.80 cusr 0.60 csys = 9.95 CPU) Result: FAIL Failed 1/12 test programs. 1/1902 subtests failed. Build step 'Execute shell' marked build as failure
1 3
0 0
  • ← Newer
  • 1
  • ...
  • 8
  • 9
  • 10
  • 11
  • 12
  • 13
  • 14
  • Older →

HyperKitty Powered by HyperKitty version 1.3.12.