libvirt List Archives
Sign In Sign Up
Manage this list Sign In Sign Up

Keyboard Shortcuts

Thread View

  • j: Next unread message
  • k: Previous unread message
  • j a: Jump to all threads
  • j l: Jump to MailingList overview

CI

Thread Start a new thread
Download
Threads by month
  • ----- 2025 -----
  • August
  • July
  • June
  • May
  • April
  • March
  • February
  • January
  • ----- 2024 -----
  • December
  • November
  • October
  • September
  • August
  • July
  • June
  • May
  • April
  • March
  • February
  • January
  • ----- 2023 -----
  • December
  • November
  • October
  • September
  • August
  • July
  • June
  • May
  • April
  • March
  • February
  • January
  • ----- 2022 -----
  • December
  • November
  • October
  • September
  • August
  • July
  • June
  • May
  • April
  • March
  • February
  • January
  • ----- 2021 -----
  • December
  • November
  • October
  • September
  • August
  • July
  • June
  • May
  • April
  • March
  • February
  • January
  • ----- 2020 -----
  • December
  • November
  • October
  • September
  • August
  • July
  • June
  • May
  • April
  • March
  • February
  • January
  • ----- 2019 -----
  • December
  • November
  • October
  • September
  • August
  • July
  • June
  • May
  • April
  • March
  • February
  • January
  • ----- 2018 -----
  • December
  • November
  • October
  • September
  • August
  • July
  • June
  • May
  • April
  • March
  • February
  • January
  • ----- 2017 -----
  • December
  • November
  • October
  • September
  • August
  • July
  • June
  • May
  • April
  • March
  • February
  • January
  • ----- 2016 -----
  • December
  • November
  • October
  • September
  • August
  • July
ci@lists.libvirt.org

February 2019

  • 2 participants
  • 132 discussions
[Libvirt-ci] Build failed in Jenkins: libvirt-go-check » libvirt-fedora-rawhide #231
by ci@centos.org 11 Feb '19

11 Feb '19
See <https://ci.centos.org/job/libvirt-go-check/systems=libvirt-fedora-rawhide/2…> ------------------------------------------ Started by upstream project "libvirt-go-check" build number 231 originally caused by: Started by upstream project "libvirt-go-build" build number 235 originally caused by: Started by upstream project "libvirt-build" build number 295 originally caused by: Started by an SCM change Started by an SCM change Started by an SCM change Started by an SCM change [EnvInject] - Loading node environment variables. Building remotely on libvirt-fedora-rawhide (libvirt) in workspace <https://ci.centos.org/job/libvirt-go-check/systems=libvirt-fedora-rawhide/w…> [libvirt-go] $ /bin/sh -xe /tmp/jenkins1711518160422558723.sh + export 'TEST_ARGS=-tags api' + TEST_ARGS='-tags api' + go test -tags api Missing macro 'VIR_MIGRATE_PARAM_BANDWIDTH_POSTCOPY' Missing enum 'VIR_DOMAIN_MIGRATE_MAX_SPEED_POSTCOPY' --- FAIL: TestAPICoverage (1.54s) panic: Missing symbols found [recovered] panic: Missing symbols found goroutine 5 [running]: testing.tRunner.func1(0xc0000aa100) /usr/lib/golang/src/testing/testing.go:827 +0x388 panic(0x5cd4e0, 0x642bb0) /usr/lib/golang/src/runtime/panic.go:522 +0x1b5 _<https://ci.centos.org/job/libvirt-go-check/systems=libvirt-fedora-rawhide/w…> <https://ci.centos.org/job/libvirt-go-check/systems=libvirt-fedora-rawhide/w…>:501 +0x551 testing.tRunner(0xc0000aa100, 0x61d0d8) /usr/lib/golang/src/testing/testing.go:862 +0xc0 created by testing.(*T).Run /usr/lib/golang/src/testing/testing.go:913 +0x357 exit status 2 FAIL _<https://ci.centos.org/job/libvirt-go-check/systems=libvirt-fedora-rawhide/w…> 2.426s Build step 'Execute shell' marked build as failure
1 6
0 0
[Libvirt-ci] Build failed in Jenkins: libvirt-go-check » libvirt-fedora-29 #231
by ci@centos.org 11 Feb '19

11 Feb '19
See <https://ci.centos.org/job/libvirt-go-check/systems=libvirt-fedora-29/231/di…> ------------------------------------------ Started by upstream project "libvirt-go-check" build number 231 originally caused by: Started by upstream project "libvirt-go-build" build number 235 originally caused by: Started by upstream project "libvirt-build" build number 295 originally caused by: Started by an SCM change Started by an SCM change Started by an SCM change Started by an SCM change [EnvInject] - Loading node environment variables. Building remotely on libvirt-fedora-29 (libvirt) in workspace <https://ci.centos.org/job/libvirt-go-check/systems=libvirt-fedora-29/ws/> [libvirt-go] $ /bin/sh -xe /tmp/jenkins796538148403292592.sh + export 'TEST_ARGS=-tags api' + TEST_ARGS='-tags api' + go test -tags api Missing macro 'VIR_MIGRATE_PARAM_BANDWIDTH_POSTCOPY' Missing enum 'VIR_DOMAIN_MIGRATE_MAX_SPEED_POSTCOPY' --- FAIL: TestAPICoverage (0.90s) panic: Missing symbols found [recovered] panic: Missing symbols found goroutine 5 [running]: testing.tRunner.func1(0xc0000a8100) /usr/lib/golang/src/testing/testing.go:792 +0x387 panic(0x5cca80, 0x639c80) /usr/lib/golang/src/runtime/panic.go:513 +0x1b9 _<https://ci.centos.org/job/libvirt-go-check/systems=libvirt-fedora-29/ws/.Te…> <https://ci.centos.org/job/libvirt-go-check/systems=libvirt-fedora-29/ws/api…>:501 +0x554 testing.tRunner(0xc0000a8100, 0x61b0e8) /usr/lib/golang/src/testing/testing.go:827 +0xbf created by testing.(*T).Run /usr/lib/golang/src/testing/testing.go:878 +0x35c exit status 2 FAIL _<https://ci.centos.org/job/libvirt-go-check/systems=libvirt-fedora-29/ws/> 1.177s Build step 'Execute shell' marked build as failure
1 6
0 0
[Libvirt-ci] Build failed in Jenkins: libvirt-go-check » libvirt-fedora-28 #231
by ci@centos.org 11 Feb '19

11 Feb '19
See <https://ci.centos.org/job/libvirt-go-check/systems=libvirt-fedora-28/231/di…> ------------------------------------------ Started by upstream project "libvirt-go-check" build number 231 originally caused by: Started by upstream project "libvirt-go-build" build number 235 originally caused by: Started by upstream project "libvirt-build" build number 295 originally caused by: Started by an SCM change Started by an SCM change Started by an SCM change Started by an SCM change [EnvInject] - Loading node environment variables. Building remotely on libvirt-fedora-28 (libvirt) in workspace <https://ci.centos.org/job/libvirt-go-check/systems=libvirt-fedora-28/ws/> [libvirt-go] $ /bin/sh -xe /tmp/jenkins3432114378995952349.sh + export 'TEST_ARGS=-tags api' + TEST_ARGS='-tags api' + go test -tags api Missing macro 'VIR_MIGRATE_PARAM_BANDWIDTH_POSTCOPY' Missing enum 'VIR_DOMAIN_MIGRATE_MAX_SPEED_POSTCOPY' --- FAIL: TestAPICoverage (1.22s) panic: Missing symbols found [recovered] panic: Missing symbols found goroutine 19 [running]: testing.tRunner.func1(0xc4200c60f0) /usr/lib/golang/src/testing/testing.go:742 +0x29d panic(0x5c3ba0, 0x6277b0) /usr/lib/golang/src/runtime/panic.go:502 +0x229 _<https://ci.centos.org/job/libvirt-go-check/systems=libvirt-fedora-28/ws/.Te…> <https://ci.centos.org/job/libvirt-go-check/systems=libvirt-fedora-28/ws/api…>:501 +0x548 testing.tRunner(0xc4200c60f0, 0x612868) /usr/lib/golang/src/testing/testing.go:777 +0xd0 created by testing.(*T).Run /usr/lib/golang/src/testing/testing.go:824 +0x2e0 exit status 2 FAIL _<https://ci.centos.org/job/libvirt-go-check/systems=libvirt-fedora-28/ws/> 1.718s Build step 'Execute shell' marked build as failure
1 6
0 0
[Libvirt-ci] Build failed in Jenkins: libvirt-go-check » libvirt-freebsd-12 #231
by ci@centos.org 11 Feb '19

11 Feb '19
See <https://ci.centos.org/job/libvirt-go-check/systems=libvirt-freebsd-12/231/d…> ------------------------------------------ Started by upstream project "libvirt-go-check" build number 231 originally caused by: Started by upstream project "libvirt-go-build" build number 235 originally caused by: Started by upstream project "libvirt-build" build number 295 originally caused by: Started by an SCM change Started by an SCM change Started by an SCM change Started by an SCM change [EnvInject] - Loading node environment variables. Building remotely on libvirt-freebsd-12 (libvirt) in workspace <https://ci.centos.org/job/libvirt-go-check/systems=libvirt-freebsd-12/ws/> [libvirt-go] $ /bin/sh -xe /tmp/jenkins2887661918153379155.sh + export 'TEST_ARGS=-tags api' + go test -tags api Missing macro 'VIR_MIGRATE_PARAM_BANDWIDTH_POSTCOPY' Missing enum 'VIR_DOMAIN_MIGRATE_MAX_SPEED_POSTCOPY' --- FAIL: TestAPICoverage (0.41s) panic: Missing symbols found [recovered] panic: Missing symbols found goroutine 4 [running]: testing.tRunner.func1(0xc0000b0100) /usr/local/go/src/testing/testing.go:792 +0x387 panic(0x222880, 0x28f0a0) /usr/local/go/src/runtime/panic.go:513 +0x1b9 _/usr<https://ci.centos.org/job/libvirt-go-check/systems=libvirt-freebsd-12/ws/.T…> /usr<https://ci.centos.org/job/libvirt-go-check/systems=libvirt-freebsd-12/ws/ap…>:501 +0x554 testing.tRunner(0xc0000b0100, 0x2706c0) /usr/local/go/src/testing/testing.go:827 +0xbf created by testing.(*T).Run /usr/local/go/src/testing/testing.go:878 +0x35c exit status 2 FAIL _/usr<https://ci.centos.org/job/libvirt-go-check/systems=libvirt-freebsd-12/ws/> 0.588s Build step 'Execute shell' marked build as failure
1 6
0 0
[Libvirt-ci] Build failed in Jenkins: libvirt-go-check » libvirt-freebsd-11 #231
by ci@centos.org 11 Feb '19

11 Feb '19
See <https://ci.centos.org/job/libvirt-go-check/systems=libvirt-freebsd-11/231/d…> ------------------------------------------ Started by upstream project "libvirt-go-check" build number 231 originally caused by: Started by upstream project "libvirt-go-build" build number 235 originally caused by: Started by upstream project "libvirt-build" build number 295 originally caused by: Started by an SCM change Started by an SCM change Started by an SCM change Started by an SCM change [EnvInject] - Loading node environment variables. Building remotely on libvirt-freebsd-11 (libvirt) in workspace <https://ci.centos.org/job/libvirt-go-check/systems=libvirt-freebsd-11/ws/> [libvirt-go] $ /bin/sh -xe /tmp/jenkins2469575304751655999.sh + export 'TEST_ARGS=-tags api' + go test -tags api Missing macro 'VIR_MIGRATE_PARAM_BANDWIDTH_POSTCOPY' Missing enum 'VIR_DOMAIN_MIGRATE_MAX_SPEED_POSTCOPY' --- FAIL: TestAPICoverage (0.36s) panic: Missing symbols found [recovered] panic: Missing symbols found goroutine 5 [running]: testing.tRunner.func1(0xc0000aa100) /usr/local/go/src/testing/testing.go:792 +0x387 panic(0x5cc620, 0x638e40) /usr/local/go/src/runtime/panic.go:513 +0x1b9 _/usr<https://ci.centos.org/job/libvirt-go-check/systems=libvirt-freebsd-11/ws/.T…> /usr<https://ci.centos.org/job/libvirt-go-check/systems=libvirt-freebsd-11/ws/ap…>:501 +0x554 testing.tRunner(0xc0000aa100, 0x61a460) /usr/local/go/src/testing/testing.go:827 +0xbf created by testing.(*T).Run /usr/local/go/src/testing/testing.go:878 +0x35c exit status 2 FAIL _/usr<https://ci.centos.org/job/libvirt-go-check/systems=libvirt-freebsd-11/ws/> 0.458s Build step 'Execute shell' marked build as failure
1 6
0 0
[Libvirt-ci] Build failed in Jenkins: libvirt-go-check » libvirt-debian-9 #231
by ci@centos.org 11 Feb '19

11 Feb '19
See <https://ci.centos.org/job/libvirt-go-check/systems=libvirt-debian-9/231/dis…> ------------------------------------------ Started by upstream project "libvirt-go-check" build number 231 originally caused by: Started by upstream project "libvirt-go-build" build number 235 originally caused by: Started by upstream project "libvirt-build" build number 295 originally caused by: Started by an SCM change Started by an SCM change Started by an SCM change Started by an SCM change [EnvInject] - Loading node environment variables. Building remotely on libvirt-debian-9 (libvirt) in workspace <https://ci.centos.org/job/libvirt-go-check/systems=libvirt-debian-9/ws/> [libvirt-go] $ /bin/sh -xe /tmp/jenkins1737678850655501775.sh + export TEST_ARGS=-tags api + go test -tags api Missing macro 'VIR_MIGRATE_PARAM_BANDWIDTH_POSTCOPY' Missing enum 'VIR_DOMAIN_MIGRATE_MAX_SPEED_POSTCOPY' --- FAIL: TestAPICoverage (0.48s) panic: Missing symbols found [recovered] panic: Missing symbols found goroutine 5 [running]: panic(0x55dc65a8e020, 0xc42042e7f0) /usr/lib/go-1.7/src/runtime/panic.go:500 +0x1a1 testing.tRunner.func1(0xc420078180) /usr/lib/go-1.7/src/testing/testing.go:579 +0x25d panic(0x55dc65a8e020, 0xc42042e7f0) /usr/lib/go-1.7/src/runtime/panic.go:458 +0x243 _<https://ci.centos.org/job/libvirt-go-check/systems=libvirt-debian-9/ws/.Tes…> <https://ci.centos.org/job/libvirt-go-check/systems=libvirt-debian-9/ws/api_…>:501 +0x5ff testing.tRunner(0xc420078180, 0x55dc65ae1768) /usr/lib/go-1.7/src/testing/testing.go:610 +0x81 created by testing.(*T).Run /usr/lib/go-1.7/src/testing/testing.go:646 +0x2ec exit status 2 FAIL _<https://ci.centos.org/job/libvirt-go-check/systems=libvirt-debian-9/ws/> 0.621s Build step 'Execute shell' marked build as failure
1 6
0 0
[Libvirt-ci] Build failed in Jenkins: libvirt-go-check » libvirt-debian-8 #231
by ci@centos.org 11 Feb '19

11 Feb '19
See <https://ci.centos.org/job/libvirt-go-check/systems=libvirt-debian-8/231/dis…> ------------------------------------------ Started by upstream project "libvirt-go-check" build number 231 originally caused by: Started by upstream project "libvirt-go-build" build number 235 originally caused by: Started by upstream project "libvirt-build" build number 295 originally caused by: Started by an SCM change Started by an SCM change Started by an SCM change Started by an SCM change [EnvInject] - Loading node environment variables. Building remotely on libvirt-debian-8 (libvirt) in workspace <https://ci.centos.org/job/libvirt-go-check/systems=libvirt-debian-8/ws/> [libvirt-go] $ /bin/sh -xe /tmp/jenkins3034011168081587003.sh + export TEST_ARGS=-tags api + go test -tags api Missing macro 'VIR_MIGRATE_PARAM_BANDWIDTH_POSTCOPY' Missing enum 'VIR_DOMAIN_MIGRATE_MAX_SPEED_POSTCOPY' --- FAIL: TestAPICoverage (0.41s) panic: Missing symbols found [recovered] panic: Missing symbols found goroutine 19 [running]: panic(0x5b56c0, 0xc42042e3d0) /usr/lib/go-1.7/src/runtime/panic.go:500 +0x1a1 testing.tRunner.func1(0xc420086180) /usr/lib/go-1.7/src/testing/testing.go:579 +0x25d panic(0x5b56c0, 0xc42042e3d0) /usr/lib/go-1.7/src/runtime/panic.go:458 +0x243 _<https://ci.centos.org/job/libvirt-go-check/systems=libvirt-debian-8/ws/.Tes…> <https://ci.centos.org/job/libvirt-go-check/systems=libvirt-debian-8/ws/api_…>:501 +0x5ff testing.tRunner(0xc420086180, 0x608e08) /usr/lib/go-1.7/src/testing/testing.go:610 +0x81 created by testing.(*T).Run /usr/lib/go-1.7/src/testing/testing.go:646 +0x2ec exit status 2 FAIL _<https://ci.centos.org/job/libvirt-go-check/systems=libvirt-debian-8/ws/> 0.477s Build step 'Execute shell' marked build as failure
1 6
0 0
[Libvirt-ci] Build failed in Jenkins: libvirt-dbus-check » libvirt-fedora-rawhide #187
by ci@centos.org 08 Feb '19

08 Feb '19
See <https://ci.centos.org/job/libvirt-dbus-check/systems=libvirt-fedora-rawhide…> ------------------------------------------ [...truncated 19.74 KB...] 'path %s' % LOCAL_PATH) if dbus_interface == LOCAL_IFACE: raise DBusException('Methods may not be called on the reserved ' 'interface %s' % LOCAL_IFACE) # no need to validate other args - MethodCallMessage ctor will do get_args_opts = dict(byte_arrays=byte_arrays) if is_py2: get_args_opts['utf8_strings'] = kwargs.get('utf8_strings', False) elif 'utf8_strings' in kwargs: raise TypeError("unexpected keyword argument 'utf8_strings'") message = MethodCallMessage(destination=bus_name, path=object_path, interface=dbus_interface, method=method) # Add the arguments to the function try: message.append(signature=signature, *args) except Exception as e: logging.basicConfig() _logger.error('Unable to set arguments %r according to ' 'signature %r: %s: %s', args, signature, e.__class__, e) raise # make a blocking call reply_message = self.send_message_with_reply_and_block( > message, timeout) E dbus.exceptions.DBusException: org.libvirt.Error: internal error: domain 'test' not running /usr/lib64/python3.7/site-packages/dbus/connection.py:651: DBusException --------------------------- Captured stderr teardown --------------------------- Disconnected from D-Bus. =============================== warnings summary =============================== tests/test_domain.py::TestDomain::()::test_resume source:362: DeprecationWarning: invalid escape sequence \ source:399: DeprecationWarning: invalid escape sequence \ tests/test_domain.py::TestDomain::()::test_shutdown source:362: DeprecationWarning: invalid escape sequence \ source:399: DeprecationWarning: invalid escape sequence \ tests/test_domain.py::TestDomain::()::test_suspend source:362: DeprecationWarning: invalid escape sequence \ source:399: DeprecationWarning: invalid escape sequence \ tests/test_domain.py::TestDomain::()::test_undefine source:362: DeprecationWarning: invalid escape sequence \ source:399: DeprecationWarning: invalid escape sequence \ -- Docs: https://docs.pytest.org/en/latest/warnings.html =========== 4 failed, 5 passed, 8 warnings, 1 error in 8.06 seconds ============ FAIL test_domain.py (exit status: 1) FAIL: test_interface.py ======================= ============================= test session starts ============================== platform linux -- Python 3.7.2, pytest-3.9.3, py-1.7.0, pluggy-0.8.0 rootdir: <https://ci.centos.org/job/libvirt-dbus-check/systems=libvirt-fedora-rawhide…,> inifile: collected 5 items ../../tests/test_interface.py E..EE [100%] ==================================== ERRORS ==================================== ___________ ERROR at setup of TestInterface.test_interface_undefine ____________ self = <test_interface.TestInterface object at 0x7f90a5ef64a8> request = <SubRequest 'libvirt_dbus_setup' for <Function 'test_interface_undefine'>> @pytest.fixture(autouse=True) def libvirt_dbus_setup(self, request): """Start libvirt-dbus for each test function """ os.environ['LIBVIRT_DEBUG'] = '3' self.libvirt_dbus = subprocess.Popen([exe, '--session']) self.bus = dbus.SessionBus() for i in range(10): if self.bus.name_has_owner('org.libvirt'): break time.sleep(0.1) else: > raise TimeoutError('error starting libvirt-dbus') E TimeoutError: error starting libvirt-dbus ../../tests/libvirttest.py:44: TimeoutError ---------------------------- Captured stderr setup ----------------------------- dbus-daemon[21479]: Cannot setup inotify for '/home/jenkins/.local/share/dbus-1/services'; error 'Permission denied' ______ ERROR at setup of TestInterface.test_interface_get_xml_description ______ self = <test_interface.TestInterface object at 0x7f90a5ed5908> @pytest.fixture def interface_create(self): """ Fixture to define dummy interface on the test driver This fixture should be used in the setup of every test manipulating with interfaces. """ path = self.connect.InterfaceDefineXML(xmldata.minimal_interface_xml, 0) obj = self.bus.get_object('org.libvirt', path) interface_obj = dbus.Interface(obj, 'org.libvirt.Interface') > interface_obj.Create(0) ../../tests/libvirttest.py:84: _ _ _ _ _ _ _ _ _ _ _ _ _ _ _ _ _ _ _ _ _ _ _ _ _ _ _ _ _ _ _ _ _ _ _ _ _ _ _ _ /usr/lib64/python3.7/site-packages/dbus/proxies.py:70: in __call__ return self._proxy_method(*args, **keywords) /usr/lib64/python3.7/site-packages/dbus/proxies.py:145: in __call__ **keywords) _ _ _ _ _ _ _ _ _ _ _ _ _ _ _ _ _ _ _ _ _ _ _ _ _ _ _ _ _ _ _ _ _ _ _ _ _ _ _ _ self = <dbus._dbus.SessionBus (session) at 0x7f90a5f0f200> bus_name = dbus.String(':1.1') object_path = dbus.ObjectPath('/org/libvirt/Test/interface/11_3a22_3a33_3a44_3a55_3a66') dbus_interface = 'org.libvirt.Interface', method = 'Create', signature = 'u' args = (0,), timeout = -1.0, byte_arrays = False, kwargs = {} get_args_opts = {'byte_arrays': False} message = <dbus.lowlevel.MethodCallMessage path: /org/libvirt/Test/interface/11_3a22_3a33_3a44_3a55_3a66, iface: org.libvirt.Interface, member: Create dest: :1.1> def call_blocking(self, bus_name, object_path, dbus_interface, method, signature, args, timeout=-1.0, byte_arrays=False, **kwargs): """Call the given method, synchronously. :Since: 0.81.0 """ if object_path == LOCAL_PATH: raise DBusException('Methods may not be called on the reserved ' 'path %s' % LOCAL_PATH) if dbus_interface == LOCAL_IFACE: raise DBusException('Methods may not be called on the reserved ' 'interface %s' % LOCAL_IFACE) # no need to validate other args - MethodCallMessage ctor will do get_args_opts = dict(byte_arrays=byte_arrays) if is_py2: get_args_opts['utf8_strings'] = kwargs.get('utf8_strings', False) elif 'utf8_strings' in kwargs: raise TypeError("unexpected keyword argument 'utf8_strings'") message = MethodCallMessage(destination=bus_name, path=object_path, interface=dbus_interface, method=method) # Add the arguments to the function try: message.append(signature=signature, *args) except Exception as e: logging.basicConfig() _logger.error('Unable to set arguments %r according to ' 'signature %r: %s: %s', args, signature, e.__class__, e) raise # make a blocking call reply_message = self.send_message_with_reply_and_block( > message, timeout) E dbus.exceptions.DBusException: org.libvirt.Error: Requested operation is not valid /usr/lib64/python3.7/site-packages/dbus/connection.py:651: DBusException ________ ERROR at setup of TestInterface.test_interface_properties_type ________ self = <test_interface.TestInterface object at 0x7f90a5ee59e8> @pytest.fixture def interface_create(self): """ Fixture to define dummy interface on the test driver This fixture should be used in the setup of every test manipulating with interfaces. """ path = self.connect.InterfaceDefineXML(xmldata.minimal_interface_xml, 0) obj = self.bus.get_object('org.libvirt', path) interface_obj = dbus.Interface(obj, 'org.libvirt.Interface') > interface_obj.Create(0) ../../tests/libvirttest.py:84: _ _ _ _ _ _ _ _ _ _ _ _ _ _ _ _ _ _ _ _ _ _ _ _ _ _ _ _ _ _ _ _ _ _ _ _ _ _ _ _ /usr/lib64/python3.7/site-packages/dbus/proxies.py:70: in __call__ return self._proxy_method(*args, **keywords) /usr/lib64/python3.7/site-packages/dbus/proxies.py:145: in __call__ **keywords) _ _ _ _ _ _ _ _ _ _ _ _ _ _ _ _ _ _ _ _ _ _ _ _ _ _ _ _ _ _ _ _ _ _ _ _ _ _ _ _ self = <dbus._dbus.SessionBus (session) at 0x7f90a5f0f200> bus_name = dbus.String(':1.1') object_path = dbus.ObjectPath('/org/libvirt/Test/interface/11_3a22_3a33_3a44_3a55_3a66') dbus_interface = 'org.libvirt.Interface', method = 'Create', signature = 'u' args = (0,), timeout = -1.0, byte_arrays = False, kwargs = {} get_args_opts = {'byte_arrays': False} message = <dbus.lowlevel.MethodCallMessage path: /org/libvirt/Test/interface/11_3a22_3a33_3a44_3a55_3a66, iface: org.libvirt.Interface, member: Create dest: :1.1> def call_blocking(self, bus_name, object_path, dbus_interface, method, signature, args, timeout=-1.0, byte_arrays=False, **kwargs): """Call the given method, synchronously. :Since: 0.81.0 """ if object_path == LOCAL_PATH: raise DBusException('Methods may not be called on the reserved ' 'path %s' % LOCAL_PATH) if dbus_interface == LOCAL_IFACE: raise DBusException('Methods may not be called on the reserved ' 'interface %s' % LOCAL_IFACE) # no need to validate other args - MethodCallMessage ctor will do get_args_opts = dict(byte_arrays=byte_arrays) if is_py2: get_args_opts['utf8_strings'] = kwargs.get('utf8_strings', False) elif 'utf8_strings' in kwargs: raise TypeError("unexpected keyword argument 'utf8_strings'") message = MethodCallMessage(destination=bus_name, path=object_path, interface=dbus_interface, method=method) # Add the arguments to the function try: message.append(signature=signature, *args) except Exception as e: logging.basicConfig() _logger.error('Unable to set arguments %r according to ' 'signature %r: %s: %s', args, signature, e.__class__, e) raise # make a blocking call reply_message = self.send_message_with_reply_and_block( > message, timeout) E dbus.exceptions.DBusException: org.libvirt.Error: Requested operation is not valid /usr/lib64/python3.7/site-packages/dbus/connection.py:651: DBusException =============================== warnings summary =============================== tests/test_interface.py::TestInterface::()::test_interface_get_xml_description source:362: DeprecationWarning: invalid escape sequence \ source:399: DeprecationWarning: invalid escape sequence \ tests/test_interface.py::TestInterface::()::test_interface_properties_type source:362: DeprecationWarning: invalid escape sequence \ source:399: DeprecationWarning: invalid escape sequence \ -- Docs: https://docs.pytest.org/en/latest/warnings.html ================ 2 passed, 4 warnings, 3 error in 5.59 seconds ================= FAIL test_interface.py (exit status: 1) + exit 1 Build step 'Execute shell' marked build as failure
1 1
0 0
[Libvirt-ci] Jenkins build is back to normal : libvirt+mingw64-build » libvirt-fedora-rawhide #311
by ci@centos.org 08 Feb '19

08 Feb '19
See <https://ci.centos.org/job/libvirt+mingw64-build/systems=libvirt-fedora-rawh…>
1 0
0 0
[Libvirt-ci] Jenkins build is back to normal : libvirt+mingw32-build » libvirt-fedora-rawhide #311
by ci@centos.org 08 Feb '19

08 Feb '19
See <https://ci.centos.org/job/libvirt+mingw32-build/systems=libvirt-fedora-rawh…>
1 0
0 0
  • ← Newer
  • 1
  • ...
  • 5
  • 6
  • 7
  • 8
  • 9
  • 10
  • 11
  • ...
  • 14
  • Older →

HyperKitty Powered by HyperKitty version 1.3.12.