libvirt List Archives
Sign In Sign Up
Manage this list Sign In Sign Up

Keyboard Shortcuts

Thread View

  • j: Next unread message
  • k: Previous unread message
  • j a: Jump to all threads
  • j l: Jump to MailingList overview

CI

Thread Start a new thread
Download
Threads by month
  • ----- 2026 -----
  • September
  • August
  • July
  • June
  • May
  • April
  • March
  • February
  • January
  • ----- 2025 -----
  • December
  • November
  • October
  • September
  • August
  • July
  • June
  • May
  • April
  • March
  • February
  • January
  • ----- 2024 -----
  • December
  • November
  • October
  • September
  • August
  • July
  • June
  • May
  • April
  • March
  • February
  • January
  • ----- 2023 -----
  • December
  • November
  • October
  • September
  • August
  • July
  • June
  • May
  • April
  • March
  • February
  • January
  • ----- 2022 -----
  • December
  • November
  • October
  • September
  • August
  • July
  • June
  • May
  • April
  • March
  • February
  • January
  • ----- 2021 -----
  • December
  • November
  • October
  • September
  • August
  • July
  • June
  • May
  • April
  • March
  • February
  • January
  • ----- 2020 -----
  • December
  • November
  • October
  • September
  • August
  • July
  • June
  • May
  • April
  • March
  • February
  • January
  • ----- 2019 -----
  • December
  • November
  • October
  • September
  • August
  • July
  • June
  • May
  • April
  • March
  • February
  • January
  • ----- 2018 -----
  • December
  • November
  • October
  • September
  • August
  • July
  • June
  • May
  • April
  • March
  • February
  • January
  • ----- 2017 -----
  • December
  • November
  • October
  • September
  • August
  • July
  • June
  • May
  • April
  • March
  • February
  • January
  • ----- 2016 -----
  • December
  • November
  • October
  • September
  • August
  • July
ci@lists.libvirt.org

  • 2 participants
  • 10212 discussions
[Libvirt-ci] Build failed in Jenkins: libvirt-tck-master-test » libvirt-freebsd-10 #744
by ci@centos.org 02 Nov '17

02 Nov '17
See <https://ci.centos.org/job/libvirt-tck-master-test/systems=libvirt-freebsd-1…> ------------------------------------------ Started by upstream project "libvirt-tck-master-test" build number 744 originally caused by: Started by upstream project "libvirt-tck-master-build" build number 743 originally caused by: Started by upstream project "libvirt-perl-master-build" build number 760 originally caused by: Started by upstream project "libvirt-master-build" build number 964 originally caused by: Started by an SCM change [EnvInject] - Loading node environment variables. Building remotely on libvirt-freebsd-10 (libvirt) in workspace <https://ci.centos.org/job/libvirt-tck-master-test/systems=libvirt-freebsd-1…> [libvirt-tck-master] $ /bin/sh -xe /tmp/jenkins534343289702940654.sh + perl Build test t/005-pod.t ................... ok t/010-pod-coverage.t .......... skipped: Haven't written POD yet t/050-capabilities.t .......... ok # Failed test 'use Sys::Virt::TCK::DomainBuilder;' # at t/070-domain-builder.t line 18. # Tried to use 'Sys::Virt::TCK::DomainBuilder'. # Error: Can't locate Sys/Virt.pm in @INC (you may need to install the Sys::Virt module) (@INC contains: /usr<https://ci.centos.org/job/libvirt-tck-master-test/systems=libvirt-freebsd-1…> /usr<https://ci.centos.org/job/libvirt-tck-master-test/systems=libvirt-freebsd-1…> /usr<https://ci.centos.org/job/libvirt-tck-master-test/systems=libvirt-freebsd-1…> /home/jenkins/build/libvirt/lib/perl5/amd64-freebsd-thread-multi /home/jenkins/build/libvirt/lib/perl5 /home/jenkins/build/libvirt/lib64/perl5 /home/jenkins/build/libvirt/lib/perl5/amd64-freebsd-thread-multi /home/jenkins/build/libvirt/lib/perl5/amd64-freebsd-thread-multi /home/jenkins/build/libvirt/lib/perl5 /home/jenkins/build/libvirt/lib64/perl5 /usr/local/lib/perl5/site_perl/mach/5.24 /usr/local/lib/perl5/site_perl /usr/local/lib/perl5/5.24/mach /usr/local/lib/perl5/5.24 .) at /usr<https://ci.centos.org/job/libvirt-tck-master-test/systems=libvirt-freebsd-1…> line 18. # BEGIN failed--compilation aborted at /usr<https://ci.centos.org/job/libvirt-tck-master-test/systems=libvirt-freebsd-1…> line 18. # Compilation failed in require at t/070-domain-builder.t line 18. # BEGIN failed--compilation aborted at t/070-domain-builder.t line 18. Can't locate object method "new" via package "Sys::Virt" at t/070-domain-builder.t line 53. # Looks like your test exited with 255 just after 1. t/070-domain-builder.t ........ Dubious, test returned 255 (wstat 65280, 0xff00) Failed 2/2 subtests # Failed test 'use Sys::Virt::TCK::NetworkBuilder;' # at t/080-network-builder.t line 18. # Tried to use 'Sys::Virt::TCK::NetworkBuilder'. # Error: Can't locate Sys/Virt.pm in @INC (you may need to install the Sys::Virt module) (@INC contains: /usr<https://ci.centos.org/job/libvirt-tck-master-test/systems=libvirt-freebsd-1…> /usr<https://ci.centos.org/job/libvirt-tck-master-test/systems=libvirt-freebsd-1…> /usr<https://ci.centos.org/job/libvirt-tck-master-test/systems=libvirt-freebsd-1…> /home/jenkins/build/libvirt/lib/perl5/amd64-freebsd-thread-multi /home/jenkins/build/libvirt/lib/perl5 /home/jenkins/build/libvirt/lib64/perl5 /home/jenkins/build/libvirt/lib/perl5/amd64-freebsd-thread-multi /home/jenkins/build/libvirt/lib/perl5/amd64-freebsd-thread-multi /home/jenkins/build/libvirt/lib/perl5 /home/jenkins/build/libvirt/lib64/perl5 /usr/local/lib/perl5/site_perl/mach/5.24 /usr/local/lib/perl5/site_perl /usr/local/lib/perl5/5.24/mach /usr/local/lib/perl5/5.24 .) at /usr<https://ci.centos.org/job/libvirt-tck-master-test/systems=libvirt-freebsd-1…> line 18. # BEGIN failed--compilation aborted at /usr<https://ci.centos.org/job/libvirt-tck-master-test/systems=libvirt-freebsd-1…> line 18. # Compilation failed in require at t/080-network-builder.t line 18. # BEGIN failed--compilation aborted at t/080-network-builder.t line 18. Can't locate object method "new" via package "Sys::Virt::TCK::NetworkBuilder" at t/080-network-builder.t line 37. # Looks like your test exited with 255 just after 1. t/080-network-builder.t ....... Dubious, test returned 255 (wstat 65280, 0xff00) Failed 2/2 subtests # Failed test 'use Sys::Virt::TCK::StoragePoolBuilder;' # at t/090-storage-pool-builder.t line 20. # Tried to use 'Sys::Virt::TCK::StoragePoolBuilder'. # Error: Can't locate Sys/Virt.pm in @INC (you may need to install the Sys::Virt module) (@INC contains: /usr<https://ci.centos.org/job/libvirt-tck-master-test/systems=libvirt-freebsd-1…> /usr<https://ci.centos.org/job/libvirt-tck-master-test/systems=libvirt-freebsd-1…> /usr<https://ci.centos.org/job/libvirt-tck-master-test/systems=libvirt-freebsd-1…> /home/jenkins/build/libvirt/lib/perl5/amd64-freebsd-thread-multi /home/jenkins/build/libvirt/lib/perl5 /home/jenkins/build/libvirt/lib64/perl5 /home/jenkins/build/libvirt/lib/perl5/amd64-freebsd-thread-multi /home/jenkins/build/libvirt/lib/perl5/amd64-freebsd-thread-multi /home/jenkins/build/libvirt/lib/perl5 /home/jenkins/build/libvirt/lib64/perl5 /usr/local/lib/perl5/site_perl/mach/5.24 /usr/local/lib/perl5/site_perl /usr/local/lib/perl5/5.24/mach /usr/local/lib/perl5/5.24 .) at /usr<https://ci.centos.org/job/libvirt-tck-master-test/systems=libvirt-freebsd-1…> line 18. # BEGIN failed--compilation aborted at /usr<https://ci.centos.org/job/libvirt-tck-master-test/systems=libvirt-freebsd-1…> line 18. # Compilation failed in require at t/090-storage-pool-builder.t line 20. # BEGIN failed--compilation aborted at t/090-storage-pool-builder.t line 20. Can't locate object method "new" via package "Sys::Virt::TCK::StoragePoolBuilder" at t/090-storage-pool-builder.t line 37. # Looks like your test exited with 255 just after 1. t/090-storage-pool-builder.t .. Dubious, test returned 255 (wstat 65280, 0xff00) Failed 8/8 subtests # Failed test 'use Sys::Virt::TCK::StorageVolBuilder;' # at t/100-storage-vol-builder.t line 18. # Tried to use 'Sys::Virt::TCK::StorageVolBuilder'. # Error: Can't locate Sys/Virt.pm in @INC (you may need to install the Sys::Virt module) (@INC contains: /usr<https://ci.centos.org/job/libvirt-tck-master-test/systems=libvirt-freebsd-1…> /usr<https://ci.centos.org/job/libvirt-tck-master-test/systems=libvirt-freebsd-1…> /usr<https://ci.centos.org/job/libvirt-tck-master-test/systems=libvirt-freebsd-1…> /home/jenkins/build/libvirt/lib/perl5/amd64-freebsd-thread-multi /home/jenkins/build/libvirt/lib/perl5 /home/jenkins/build/libvirt/lib64/perl5 /home/jenkins/build/libvirt/lib/perl5/amd64-freebsd-thread-multi /home/jenkins/build/libvirt/lib/perl5/amd64-freebsd-thread-multi /home/jenkins/build/libvirt/lib/perl5 /home/jenkins/build/libvirt/lib64/perl5 /usr/local/lib/perl5/site_perl/mach/5.24 /usr/local/lib/perl5/site_perl /usr/local/lib/perl5/5.24/mach /usr/local/lib/perl5/5.24 .) at /usr<https://ci.centos.org/job/libvirt-tck-master-test/systems=libvirt-freebsd-1…> line 18. # BEGIN failed--compilation aborted at /usr<https://ci.centos.org/job/libvirt-tck-master-test/systems=libvirt-freebsd-1…> line 18. # Compilation failed in require at t/100-storage-vol-builder.t line 18. # BEGIN failed--compilation aborted at t/100-storage-vol-builder.t line 18. Can't locate object method "new" via package "Sys::Virt::TCK::StorageVolBuilder" at t/100-storage-vol-builder.t line 37. # Looks like your test exited with 255 just after 1. t/100-storage-vol-builder.t ... Dubious, test returned 255 (wstat 65280, 0xff00) Failed 2/2 subtests Test Summary Report ------------------- t/070-domain-builder.t (Wstat: 65280 Tests: 1 Failed: 1) Failed test: 1 Non-zero exit status: 255 Parse errors: Bad plan. You planned 2 tests but ran 1. t/080-network-builder.t (Wstat: 65280 Tests: 1 Failed: 1) Failed test: 1 Non-zero exit status: 255 Parse errors: Bad plan. You planned 2 tests but ran 1. t/090-storage-pool-builder.t (Wstat: 65280 Tests: 1 Failed: 1) Failed test: 1 Non-zero exit status: 255 Parse errors: Bad plan. You planned 8 tests but ran 1. t/100-storage-vol-builder.t (Wstat: 65280 Tests: 1 Failed: 1) Failed test: 1 Non-zero exit status: 255 Parse errors: Bad plan. You planned 2 tests but ran 1. Files=7, Tests=176, 5 wallclock secs ( 0.20 usr 0.18 sys + 3.84 cusr 0.87 csys = 5.09 CPU) Result: FAIL Failed 4/7 test programs. 4/176 subtests failed. Build step 'Execute shell' marked build as failure
1 1
0 0
[Libvirt-ci] Build failed in Jenkins: libvirt-perl-master-rpm » libvirt-centos-6 #632
by ci@centos.org 01 Nov '17

01 Nov '17
See <https://ci.centos.org/job/libvirt-perl-master-rpm/systems=libvirt-centos-6/…> ------------------------------------------ Started by upstream project "libvirt-perl-master-rpm" build number 632 originally caused by: Started by upstream project "libvirt-perl-master-test" build number 738 originally caused by: Started by upstream project "libvirt-perl-master-build" build number 760 originally caused by: Started by upstream project "libvirt-master-build" build number 964 originally caused by: Started by an SCM change [EnvInject] - Loading node environment variables. Building remotely on libvirt-centos-6 (libvirt) in workspace <https://ci.centos.org/job/libvirt-perl-master-rpm/systems=libvirt-centos-6/…> [libvirt-perl-master] $ /bin/sh -xe /tmp/jenkins1023931654150390102.sh + MAKE=make ++ uname + unamestr=Linux + '[' Linux = FreeBSD ']' + sed -i -e 's/BuildRequires: *perl-Sys-Virt.*//' perl-Sys-Virt.spec + sed -i -e 's/BuildRequires: *libvirt.*devel.*//' perl-Sys-Virt.spec + rm -f '*.tar.gz' + make -j3 dist rm -rf Sys-Virt-3.9.0 /usr/bin/perl "-MExtUtils::Manifest=manicopy,maniread" \ -e "manicopy(maniread(),'Sys-Virt-3.9.0', 'best');" mkdir Sys-Virt-3.9.0 mkdir Sys-Virt-3.9.0/examples mkdir Sys-Virt-3.9.0/lib mkdir Sys-Virt-3.9.0/lib/Sys mkdir Sys-Virt-3.9.0/lib/Sys/Virt mkdir Sys-Virt-3.9.0/t tar cvf Sys-Virt-3.9.0.tar Sys-Virt-3.9.0 Sys-Virt-3.9.0/ Sys-Virt-3.9.0/META.yml Sys-Virt-3.9.0/typemap Sys-Virt-3.9.0/LICENSE Sys-Virt-3.9.0/lib/ Sys-Virt-3.9.0/lib/Sys/ Sys-Virt-3.9.0/lib/Sys/Virt/ Sys-Virt-3.9.0/lib/Sys/Virt/Event.pm Sys-Virt-3.9.0/lib/Sys/Virt/Domain.pm Sys-Virt-3.9.0/lib/Sys/Virt/StorageVol.pm Sys-Virt-3.9.0/lib/Sys/Virt/DomainSnapshot.pm Sys-Virt-3.9.0/lib/Sys/Virt/Secret.pm Sys-Virt-3.9.0/lib/Sys/Virt/StoragePool.pm Sys-Virt-3.9.0/lib/Sys/Virt/Network.pm Sys-Virt-3.9.0/lib/Sys/Virt/Interface.pm Sys-Virt-3.9.0/lib/Sys/Virt/Error.pm Sys-Virt-3.9.0/lib/Sys/Virt/Stream.pm Sys-Virt-3.9.0/lib/Sys/Virt/NWFilter.pm Sys-Virt-3.9.0/lib/Sys/Virt/NodeDevice.pm Sys-Virt-3.9.0/lib/Sys/Virt.pm Sys-Virt-3.9.0/INSTALL Sys-Virt-3.9.0/perl-Sys-Virt.spec Sys-Virt-3.9.0/t/ Sys-Virt-3.9.0/t/015-changes.t Sys-Virt-3.9.0/t/400-storage-pools.t Sys-Virt-3.9.0/t/100-connect.t Sys-Virt-3.9.0/t/500-storage-vols.t Sys-Virt-3.9.0/t/600-interfaces.t Sys-Virt-3.9.0/t/020-constants.t Sys-Virt-3.9.0/t/800-events.t Sys-Virt-3.9.0/t/005-pod.t Sys-Virt-3.9.0/t/010-pod-coverage.t Sys-Virt-3.9.0/t/300-networks.t Sys-Virt-3.9.0/t/030-api-coverage.t Sys-Virt-3.9.0/t/200-domains.t Sys-Virt-3.9.0/README Sys-Virt-3.9.0/MANIFEST Sys-Virt-3.9.0/examples/ Sys-Virt-3.9.0/examples/vol-sparse.pl Sys-Virt-3.9.0/examples/send-key.pl Sys-Virt-3.9.0/examples/dom-fsinfo.pl Sys-Virt-3.9.0/examples/emulator-pin.pl Sys-Virt-3.9.0/examples/dhcp-leases.pl Sys-Virt-3.9.0/examples/vol-upload-nonblock.pl Sys-Virt-3.9.0/examples/vol-upload-all.pl Sys-Virt-3.9.0/examples/iothreadinfo.pl Sys-Virt-3.9.0/examples/node-ksm.pl Sys-Virt-3.9.0/examples/vcpuinfo.pl Sys-Virt-3.9.0/examples/vol-upload.pl Sys-Virt-3.9.0/examples/node-alloc.pl Sys-Virt-3.9.0/examples/dom-stats.pl Sys-Virt-3.9.0/examples/dom-ifinfo.pl Sys-Virt-3.9.0/examples/node-cpu.pl Sys-Virt-3.9.0/examples/node-devlist.pl Sys-Virt-3.9.0/examples/vol-download-nonblock.pl Sys-Virt-3.9.0/examples/auth.pl Sys-Virt-3.9.0/examples/dump-xml.pl Sys-Virt-3.9.0/examples/fs-freeze.pl Sys-Virt-3.9.0/examples/dump-info.pl Sys-Virt-3.9.0/examples/events.pl Sys-Virt-3.9.0/examples/save-restore.pl Sys-Virt-3.9.0/examples/open-console.pl Sys-Virt-3.9.0/examples/hv-stat.pl Sys-Virt-3.9.0/examples/devices.pl Sys-Virt-3.9.0/examples/vol-download-all.pl Sys-Virt-3.9.0/examples/node-info.pl Sys-Virt-3.9.0/examples/dom-migrate.pl Sys-Virt-3.9.0/examples/vol-download.pl Sys-Virt-3.9.0/META.yml.PL Sys-Virt-3.9.0/MANIFEST.SKIP Sys-Virt-3.9.0/Changes Sys-Virt-3.9.0/Virt.xs Sys-Virt-3.9.0/perl-Sys-Virt.spec.PL Sys-Virt-3.9.0/HACKING Sys-Virt-3.9.0/Makefile.PL Sys-Virt-3.9.0/AUTHORS rm -rf Sys-Virt-3.9.0 gzip --best Sys-Virt-3.9.0.tar ++ pwd + rpmbuild --define '_topdir <https://ci.centos.org/job/libvirt-perl-master-rpm/systems=libvirt-centos-6/…'> -ta Sys-Virt-3.9.0.tar.gz error: Failed build dependencies: perl(Test::CPAN::Changes) is needed by perl-Sys-Virt-3.9.0-1.el6.x86_64 Build step 'Execute shell' marked build as failure
1 0
0 0
[Libvirt-ci] Build failed in Jenkins: libosinfo-master-check » libvirt-freebsd-11 #89
by ci@centos.org 01 Nov '17

01 Nov '17
See <https://ci.centos.org/job/libosinfo-master-check/systems=libvirt-freebsd-11…> ------------------------------------------ Started by upstream project "libosinfo-master-check" build number 89 originally caused by: Started by upstream project "libosinfo-master-syntax-check" build number 92 originally caused by: Started by upstream project "libosinfo-master-build" build number 104 originally caused by: Started by upstream project "osinfo-db-master-build" build number 220 originally caused by: Started by upstream project "osinfo-db-tools-master-build" build number 29 originally caused by: Started by user Libvirt [EnvInject] - Loading node environment variables. Building remotely on libvirt-freebsd-11 (libvirt) in workspace <https://ci.centos.org/job/libosinfo-master-check/systems=libvirt-freebsd-11…> [libosinfo-master] $ /bin/sh -xe /tmp/jenkins1140380194648803165.sh + MAKE=make + uname + unamestr=FreeBSD + [ FreeBSD '=' FreeBSD ] + MAKE=gmake + export 'OSINFO_SYSTEM_DIR=/home/jenkins/build/libvirt/share/osinfo' + cd build + gmake -j3 check GEN public-submodule-commit Making check in osinfo gmake[1]: Entering directory '/usr<https://ci.centos.org/job/libosinfo-master-check/systems=libvirt-freebsd-11…'> gmake check-am gmake[2]: Entering directory '/usr<https://ci.centos.org/job/libosinfo-master-check/systems=libvirt-freebsd-11…'> gmake check-local gmake[3]: Entering directory '/usr<https://ci.centos.org/job/libosinfo-master-check/systems=libvirt-freebsd-11…'> GEN check-symsorting gmake[3]: Leaving directory '/usr<https://ci.centos.org/job/libosinfo-master-check/systems=libvirt-freebsd-11…'> gmake[2]: Leaving directory '/usr<https://ci.centos.org/job/libosinfo-master-check/systems=libvirt-freebsd-11…'> gmake[1]: Leaving directory '/usr<https://ci.centos.org/job/libosinfo-master-check/systems=libvirt-freebsd-11…'> Making check in tools gmake[1]: Entering directory '/usr<https://ci.centos.org/job/libosinfo-master-check/systems=libvirt-freebsd-11…'> gmake[1]: Nothing to be done for 'check'. gmake[1]: Leaving directory '/usr<https://ci.centos.org/job/libosinfo-master-check/systems=libvirt-freebsd-11…'> Making check in docs gmake[1]: Entering directory '/usr<https://ci.centos.org/job/libosinfo-master-check/systems=libvirt-freebsd-11…'> Making check in reference gmake[2]: Entering directory '/usr<https://ci.centos.org/job/libosinfo-master-check/systems=libvirt-freebsd-11…'> gmake[2]: Nothing to be done for 'check'. gmake[2]: Leaving directory '/usr<https://ci.centos.org/job/libosinfo-master-check/systems=libvirt-freebsd-11…'> gmake[2]: Entering directory '/usr<https://ci.centos.org/job/libosinfo-master-check/systems=libvirt-freebsd-11…'> gmake[2]: Nothing to be done for 'check-am'. gmake[2]: Leaving directory '/usr<https://ci.centos.org/job/libosinfo-master-check/systems=libvirt-freebsd-11…'> gmake[1]: Leaving directory '/usr<https://ci.centos.org/job/libosinfo-master-check/systems=libvirt-freebsd-11…'> Making check in po gmake[1]: Entering directory '/usr<https://ci.centos.org/job/libosinfo-master-check/systems=libvirt-freebsd-11…'> INTLTOOL_EXTRACT="/usr/local/bin/intltool-extract" XGETTEXT="/usr/local/bin/xgettext" srcdir=../../po /usr/local/bin/intltool-update --gettext-package libosinfo --pot rm -f missing notexist srcdir=../../po /usr/local/bin/intltool-update -m Unescaped left brace in regex is deprecated, passed through in regex; marked by <-- HERE in m/\${ <-- HERE ?PACKAGE_NAME}?/ at /usr/local/bin/intltool-update line 1071, <CONF> line 295. if [ -r missing -o -r notexist ]; then \ exit 1; \ fi gmake[1]: Leaving directory '/usr<https://ci.centos.org/job/libosinfo-master-check/systems=libvirt-freebsd-11…'> Making check in examples gmake[1]: Entering directory '/usr<https://ci.centos.org/job/libosinfo-master-check/systems=libvirt-freebsd-11…'> gmake[1]: Nothing to be done for 'check'. gmake[1]: Leaving directory '/usr<https://ci.centos.org/job/libosinfo-master-check/systems=libvirt-freebsd-11…'> Making check in tests gmake[1]: Entering directory '/usr<https://ci.centos.org/job/libosinfo-master-check/systems=libvirt-freebsd-11…'> gmake test-entity test-device test-list test-devicelist test-filter test-product test-os test-oslist test-productfilter test-platform test-platformlist test-db test-loader test-isodetect test-install-script test-mediauris test-treeuris gmake[2]: Entering directory '/usr<https://ci.centos.org/job/libosinfo-master-check/systems=libvirt-freebsd-11…'> CC test_entity-test-entity.o CC test_device-test-device.o CC test_list-test-list.o CC test_devicelist-test-devicelist.o CC test_filter-test-filter.o CC test_product-test-product.o CC test_os-test-os.o CC test_oslist-test-oslist.o CC test_productfilter-test-productfilter.o CC test_platform-test-platform.o CC test_platformlist-test-platformlist.o CC test_db-test-db.o CC test_loader-test-loader.o CC test_isodetect-test-isodetect.o CC test_install_script-test-install-script.o CC test_mediauris-test-mediauris.o CC test_treeuris-test-treeuris.o CCLD test-entity ../../tests/test-mediauris.c:47:13: error: variable 'response_code' is used uninitialized whenever 'if' condition is false [-Werror,-Wsometimes-uninitialized] if (res != CURLE_OK) { ^~~~~~~~~~~~~~~ ../../tests/test-mediauris.c:51:78: note: uninitialized use occurs here g_test_message("res=%d, %s; code=%ld", res, curl_easy_strerror(res), response_code); ^~~~~~~~~~~~~ ../../tests/test-mediauris.c:47:9: note../../tests/test-treeuris.c: remove the 'if' if its condition is always true if (res != CURLE_OK) { ^~~~~~~~~~~~~~~~~~~~~ ../../tests/test-mediauris.c::47:13: error: variable 'response_code' is used uninitialized whenever 'if' condition is false [-Werror,-Wsometimes-uninitialized] if (res != CURLE_OK) { ^~~~~~~~~~~~~~~ ../../tests/test-treeuris.c:51:78: note: uninitialized use occurs here g_test_message("res=%d, %s; code=%ld", res, curl_easy_strerror(res), response_code); ^~~~~~~~~~~~~ ../../tests/test-treeuris.c:47:9: note: remove the 'if' if its condition is always true if (res != CURLE_OK) { ^~~~~~~~~~~~~~~~~~~~~ ../../tests/test-treeuris.c:37:2737: note: initialize the variable 'response_code' to silence this warning long response_code; ^ = 0 :27: note: initialize the variable 'response_code' to silence this warning long response_code;1 ^ = 0 error1 error generated. generated. gmake[2]: *** [Makefile:1072: test_mediauris-test-mediauris.o] Error 1 gmake[2]: *** Waiting for unfinished jobs.... gmake[2]: *** [Makefile:1170: test_treeuris-test-treeuris.o] Error 1 gmake[2]: Leaving directory '/usr<https://ci.centos.org/job/libosinfo-master-check/systems=libvirt-freebsd-11…'> gmake[1]: *** [Makefile:1547: check-am] Error 2 gmake[1]: Leaving directory '/usr<https://ci.centos.org/job/libosinfo-master-check/systems=libvirt-freebsd-11…'> gmake: *** [Makefile:594: check-recursive] Error 1 + cat tests/test-suite.log cat: tests/test-suite.log: No such file or directory + true + exit 1 Build step 'Execute shell' marked build as failure
1 5
0 0
[Libvirt-ci] Build failed in Jenkins: libosinfo-master-check » libvirt-freebsd-10 #89
by ci@centos.org 01 Nov '17

01 Nov '17
See <https://ci.centos.org/job/libosinfo-master-check/systems=libvirt-freebsd-10…> ------------------------------------------ Started by upstream project "libosinfo-master-check" build number 89 originally caused by: Started by upstream project "libosinfo-master-syntax-check" build number 92 originally caused by: Started by upstream project "libosinfo-master-build" build number 104 originally caused by: Started by upstream project "osinfo-db-master-build" build number 220 originally caused by: Started by upstream project "osinfo-db-tools-master-build" build number 29 originally caused by: Started by user Libvirt [EnvInject] - Loading node environment variables. Building remotely on libvirt-freebsd-10 (libvirt) in workspace <https://ci.centos.org/job/libosinfo-master-check/systems=libvirt-freebsd-10…> [libosinfo-master] $ /bin/sh -xe /tmp/jenkins7683900919790252535.sh + MAKE=make + uname + unamestr=FreeBSD + [ FreeBSD = FreeBSD ] + MAKE=gmake + export OSINFO_SYSTEM_DIR=/home/jenkins/build/libvirt/share/osinfo + cd build + gmake -j3 check GEN public-submodule-commit Making check in osinfo gmake[1]: Entering directory '/usr<https://ci.centos.org/job/libosinfo-master-check/systems=libvirt-freebsd-10…'> gmake check-am gmake[2]: Entering directory '/usr<https://ci.centos.org/job/libosinfo-master-check/systems=libvirt-freebsd-10…'> gmake check-local gmake[3]: Entering directory '/usr<https://ci.centos.org/job/libosinfo-master-check/systems=libvirt-freebsd-10…'> GEN check-symsorting gmake[3]: Leaving directory '/usr<https://ci.centos.org/job/libosinfo-master-check/systems=libvirt-freebsd-10…'> gmake[2]: Leaving directory '/usr<https://ci.centos.org/job/libosinfo-master-check/systems=libvirt-freebsd-10…'> gmake[1]: Leaving directory '/usr<https://ci.centos.org/job/libosinfo-master-check/systems=libvirt-freebsd-10…'> Making check in tools gmake[1]: Entering directory '/usr<https://ci.centos.org/job/libosinfo-master-check/systems=libvirt-freebsd-10…'> gmake[1]: Nothing to be done for 'check'. gmake[1]: Leaving directory '/usr<https://ci.centos.org/job/libosinfo-master-check/systems=libvirt-freebsd-10…'> Making check in docs gmake[1]: Entering directory '/usr<https://ci.centos.org/job/libosinfo-master-check/systems=libvirt-freebsd-10…'> Making check in reference gmake[2]: Entering directory '/usr<https://ci.centos.org/job/libosinfo-master-check/systems=libvirt-freebsd-10…'> gmake[2]: Nothing to be done for 'check'. gmake[2]: Leaving directory '/usr<https://ci.centos.org/job/libosinfo-master-check/systems=libvirt-freebsd-10…'> gmake[2]: Entering directory '/usr<https://ci.centos.org/job/libosinfo-master-check/systems=libvirt-freebsd-10…'> gmake[2]: Nothing to be done for 'check-am'. gmake[2]: Leaving directory '/usr<https://ci.centos.org/job/libosinfo-master-check/systems=libvirt-freebsd-10…'> gmake[1]: Leaving directory '/usr<https://ci.centos.org/job/libosinfo-master-check/systems=libvirt-freebsd-10…'> Making check in po gmake[1]: Entering directory '/usr<https://ci.centos.org/job/libosinfo-master-check/systems=libvirt-freebsd-10…'> INTLTOOL_EXTRACT="/usr/local/bin/intltool-extract" XGETTEXT="/usr/local/bin/xgettext" srcdir=../../po /usr/local/bin/intltool-update --gettext-package libosinfo --pot rm -f missing notexist srcdir=../../po /usr/local/bin/intltool-update -m Unescaped left brace in regex is deprecated, passed through in regex; marked by <-- HERE in m/\${ <-- HERE ?PACKAGE_NAME}?/ at /usr/local/bin/intltool-update line 1071, <CONF> line 295. if [ -r missing -o -r notexist ]; then \ exit 1; \ fi gmake[1]: Leaving directory '/usr<https://ci.centos.org/job/libosinfo-master-check/systems=libvirt-freebsd-10…'> Making check in examples gmake[1]: Entering directory '/usr<https://ci.centos.org/job/libosinfo-master-check/systems=libvirt-freebsd-10…'> gmake[1]: Nothing to be done for 'check'. gmake[1]: Leaving directory '/usr<https://ci.centos.org/job/libosinfo-master-check/systems=libvirt-freebsd-10…'> Making check in tests gmake[1]: Entering directory '/usr<https://ci.centos.org/job/libosinfo-master-check/systems=libvirt-freebsd-10…'> gmake test-entity test-device test-list test-devicelist test-filter test-product test-os test-oslist test-productfilter test-platform test-platformlist test-db test-loader test-isodetect test-install-script test-mediauris test-treeuris gmake[2]: Entering directory '/usr<https://ci.centos.org/job/libosinfo-master-check/systems=libvirt-freebsd-10…'> CC test_entity-test-entity.o CC test_device-test-device.o CC test_list-test-list.o CC test_devicelist-test-devicelist.o CC test_filter-test-filter.o CC test_product-test-product.o CC test_os-test-os.o CC test_oslist-test-oslist.o CC test_productfilter-test-productfilter.o CC test_platform-test-platform.o CC test_platformlist-test-platformlist.o CC test_loader-test-loader.o CC test_db-test-db.o CC test_isodetect-test-isodetect.o CC test_install_script-test-install-script.o CC test_mediauris-test-mediauris.o CC test_treeuris-test-treeuris.o CCLD test-entity ../../tests/test-mediauris.c:47:13: error: variable 'response_code' is used uninitialized whenever 'if' condition is false [-Werror,-Wsometimes-uninitialized] if (res != CURLE_OK) { ^~~~~~~~~~~~~~~ ../../tests/test-mediauris.c:51:78: note: uninitialized use occurs here g_test_message("res=%d, %s; code=%ld", res, curl_easy_strerror(res), response_code); ^~~~~~~~~~~~~ ../../tests/test-mediauris.c:47:9: note: remove the 'if' if its condition is always true if (res != CURLE_OK) { ^~~~~~~~~~~~~~~~~~~~~ ../../tests/test-mediauris.c:37:27: note: initialize the variable 'response_code' to silence this warning long response_code; ^ = 0 1 error generated. gmake[2]: *** [Makefile:1072: test_mediauris-test-mediauris.o] Error 1 gmake[2]: *** Waiting for unfinished jobs.... ../../tests/test-treeuris.c:47:13: error: variable 'response_code' is used uninitialized whenever 'if' condition is false [-Werror,-Wsometimes-uninitialized] if (res != CURLE_OK) { ^~~~~~~~~~~~~~~ ../../tests/test-treeuris.c:51:78: note: uninitialized use occurs here g_test_message("res=%d, %s; code=%ld", res, curl_easy_strerror(res), response_code); ^~~~~~~~~~~~~ ../../tests/test-treeuris.c:47:9: note: remove the 'if' if its condition is always true if (res != CURLE_OK) { ^~~~~~~~~~~~~~~~~~~~~ ../../tests/test-treeuris.c:37:27: note: initialize the variable 'response_code' to silence this warning long response_code; ^ = 0 1 error generated. gmake[2]: *** [Makefile:1170: test_treeuris-test-treeuris.o] Error 1 gmake[2]: Leaving directory '/usr<https://ci.centos.org/job/libosinfo-master-check/systems=libvirt-freebsd-10…'> gmake[1]: *** [Makefile:1547: check-am] Error 2 gmake[1]: Leaving directory '/usr<https://ci.centos.org/job/libosinfo-master-check/systems=libvirt-freebsd-10…'> gmake: *** [Makefile:594: check-recursive] Error 1 + cat tests/test-suite.log cat: tests/test-suite.log: No such file or directory + true + exit 1 Build step 'Execute shell' marked build as failure
1 5
0 0
[Libvirt-ci] Build failed in Jenkins: virt-viewer-master-rpm » libvirt-centos-7 #723
by ci@centos.org 01 Nov '17

01 Nov '17
See <https://ci.centos.org/job/virt-viewer-master-rpm/systems=libvirt-centos-7/7…> ------------------------------------------ Started by upstream project "virt-viewer-master-rpm" build number 723 originally caused by: Started by upstream project "virt-viewer-master-check" build number 722 originally caused by: Started by upstream project "virt-viewer-master-syntax-check" build number 725 originally caused by: Started by upstream project "virt-viewer-master-build" build number 737 originally caused by: Started by upstream project "libvirt-glib-master-build" build number 721 originally caused by: Started by user Libvirt [EnvInject] - Loading node environment variables. Building remotely on libvirt-centos-7 (libvirt) in workspace <https://ci.centos.org/job/virt-viewer-master-rpm/systems=libvirt-centos-7/w…> [virt-viewer-master] $ /bin/sh -xe /tmp/jenkins5265487903364404550.sh + MAKE=make ++ uname + unamestr=Linux + '[' Linux = FreeBSD ']' + cd build + sed -i -e 's/BuildRequires: osinfo-db.*//' virt-viewer.spec + sed -i -e 's/BuildRequires: libvirt.*devel.*//' virt-viewer.spec + sed -i -e 's/BuildRequires: pkgconfig(libvirt.*).*//' virt-viewer.spec + rm -f '*.tar.gz' + make -j3 dist make dist-gzip am__post_remove_distdir='@:' make[1]: Entering directory `<https://ci.centos.org/job/virt-viewer-master-rpm/systems=libvirt-centos-7/w…'> if test -d "virt-viewer-7.0"; then find "virt-viewer-7.0" -type d ! -perm -200 -exec chmod u+w {} ';' && rm -rf "virt-viewer-7.0" || { sleep 5 && rm -rf "virt-viewer-7.0"; }; else :; fi test -d "virt-viewer-7.0" || mkdir "virt-viewer-7.0" (cd icons && make top_distdir=../virt-viewer-7.0 distdir=../virt-viewer-7.0/icons \ am__remove_distdir=: am__skip_length_check=: am__skip_mode_fix=: distdir) make[2]: Entering directory `<https://ci.centos.org/job/virt-viewer-master-rpm/systems=libvirt-centos-7/w…'> (cd 16x16 && make top_distdir=../../virt-viewer-7.0 distdir=../../virt-viewer-7.0/icons/16x16 \ am__remove_distdir=: am__skip_length_check=: am__skip_mode_fix=: distdir) make[3]: Entering directory `<https://ci.centos.org/job/virt-viewer-master-rpm/systems=libvirt-centos-7/w…'> make[3]: Leaving directory `<https://ci.centos.org/job/virt-viewer-master-rpm/systems=libvirt-centos-7/w…'> (cd 22x22 && make top_distdir=../../virt-viewer-7.0 distdir=../../virt-viewer-7.0/icons/22x22 \ am__remove_distdir=: am__skip_length_check=: am__skip_mode_fix=: distdir) make[3]: Entering directory `<https://ci.centos.org/job/virt-viewer-master-rpm/systems=libvirt-centos-7/w…'> make[3]: Leaving directory `<https://ci.centos.org/job/virt-viewer-master-rpm/systems=libvirt-centos-7/w…'> (cd 24x24 && make top_distdir=../../virt-viewer-7.0 distdir=../../virt-viewer-7.0/icons/24x24 \ am__remove_distdir=: am__skip_length_check=: am__skip_mode_fix=: distdir) make[3]: Entering directory `<https://ci.centos.org/job/virt-viewer-master-rpm/systems=libvirt-centos-7/w…'> make[3]: Leaving directory `<https://ci.centos.org/job/virt-viewer-master-rpm/systems=libvirt-centos-7/w…'> (cd 32x32 && make top_distdir=../../virt-viewer-7.0 distdir=../../virt-viewer-7.0/icons/32x32 \ am__remove_distdir=: am__skip_length_check=: am__skip_mode_fix=: distdir) make[3]: Entering directory `<https://ci.centos.org/job/virt-viewer-master-rpm/systems=libvirt-centos-7/w…'> make[3]: Leaving directory `<https://ci.centos.org/job/virt-viewer-master-rpm/systems=libvirt-centos-7/w…'> (cd 48x48 && make top_distdir=../../virt-viewer-7.0 distdir=../../virt-viewer-7.0/icons/48x48 \ am__remove_distdir=: am__skip_length_check=: am__skip_mode_fix=: distdir) make[3]: Entering directory `<https://ci.centos.org/job/virt-viewer-master-rpm/systems=libvirt-centos-7/w…'> make[3]: Leaving directory `<https://ci.centos.org/job/virt-viewer-master-rpm/systems=libvirt-centos-7/w…'> (cd 256x256 && make top_distdir=../../virt-viewer-7.0 distdir=../../virt-viewer-7.0/icons/256x256 \ am__remove_distdir=: am__skip_length_check=: am__skip_mode_fix=: distdir) make[3]: Entering directory `<https://ci.centos.org/job/virt-viewer-master-rpm/systems=libvirt-centos-7/w…'> make[3]: Leaving directory `<https://ci.centos.org/job/virt-viewer-master-rpm/systems=libvirt-centos-7/w…'> make[2]: Leaving directory `<https://ci.centos.org/job/virt-viewer-master-rpm/systems=libvirt-centos-7/w…'> (cd src && make top_distdir=../virt-viewer-7.0 distdir=../virt-viewer-7.0/src \ am__remove_distdir=: am__skip_length_check=: am__skip_mode_fix=: distdir) make[2]: Entering directory `<https://ci.centos.org/job/virt-viewer-master-rpm/systems=libvirt-centos-7/w…'> make[2]: Leaving directory `<https://ci.centos.org/job/virt-viewer-master-rpm/systems=libvirt-centos-7/w…'> (cd man && make top_distdir=../virt-viewer-7.0 distdir=../virt-viewer-7.0/man \ am__remove_distdir=: am__skip_length_check=: am__skip_mode_fix=: distdir) make[2]: Entering directory `<https://ci.centos.org/job/virt-viewer-master-rpm/systems=libvirt-centos-7/w…'> make[2]: Leaving directory `<https://ci.centos.org/job/virt-viewer-master-rpm/systems=libvirt-centos-7/w…'> (cd po && make top_distdir=../virt-viewer-7.0 distdir=../virt-viewer-7.0/po \ am__remove_distdir=: am__skip_length_check=: am__skip_mode_fix=: distdir) make[2]: Entering directory `<https://ci.centos.org/job/virt-viewer-master-rpm/systems=libvirt-centos-7/w…'> dists="Makefile.in.in POTFILES.in af.po am.po anp.po ar.po as.po ast.po bal.po be.po bg.po bn_IN.po bn.po bo.po br.po brx.po bs.po ca.po cs.po cy.po da.po de_CH.po de.po el.po en_GB.po eo.po es.po et.po eu.po fa.po fi.po fr.po gl.po gu.po he.po hi.po hr.po hu.po ia.po id.po ilo.po is.po it.po ja.po ka.po kk.po km.po kn.po ko.po kw_GB.po kw(a)kkcor.po kw.po kw(a)uccor.po ky.po lt.po lv.po mai.po mk.po ml.po mn.po mr.po ms.po nb.po nds.po ne.po nl.po nn.po nso.po or.po pa.po pl.po pt_BR.po pt.po ro.po ru.po si.po sk.po sl.po sq.po sr(a)latin.po sr.po sv.po ta.po te.po tg.po th.po tr.po tw.po uk.po ur.po vi.po wba.po yo.po zh_CN.po zh_HK.po zh_TW.po zu.po "; \ extra_dists="ChangeLog POTFILES.skip Makevars LINGUAS"; \ for file in $extra_dists; do \ test -f ../../po/$file && dists="$dists ../../po/$file"; \ done; \ for file in $dists; do \ test -f $file || file="../../po/$file"; \ ln $file ../virt-viewer-7.0/po 2> /dev/null \ || cp -p $file ../virt-viewer-7.0/po; \ done make[2]: Leaving directory `<https://ci.centos.org/job/virt-viewer-master-rpm/systems=libvirt-centos-7/w…'> (cd data && make top_distdir=../virt-viewer-7.0 distdir=../virt-viewer-7.0/data \ am__remove_distdir=: am__skip_length_check=: am__skip_mode_fix=: distdir) make[2]: Entering directory `<https://ci.centos.org/job/virt-viewer-master-rpm/systems=libvirt-centos-7/w…'> make[2]: Leaving directory `<https://ci.centos.org/job/virt-viewer-master-rpm/systems=libvirt-centos-7/w…'> (cd tests && make top_distdir=../virt-viewer-7.0 distdir=../virt-viewer-7.0/tests \ am__remove_distdir=: am__skip_length_check=: am__skip_mode_fix=: distdir) make[2]: Entering directory `<https://ci.centos.org/job/virt-viewer-master-rpm/systems=libvirt-centos-7/w…'> make[2]: Leaving directory `<https://ci.centos.org/job/virt-viewer-master-rpm/systems=libvirt-centos-7/w…'> make \ top_distdir="virt-viewer-7.0" distdir="virt-viewer-7.0" \ dist-hook make[2]: Entering directory `<https://ci.centos.org/job/virt-viewer-master-rpm/systems=libvirt-centos-7/w…'> if test -d .git || test -d ../.git; then \ ../build-aux/gitlog-to-changelog \ > virt-viewer-7.0/cl-t; \ rm -f virt-viewer-7.0/ChangeLog; \ mv virt-viewer-7.0/cl-t virt-viewer-7.0/ChangeLog; \ fi GEN gen-AUTHORS make[2]: Leaving directory `<https://ci.centos.org/job/virt-viewer-master-rpm/systems=libvirt-centos-7/w…'> test -n "" \ || find "virt-viewer-7.0" -type d ! -perm -755 \ -exec chmod u+rwx,go+rx {} \; -o \ ! -type d ! -perm -444 -links 1 -exec chmod a+r {} \; -o \ ! -type d ! -perm -400 -exec chmod a+r {} \; -o \ ! -type d ! -perm -444 -exec /bin/sh <https://ci.centos.org/job/virt-viewer-master-rpm/systems=libvirt-centos-7/w…> -c -m a+r {} {} \; \ || chmod -R a+r "virt-viewer-7.0" tardir=virt-viewer-7.0 && ${TAR-tar} chof - "$tardir" | GZIP='--no-name --best --rsyncable' gzip -c >virt-viewer-7.0.tar.gz make[1]: Leaving directory `<https://ci.centos.org/job/virt-viewer-master-rpm/systems=libvirt-centos-7/w…'> if test -d "virt-viewer-7.0"; then find "virt-viewer-7.0" -type d ! -perm -200 -exec chmod u+w {} ';' && rm -rf "virt-viewer-7.0" || { sleep 5 && rm -rf "virt-viewer-7.0"; }; else :; fi ++ pwd + rpmbuild --define '_topdir <https://ci.centos.org/job/virt-viewer-master-rpm/systems=libvirt-centos-7/w…'> -ta virt-viewer-7.0.tar.gz error: Failed build dependencies: pkgconfig(govirt-1.0) >= 0.3.2 is needed by virt-viewer-7.0-1.el7.centos.x86_64 Build step 'Execute shell' marked build as failure
1 1
0 0
[Libvirt-ci] Build failed in Jenkins: virt-manager-master-check » libvirt-freebsd-10 #916
by ci@centos.org 01 Nov '17

01 Nov '17
See <https://ci.centos.org/job/virt-manager-master-check/systems=libvirt-freebsd…> ------------------------------------------ Started by upstream project "virt-manager-master-check" build number 916 originally caused by: Started by upstream project "virt-manager-master-build" build number 926 originally caused by: Started by user Libvirt [EnvInject] - Loading node environment variables. Building remotely on libvirt-freebsd-10 (libvirt) in workspace <https://ci.centos.org/job/virt-manager-master-check/systems=libvirt-freebsd…> [virt-manager-master] $ /bin/sh -xe /tmp/jenkins3370598942131114366.sh + python2 setup.py test running test Traceback (most recent call last): File "setup.py", line 686, in <module> distclass=VMMDistribution, File "/usr/local/lib/python2.7/distutils/core.py", line 151, in setup dist.run_commands() File "/usr/local/lib/python2.7/distutils/dist.py", line 953, in run_commands self.run_command(cmd) File "/usr/local/lib/python2.7/distutils/dist.py", line 972, in run_command cmd_obj.run() File "setup.py", line 518, in run TestBaseCommand.run(self) File "setup.py", line 437, in run import tests as testsmodule File "/usr<https://ci.centos.org/job/virt-manager-master-check/systems=libvirt-freebsd…",> line 33, in <module> from tests import utils File "/usr<https://ci.centos.org/job/virt-manager-master-check/systems=libvirt-freebsd…",> line 21, in <module> import virtinst File "/usr<https://ci.centos.org/job/virt-manager-master-check/systems=libvirt-freebsd…",> line 39, in <module> from virtinst import util File "/usr<https://ci.centos.org/job/virt-manager-master-check/systems=libvirt-freebsd…",> line 27, in <module> import libvirt ImportError: No module named libvirt Build step 'Execute shell' marked build as failure
1 4
0 0
[Libvirt-ci] Build failed in Jenkins: virt-manager-master-check » libvirt-freebsd-11 #916
by ci@centos.org 01 Nov '17

01 Nov '17
See <https://ci.centos.org/job/virt-manager-master-check/systems=libvirt-freebsd…> ------------------------------------------ Started by upstream project "virt-manager-master-check" build number 916 originally caused by: Started by upstream project "virt-manager-master-build" build number 926 originally caused by: Started by user Libvirt [EnvInject] - Loading node environment variables. Building remotely on libvirt-freebsd-11 (libvirt) in workspace <https://ci.centos.org/job/virt-manager-master-check/systems=libvirt-freebsd…> [virt-manager-master] $ /bin/sh -xe /tmp/jenkins688376423386471679.sh + python2 setup.py test running test Traceback (most recent call last): File "setup.py", line 686, in <module> distclass=VMMDistribution, File "/usr/local/lib/python2.7/distutils/core.py", line 151, in setup dist.run_commands() File "/usr/local/lib/python2.7/distutils/dist.py", line 953, in run_commands self.run_command(cmd) File "/usr/local/lib/python2.7/distutils/dist.py", line 972, in run_command cmd_obj.run() File "setup.py", line 518, in run TestBaseCommand.run(self) File "setup.py", line 437, in run import tests as testsmodule File "/usr<https://ci.centos.org/job/virt-manager-master-check/systems=libvirt-freebsd…",> line 33, in <module> from tests import utils File "/usr<https://ci.centos.org/job/virt-manager-master-check/systems=libvirt-freebsd…",> line 21, in <module> import virtinst File "/usr<https://ci.centos.org/job/virt-manager-master-check/systems=libvirt-freebsd…",> line 39, in <module> from virtinst import util File "/usr<https://ci.centos.org/job/virt-manager-master-check/systems=libvirt-freebsd…",> line 27, in <module> import libvirt ImportError: No module named libvirt Build step 'Execute shell' marked build as failure
1 4
0 0
[Libvirt-ci] Build failed in Jenkins: virt-manager-master-check » libvirt-debian-9 #916
by ci@centos.org 01 Nov '17

01 Nov '17
See <https://ci.centos.org/job/virt-manager-master-check/systems=libvirt-debian-…> ------------------------------------------ Started by upstream project "virt-manager-master-check" build number 916 originally caused by: Started by upstream project "virt-manager-master-build" build number 926 originally caused by: Started by user Libvirt [EnvInject] - Loading node environment variables. Building remotely on libvirt-debian-9 (libvirt) in workspace <https://ci.centos.org/job/virt-manager-master-check/systems=libvirt-debian-…> [virt-manager-master] $ /bin/sh -xe /tmp/jenkins8497233641601290400.sh + python2 setup.py test running test Traceback (most recent call last): File "setup.py", line 686, in <module> distclass=VMMDistribution, File "/usr/lib/python2.7/distutils/core.py", line 151, in setup dist.run_commands() File "/usr/lib/python2.7/distutils/dist.py", line 953, in run_commands self.run_command(cmd) File "/usr/lib/python2.7/distutils/dist.py", line 972, in run_command cmd_obj.run() File "setup.py", line 518, in run TestBaseCommand.run(self) File "setup.py", line 437, in run import tests as testsmodule File "<https://ci.centos.org/job/virt-manager-master-check/systems=libvirt-debian-…",> line 33, in <module> from tests import utils File "<https://ci.centos.org/job/virt-manager-master-check/systems=libvirt-debian-…",> line 21, in <module> import virtinst File "<https://ci.centos.org/job/virt-manager-master-check/systems=libvirt-debian-…",> line 39, in <module> from virtinst import util File "<https://ci.centos.org/job/virt-manager-master-check/systems=libvirt-debian-…",> line 27, in <module> import libvirt ImportError: No module named libvirt Build step 'Execute shell' marked build as failure
1 4
0 0
[Libvirt-ci] Build failed in Jenkins: virt-manager-master-check » libvirt-debian-8 #916
by ci@centos.org 01 Nov '17

01 Nov '17
See <https://ci.centos.org/job/virt-manager-master-check/systems=libvirt-debian-…> ------------------------------------------ Started by upstream project "virt-manager-master-check" build number 916 originally caused by: Started by upstream project "virt-manager-master-build" build number 926 originally caused by: Started by user Libvirt [EnvInject] - Loading node environment variables. Building remotely on libvirt-debian-8 (libvirt) in workspace <https://ci.centos.org/job/virt-manager-master-check/systems=libvirt-debian-…> [virt-manager-master] $ /bin/sh -xe /tmp/jenkins6806715026121281338.sh + python2 setup.py test running test Traceback (most recent call last): File "setup.py", line 686, in <module> distclass=VMMDistribution, File "/usr/lib/python2.7/distutils/core.py", line 151, in setup dist.run_commands() File "/usr/lib/python2.7/distutils/dist.py", line 953, in run_commands self.run_command(cmd) File "/usr/lib/python2.7/distutils/dist.py", line 972, in run_command cmd_obj.run() File "setup.py", line 518, in run TestBaseCommand.run(self) File "setup.py", line 437, in run import tests as testsmodule File "<https://ci.centos.org/job/virt-manager-master-check/systems=libvirt-debian-…",> line 33, in <module> from tests import utils File "<https://ci.centos.org/job/virt-manager-master-check/systems=libvirt-debian-…",> line 21, in <module> import virtinst File "<https://ci.centos.org/job/virt-manager-master-check/systems=libvirt-debian-…",> line 39, in <module> from virtinst import util File "<https://ci.centos.org/job/virt-manager-master-check/systems=libvirt-debian-…",> line 27, in <module> import libvirt ImportError: No module named libvirt Build step 'Execute shell' marked build as failure
1 4
0 0
[Libvirt-ci] Build failed in Jenkins: virt-manager-master-build » libvirt-freebsd-10 #924
by ci@centos.org 01 Nov '17

01 Nov '17
See <https://ci.centos.org/job/virt-manager-master-build/systems=libvirt-freebsd…> ------------------------------------------ Started by upstream project "virt-manager-master-build" build number 924 originally caused by: Started by upstream project "libosinfo-master-build" build number 105 originally caused by: Started by upstream project "osinfo-db-master-build" build number 221 originally caused by: Started by upstream project "osinfo-db-tools-master-build" build number 30 originally caused by: Started by user Libvirt [EnvInject] - Loading node environment variables. Building remotely on libvirt-freebsd-10 (libvirt) in workspace <https://ci.centos.org/job/virt-manager-master-build/systems=libvirt-freebsd…> > git rev-parse --is-inside-work-tree # timeout=10 Fetching changes from the remote Git repository > git config remote.origin.url git://n64.pufty.ci.centos.org/virt-manager.git # timeout=10 Fetching upstream changes from git://n64.pufty.ci.centos.org/virt-manager.git > git --version # timeout=10 > git fetch --tags --progress git://n64.pufty.ci.centos.org/virt-manager.git +refs/heads/*:refs/remotes/origin/* Checking out Revision 4e93ad09cbf2dc79225f39102e485e5039c84cfc (refs/remotes/origin/master) Commit message: "news: Fix typo" > git config core.sparsecheckout # timeout=10 > git checkout -f 4e93ad09cbf2dc79225f39102e485e5039c84cfc > git rev-list 4e93ad09cbf2dc79225f39102e485e5039c84cfc # timeout=10 Cleaning workspace > git rev-parse --verify HEAD # timeout=10 Resetting working tree > git reset --hard # timeout=10 > git clean -fdx # timeout=10 [virt-manager-master] $ /bin/sh -xe /tmp/jenkins3645255218415646194.sh + python setup.py configure --prefix=/home/jenkins/build/libvirt /tmp/jenkins3645255218415646194.sh: python: not found Build step 'Execute shell' marked build as failure
1 2
0 0
  • ← Newer
  • 1
  • ...
  • 974
  • 975
  • 976
  • 977
  • 978
  • 979
  • 980
  • ...
  • 1022
  • Older →

HyperKitty Powered by HyperKitty version 1.3.12.