libvirt List Archives
Sign In Sign Up
Manage this list Sign In Sign Up

Keyboard Shortcuts

Thread View

  • j: Next unread message
  • k: Previous unread message
  • j a: Jump to all threads
  • j l: Jump to MailingList overview

CI

Thread Start a new thread
Download
Threads by month
  • ----- 2026 -----
  • September
  • August
  • July
  • June
  • May
  • April
  • March
  • February
  • January
  • ----- 2025 -----
  • December
  • November
  • October
  • September
  • August
  • July
  • June
  • May
  • April
  • March
  • February
  • January
  • ----- 2024 -----
  • December
  • November
  • October
  • September
  • August
  • July
  • June
  • May
  • April
  • March
  • February
  • January
  • ----- 2023 -----
  • December
  • November
  • October
  • September
  • August
  • July
  • June
  • May
  • April
  • March
  • February
  • January
  • ----- 2022 -----
  • December
  • November
  • October
  • September
  • August
  • July
  • June
  • May
  • April
  • March
  • February
  • January
  • ----- 2021 -----
  • December
  • November
  • October
  • September
  • August
  • July
  • June
  • May
  • April
  • March
  • February
  • January
  • ----- 2020 -----
  • December
  • November
  • October
  • September
  • August
  • July
  • June
  • May
  • April
  • March
  • February
  • January
  • ----- 2019 -----
  • December
  • November
  • October
  • September
  • August
  • July
  • June
  • May
  • April
  • March
  • February
  • January
  • ----- 2018 -----
  • December
  • November
  • October
  • September
  • August
  • July
  • June
  • May
  • April
  • March
  • February
  • January
  • ----- 2017 -----
  • December
  • November
  • October
  • September
  • August
  • July
  • June
  • May
  • April
  • March
  • February
  • January
  • ----- 2016 -----
  • December
  • November
  • October
  • September
  • August
  • July
ci@lists.libvirt.org

  • 2 participants
  • 10212 discussions
[Libvirt-ci] Build failed in Jenkins: libvirt-master-build » libvirt-centos-6 #1146
by ci@centos.org 31 Jan '18

31 Jan '18
See <https://ci.centos.org/job/libvirt-master-build/systems=libvirt-centos-6/114…> Changes: [berrange] admin: move admins server impl/dispatch into src/admin directory [berrange] libvirtd: rename virNetServerClient callback impls to match type names [berrange] admin: add support for post-exec restart callbacks [berrange] util: add virGetUNIXSocketPath helper [berrange] rpc: clarify "void *" values passed to client callbacks [berrange] rpc: pass virNetServer to post-exec restart callback in typesafe manner [berrange] rpc: annotate various parameters as being required to be non-NULL [berrange] rpc: add method for checking if a named server exists [berrange] rpc: refactor virNetServer setup for post-exec restarts [berrange] logd: add support for admin protocol in virtlogd [berrange] lockd: add support for admin protocol in virtlockd [berrange] Check for tabs in augeas files [mprivozn] virUSBDeviceNew: Construct vroot path properly ------------------------------------------ [...truncated 130.30 KB...] GEN string.h GEN strings.h GEN sys/ioctl.h GEN sys/select.h GEN sys/socket.h GEN sys/stat.h GEN sys/time.h GEN sys/types.h GEN sys/uio.h GEN termios.h GEN sys/wait.h GEN sys/utsname.h GEN time.h GEN unistd.h GEN wchar.h GEN wctype.h make all-am make[3]: Entering directory `<https://ci.centos.org/job/libvirt-master-build/systems=libvirt-centos-6/ws/…'> CC allocator.lo CC base64.lo CC areadlink.lo CC binary-io.lo CC bitrotate.lo CC c-ctype.lo CC c-strcasecmp.lo CC c-strncasecmp.lo CC c-strcasestr.lo CC careadlinkat.lo CC cloexec.lo CC count-leading-zeros.lo CC count-one-bits.lo CC md5.lo CC sha256.lo CC dirname-lgpl.lo CC basename-lgpl.lo CC stripslash.lo CC fd-hook.lo CC freading.lo CC getugroups.lo CC hard-locale.lo CC localcharset.lo CC malloca.lo CC mgetgroups.lo CC nonblocking.lo CC passfd.lo CC physmem.lo CC pipe2.lo CC sig-handler.lo CC sockets.lo CC stat-time.lo CC strnlen1.lo CC sys_socket.lo CC tempname.lo CC glthread/threadlib.lo CC unistd.lo CC wctype-h.lo CC xsize.lo CC asnprintf.lo CC fclose.lo CC fcntl.lo CC fflush.lo CC fnmatch.lo CC fpurge.lo CC fseek.lo CC fseeko.lo CC getopt.lo CC getopt1.lo CC ioctl.lo CC localtime-buffer.lo CC mbrtowc.lo CC mktime.lo CC perror.lo CC printf-args.lo CC printf-parse.lo CC secure_getenv.lo CC strerror.lo CC strerror_r.lo CC vasnprintf.lo GEN charset.alias GEN ref-add.sed GEN ref-del.sed CC glthread/lock.lo CCLD libgnu.la make[3]: Leaving directory `<https://ci.centos.org/job/libvirt-master-build/systems=libvirt-centos-6/ws/…'> make[2]: Leaving directory `<https://ci.centos.org/job/libvirt-master-build/systems=libvirt-centos-6/ws/…'> Making all in include/libvirt make[2]: Entering directory `<https://ci.centos.org/job/libvirt-master-build/systems=libvirt-centos-6/ws/…'> make[2]: Nothing to be done for `all'. make[2]: Leaving directory `<https://ci.centos.org/job/libvirt-master-build/systems=libvirt-centos-6/ws/…'> Making all in src make[2]: Entering directory `<https://ci.centos.org/job/libvirt-master-build/systems=libvirt-centos-6/ws/…'> GEN util/virkeycodetable_linux.h GEN util/virkeycodetable_atset1.h GEN util/virkeycodetable_osx.h GEN util/virkeycodetable_atset2.h GEN util/virkeycodetable_atset3.h GEN util/virkeycodetable_xtkbd.h GEN util/virkeycodetable_usb.h GEN util/virkeycodetable_win32.h GEN util/virkeycodetable_rfb.h GEN util/virkeynametable_linux.h GEN util/virkeynametable_osx.h GEN util/virkeynametable_win32.h GEN locking/lock_protocol.h GEN locking/lock_daemon_dispatch_stubs.h GEN logging/log_protocol.h GEN logging/log_daemon_dispatch_stubs.h GEN admin/admin_protocol.h GEN admin/admin_client.h GEN admin/admin_server_dispatch_stubs.h GEN lxc/lxc_monitor_protocol.h GEN lxc/lxc_monitor_dispatch.h GEN lxc/lxc_controller_dispatch.h GEN remote/remote_protocol.h GEN remote/remote_client_bodies.h GEN remote/lxc_protocol.h GEN remote/lxc_client_bodies.h GEN remote/qemu_protocol.h GEN remote/qemu_client_bodies.h GEN .esx_vi_generator.stamp GEN .hyperv_wmi_generator.stamp GEN ../../src/access/org.libvirt.api.policy GEN access/viraccessapicheck.h GEN ../../src/esx/esx_vi_types.generated.typedef GEN ../../src/esx/esx_vi_types.generated.typeenum GEN ../../src/esx/esx_vi_types.generated.typetostring GEN ../../src/esx/esx_vi_types.generated.typefromstring GEN ../../src/esx/esx_vi_types.generated.h GEN ../../src/esx/esx_vi_types.generated.c GEN ../../src/esx/esx_vi_methods.generated.h GEN ../../src/esx/esx_vi_methods.generated.c GEN ../../src/esx/esx_vi_methods.generated.macro GEN ../../src/esx/esx_vi.generated.h GEN ../../src/esx/esx_vi.generated.c GEN access/viraccessapicheck.c GEN ../../src/hyperv/hyperv_wmi_classes.generated.typedef GEN ../../src/hyperv/hyperv_wmi_classes.generated.h GEN ../../src/hyperv/hyperv_wmi_classes.generated.c GEN access/viraccessapicheckqemu.h GEN access/viraccessapicheckqemu.c GEN access/viraccessapichecklxc.h GEN access/viraccessapichecklxc.c GEN libvirt_access.xml GEN libvirt_access_qemu.xml GEN libvirt_access_lxc.xml GEN libvirt_access.syms GEN libvirt_access_qemu.syms GEN libvirt_access_lxc.syms GEN libvirt_qemu.def GEN libvirt_lxc.def GEN libvirt_admin.syms GEN libvirt_probes.h GEN libvirt_probes.stp GEN libvirt_functions.stp GEN libvirt_qemu_probes.h GEN locking/qemu-lockd.conf GEN virtlockd.init GEN virtlogd.init GEN locking/qemu-sanlock.conf GEN rpc/virnetprotocol.h GEN rpc/virkeepaliveprotocol.h GEN locking/lock_protocol.c GEN logging/log_protocol.c GEN admin/admin_protocol.c GEN lxc/lxc_monitor_protocol.c GEN remote/remote_protocol.c GEN remote/lxc_protocol.c GEN remote/qemu_protocol.c GEN libvirt.syms GEN libvirt_admin.def GEN rpc/virnetprotocol.c GEN rpc/virkeepaliveprotocol.c GEN libvirt.def make all-am make[3]: Entering directory `<https://ci.centos.org/job/libvirt-master-build/systems=libvirt-centos-6/ws/…'> CC libvirt_driver_la-driver.lo CC libvirt_driver_la-datatypes.lo CC libvirt_driver_la-libvirt.lo CC libvirt_driver_la-libvirt-domain.lo CC libvirt_driver_la-libvirt-domain-snapshot.lo CC libvirt_driver_la-libvirt-host.lo CC libvirt_driver_la-libvirt-interface.lo CC libvirt_driver_la-libvirt-network.lo CC libvirt_driver_la-libvirt-nodedev.lo CC libvirt_driver_la-libvirt-nwfilter.lo CC libvirt_driver_la-libvirt-secret.lo CC libvirt_driver_la-libvirt-storage.lo CC libvirt_driver_la-libvirt-stream.lo GEN libvirt_probes.o CC libvirt_qemu_la-libvirt-qemu.lo CC libvirt_lxc_la-libvirt-lxc.lo CC libvirt_admin_la-libvirt-admin.lo CC libvirt_admin_la-datatypes.lo CC locking/lockd_la-lock_driver_lockd.lo CC locking/lockd_la-lock_protocol.lo CC locking/sanlock_la-lock_driver_sanlock.lo GEN libvirt_qemu_probes.o CC secret/libvirt_driver_secret_la-secret_driver.lo CC admin/libvirt_driver_admin_la-admin_protocol.lo CC admin/libvirt_driver_admin_la-admin_server.lo CC admin/libvirt_driver_admin_la-admin_server_dispatch.lo CC util/libvirt_setuid_rpc_client_la-viralloc.lo CC util/libvirt_setuid_rpc_client_la-virarch.lo CC util/libvirt_setuid_rpc_client_la-viratomic.lo CC util/libvirt_setuid_rpc_client_la-virbuffer.lo CC util/libvirt_setuid_rpc_client_la-virbitmap.lo CC util/libvirt_setuid_rpc_client_la-vircgroup.lo CC util/libvirt_setuid_rpc_client_la-vircommand.lo CC util/libvirt_setuid_rpc_client_la-virconf.lo CC util/libvirt_setuid_rpc_client_la-virdbus.lo CC util/libvirt_setuid_rpc_client_la-virerror.lo CC util/libvirt_setuid_rpc_client_la-virevent.lo CC util/libvirt_setuid_rpc_client_la-vireventpoll.lo CC util/libvirt_setuid_rpc_client_la-virfile.lo CC util/libvirt_setuid_rpc_client_la-virgettext.lo CC util/libvirt_setuid_rpc_client_la-virhash.lo CC util/libvirt_setuid_rpc_client_la-virhashcode.lo CC util/libvirt_setuid_rpc_client_la-virhostcpu.lo CC util/libvirt_setuid_rpc_client_la-virjson.lo CC util/libvirt_setuid_rpc_client_la-virlog.lo CC util/libvirt_setuid_rpc_client_la-virobject.lo CC util/libvirt_setuid_rpc_client_la-virpidfile.lo CC util/libvirt_setuid_rpc_client_la-virprocess.lo CC util/libvirt_setuid_rpc_client_la-virrandom.lo CC util/libvirt_setuid_rpc_client_la-virsocketaddr.lo CC util/libvirt_setuid_rpc_client_la-virstring.lo CC util/libvirt_setuid_rpc_client_la-virsystemd.lo CC util/libvirt_setuid_rpc_client_la-virtime.lo CC util/libvirt_setuid_rpc_client_la-virthread.lo CC util/libvirt_setuid_rpc_client_la-virthreadjob.lo CC util/libvirt_setuid_rpc_client_la-virtypedparam.lo CC util/libvirt_setuid_rpc_client_la-viruri.lo CC util/libvirt_setuid_rpc_client_la-virutil.lo CC util/libvirt_setuid_rpc_client_la-viruuid.lo CC conf/libvirt_setuid_rpc_client_la-domain_event.lo cc1: warnings being treated as errors ../../src/util/virutil.c: In function 'virGetUNIXSocketPath': ../../src/util/virutil.c:2005: error: dereferencing pointer 'un' does break strict-aliasing rules [-Wstrict-aliasing] ../../src/util/virutil.c:2004: error: dereferencing pointer 'un' does break strict-aliasing rules [-Wstrict-aliasing] ../../src/util/virutil.c:1989: note: initialized from here make[3]: *** [util/libvirt_setuid_rpc_client_la-virutil.lo] Error 1 make[3]: *** Waiting for unfinished jobs.... make[3]: Leaving directory `<https://ci.centos.org/job/libvirt-master-build/systems=libvirt-centos-6/ws/…'> make[2]: *** [all] Error 2 make[2]: Leaving directory `<https://ci.centos.org/job/libvirt-master-build/systems=libvirt-centos-6/ws/…'> make[1]: *** [all-recursive] Error 1 make[1]: Leaving directory `<https://ci.centos.org/job/libvirt-master-build/systems=libvirt-centos-6/ws/…'> make: *** [all] Error 2 Build step 'Execute shell' marked build as failure
1 2
0 0
[Libvirt-ci] Build failed in Jenkins: libvirt-go-xml-master-check » libvirt-fedora-rawhide #127
by ci@centos.org 31 Jan '18

31 Jan '18
See <https://ci.centos.org/job/libvirt-go-xml-master-check/systems=libvirt-fedor…> ------------------------------------------ Started by upstream project "libvirt-go-xml-master-check" build number 127 originally caused by: Started by upstream project "libvirt-go-xml-master-build" build number 132 originally caused by: Started by upstream project "libvirt-master-build" build number 1135 originally caused by: Started by an SCM change [EnvInject] - Loading node environment variables. Building remotely on libvirt-fedora-rawhide (libvirt) in workspace <https://ci.centos.org/job/libvirt-go-xml-master-check/systems=libvirt-fedor…> [libvirt-go-xml-master] $ /bin/sh -xe /tmp/jenkins708555065934233899.sh + MAKE=make ++ uname + unamestr=Linux + '[' Linux = FreeBSD ']' + export PATH=/home/jenkins/build/libvirt/bin:/home/jenkins/build/libvirt/bin:/home/jenkins/build/libvirt/bin:/home/jenkins/build/libvirt/bin:/usr/lib64/ccache:/usr/local/sbin:/usr/local/bin:/usr/sbin:/usr/bin:/home/jenkins/.local/bin:/home/jenkins/bin + PATH=/home/jenkins/build/libvirt/bin:/home/jenkins/build/libvirt/bin:/home/jenkins/build/libvirt/bin:/home/jenkins/build/libvirt/bin:/usr/lib64/ccache:/usr/local/sbin:/usr/local/bin:/usr/sbin:/usr/bin:/home/jenkins/.local/bin:/home/jenkins/bin + export 'TEST_ARGS=-tags xmlroundtrip' + TEST_ARGS='-tags xmlroundtrip' + go test -tags xmlroundtrip --- FAIL: TestRoundTrip (73.38s) xml_test.go:384: testdata/libvirt/tests/qemuxml2argvdata/net-vhostuser-multiq.xml: /domain[0]/devices[0]/interface[3]/source[0]/reconnect[0]: element in expected XML missing in actual XML FAIL exit status 1 FAIL _<https://ci.centos.org/job/libvirt-go-xml-master-check/systems=libvirt-fedor…> 73.918s Build step 'Execute shell' marked build as failure
1 8
0 0
[Libvirt-ci] Build failed in Jenkins: libvirt-go-xml-master-check » libvirt-centos-7 #127
by ci@centos.org 31 Jan '18

31 Jan '18
See <https://ci.centos.org/job/libvirt-go-xml-master-check/systems=libvirt-cento…> ------------------------------------------ Started by upstream project "libvirt-go-xml-master-check" build number 127 originally caused by: Started by upstream project "libvirt-go-xml-master-build" build number 132 originally caused by: Started by upstream project "libvirt-master-build" build number 1135 originally caused by: Started by an SCM change [EnvInject] - Loading node environment variables. Building remotely on libvirt-centos-7 (libvirt) in workspace <https://ci.centos.org/job/libvirt-go-xml-master-check/systems=libvirt-cento…> [libvirt-go-xml-master] $ /bin/sh -xe /tmp/jenkins7649522036723903461.sh + MAKE=make ++ uname + unamestr=Linux + '[' Linux = FreeBSD ']' + export PATH=/home/jenkins/build/libvirt/bin:/home/jenkins/build/libvirt/bin:/home/jenkins/build/libvirt/bin:/home/jenkins/build/libvirt/bin:/usr/local/sbin:/usr/local/bin:/usr/sbin:/usr/bin:/home/jenkins/.local/bin:/home/jenkins/bin + PATH=/home/jenkins/build/libvirt/bin:/home/jenkins/build/libvirt/bin:/home/jenkins/build/libvirt/bin:/home/jenkins/build/libvirt/bin:/usr/local/sbin:/usr/local/bin:/usr/sbin:/usr/bin:/home/jenkins/.local/bin:/home/jenkins/bin + export 'TEST_ARGS=-tags xmlroundtrip' + TEST_ARGS='-tags xmlroundtrip' + go test -tags xmlroundtrip --- FAIL: TestRoundTrip (48.33s) xml_test.go:384: testdata/libvirt/tests/qemuxml2argvdata/net-vhostuser-multiq.xml: /domain[0]/devices[0]/interface[3]/source[0]/reconnect[0]: element in expected XML missing in actual XML FAIL exit status 1 FAIL _<https://ci.centos.org/job/libvirt-go-xml-master-check/systems=libvirt-cento…> 48.684s Build step 'Execute shell' marked build as failure
1 8
0 0
[Libvirt-ci] Build failed in Jenkins: libvirt-go-xml-master-check » libvirt-fedora-26 #127
by ci@centos.org 31 Jan '18

31 Jan '18
See <https://ci.centos.org/job/libvirt-go-xml-master-check/systems=libvirt-fedor…> ------------------------------------------ Started by upstream project "libvirt-go-xml-master-check" build number 127 originally caused by: Started by upstream project "libvirt-go-xml-master-build" build number 132 originally caused by: Started by upstream project "libvirt-master-build" build number 1135 originally caused by: Started by an SCM change [EnvInject] - Loading node environment variables. Building remotely on libvirt-fedora-26 (libvirt) in workspace <https://ci.centos.org/job/libvirt-go-xml-master-check/systems=libvirt-fedor…> [libvirt-go-xml-master] $ /bin/sh -xe /tmp/jenkins5187130789853228666.sh + MAKE=make ++ uname + unamestr=Linux + '[' Linux = FreeBSD ']' + export PATH=/home/jenkins/build/libvirt/bin:/home/jenkins/build/libvirt/bin:/home/jenkins/build/libvirt/bin:/home/jenkins/build/libvirt/bin:/usr/lib64/ccache:/usr/local/sbin:/usr/local/bin:/usr/sbin:/usr/bin:/home/jenkins/.local/bin:/home/jenkins/bin + PATH=/home/jenkins/build/libvirt/bin:/home/jenkins/build/libvirt/bin:/home/jenkins/build/libvirt/bin:/home/jenkins/build/libvirt/bin:/usr/lib64/ccache:/usr/local/sbin:/usr/local/bin:/usr/sbin:/usr/bin:/home/jenkins/.local/bin:/home/jenkins/bin + export 'TEST_ARGS=-tags xmlroundtrip' + TEST_ARGS='-tags xmlroundtrip' + go test -tags xmlroundtrip --- FAIL: TestRoundTrip (17.92s) xml_test.go:384: testdata/libvirt/tests/qemuxml2argvdata/net-vhostuser-multiq.xml: /domain[0]/devices[0]/interface[3]/source[0]/reconnect[0]: element in expected XML missing in actual XML FAIL exit status 1 FAIL _<https://ci.centos.org/job/libvirt-go-xml-master-check/systems=libvirt-fedor…> 18.126s Build step 'Execute shell' marked build as failure
1 8
0 0
[Libvirt-ci] Build failed in Jenkins: libvirt-go-xml-master-check » libvirt-fedora-27 #127
by ci@centos.org 31 Jan '18

31 Jan '18
See <https://ci.centos.org/job/libvirt-go-xml-master-check/systems=libvirt-fedor…> ------------------------------------------ Started by upstream project "libvirt-go-xml-master-check" build number 127 originally caused by: Started by upstream project "libvirt-go-xml-master-build" build number 132 originally caused by: Started by upstream project "libvirt-master-build" build number 1135 originally caused by: Started by an SCM change [EnvInject] - Loading node environment variables. Building remotely on libvirt-fedora-27 (libvirt) in workspace <https://ci.centos.org/job/libvirt-go-xml-master-check/systems=libvirt-fedor…> [libvirt-go-xml-master] $ /bin/sh -xe /tmp/jenkins2981089261513617680.sh + MAKE=make ++ uname + unamestr=Linux + '[' Linux = FreeBSD ']' + export PATH=/home/jenkins/build/libvirt/bin:/home/jenkins/build/libvirt/bin:/home/jenkins/build/libvirt/bin:/home/jenkins/build/libvirt/bin:/usr/lib64/ccache:/usr/local/sbin:/usr/local/bin:/usr/sbin:/usr/bin:/home/jenkins/.local/bin:/home/jenkins/bin + PATH=/home/jenkins/build/libvirt/bin:/home/jenkins/build/libvirt/bin:/home/jenkins/build/libvirt/bin:/home/jenkins/build/libvirt/bin:/usr/lib64/ccache:/usr/local/sbin:/usr/local/bin:/usr/sbin:/usr/bin:/home/jenkins/.local/bin:/home/jenkins/bin + export 'TEST_ARGS=-tags xmlroundtrip' + TEST_ARGS='-tags xmlroundtrip' + go test -tags xmlroundtrip --- FAIL: TestRoundTrip (22.17s) xml_test.go:384: testdata/libvirt/tests/qemuxml2argvdata/net-vhostuser-multiq.xml: /domain[0]/devices[0]/interface[3]/source[0]/reconnect[0]: element in expected XML missing in actual XML FAIL exit status 1 FAIL _<https://ci.centos.org/job/libvirt-go-xml-master-check/systems=libvirt-fedor…> 22.342s Build step 'Execute shell' marked build as failure
1 8
0 0
[Libvirt-ci] Build failed in Jenkins: libvirt-go-xml-master-check » libvirt-freebsd-11 #127
by ci@centos.org 31 Jan '18

31 Jan '18
See <https://ci.centos.org/job/libvirt-go-xml-master-check/systems=libvirt-freeb…> ------------------------------------------ Started by upstream project "libvirt-go-xml-master-check" build number 127 originally caused by: Started by upstream project "libvirt-go-xml-master-build" build number 132 originally caused by: Started by upstream project "libvirt-master-build" build number 1135 originally caused by: Started by an SCM change [EnvInject] - Loading node environment variables. Building remotely on libvirt-freebsd-11 (libvirt) in workspace <https://ci.centos.org/job/libvirt-go-xml-master-check/systems=libvirt-freeb…> [libvirt-go-xml-master] $ /bin/sh -xe /tmp/jenkins8641796943175276371.sh + MAKE=make + uname + unamestr=FreeBSD + [ FreeBSD '=' FreeBSD ] + MAKE=gmake + export 'PATH=/home/jenkins/build/libvirt/bin:/home/jenkins/build/libvirt/bin:/home/jenkins/build/libvirt/bin:/home/jenkins/build/libvirt/bin:/sbin:/bin:/usr/sbin:/usr/bin:/usr/local/sbin:/usr/local/bin:/home/jenkins/bin' + export 'TEST_ARGS=-tags xmlroundtrip' + go test -tags xmlroundtrip --- FAIL: TestRoundTrip (15.36s) xml_test.go:384: testdata/libvirt/tests/qemuxml2argvdata/net-vhostuser-multiq.xml: /domain[0]/devices[0]/interface[3]/source[0]/reconnect[0]: element in expected XML missing in actual XML FAIL exit status 1 FAIL _/usr<https://ci.centos.org/job/libvirt-go-xml-master-check/systems=libvirt-freeb…> 15.568s Build step 'Execute shell' marked build as failure
1 8
0 0
[Libvirt-ci] Build failed in Jenkins: libvirt-go-xml-master-check » libvirt-freebsd-10 #127
by ci@centos.org 31 Jan '18

31 Jan '18
See <https://ci.centos.org/job/libvirt-go-xml-master-check/systems=libvirt-freeb…> ------------------------------------------ Started by upstream project "libvirt-go-xml-master-check" build number 127 originally caused by: Started by upstream project "libvirt-go-xml-master-build" build number 132 originally caused by: Started by upstream project "libvirt-master-build" build number 1135 originally caused by: Started by an SCM change [EnvInject] - Loading node environment variables. Building remotely on libvirt-freebsd-10 (libvirt) in workspace <https://ci.centos.org/job/libvirt-go-xml-master-check/systems=libvirt-freeb…> [libvirt-go-xml-master] $ /bin/sh -xe /tmp/jenkins981911186873890991.sh + MAKE=make + uname + unamestr=FreeBSD + [ FreeBSD = FreeBSD ] + MAKE=gmake + export PATH=/home/jenkins/build/libvirt/bin:/home/jenkins/build/libvirt/bin:/home/jenkins/build/libvirt/bin:/home/jenkins/build/libvirt/bin:/sbin:/bin:/usr/sbin:/usr/bin:/usr/games:/usr/local/sbin:/usr/local/bin:/home/jenkins/bin + export 'TEST_ARGS=-tags xmlroundtrip' + go test -tags xmlroundtrip --- FAIL: TestRoundTrip (19.02s) xml_test.go:384: testdata/libvirt/tests/qemuxml2argvdata/net-vhostuser-multiq.xml: /domain[0]/devices[0]/interface[3]/source[0]/reconnect[0]: element in expected XML missing in actual XML FAIL exit status 1 FAIL _/usr<https://ci.centos.org/job/libvirt-go-xml-master-check/systems=libvirt-freeb…> 19.321s Build step 'Execute shell' marked build as failure
1 8
0 0
[Libvirt-ci] Build failed in Jenkins: libvirt-go-xml-master-check » libvirt-debian-9 #127
by ci@centos.org 31 Jan '18

31 Jan '18
See <https://ci.centos.org/job/libvirt-go-xml-master-check/systems=libvirt-debia…> ------------------------------------------ Started by upstream project "libvirt-go-xml-master-check" build number 127 originally caused by: Started by upstream project "libvirt-go-xml-master-build" build number 132 originally caused by: Started by upstream project "libvirt-master-build" build number 1135 originally caused by: Started by an SCM change [EnvInject] - Loading node environment variables. Building remotely on libvirt-debian-9 (libvirt) in workspace <https://ci.centos.org/job/libvirt-go-xml-master-check/systems=libvirt-debia…> [libvirt-go-xml-master] $ /bin/sh -xe /tmp/jenkins8280380057890090420.sh + MAKE=make + uname + unamestr=Linux + [ Linux = FreeBSD ] + export PATH=/home/jenkins/build/libvirt/bin:/home/jenkins/build/libvirt/bin:/home/jenkins/build/libvirt/bin:/home/jenkins/build/libvirt/bin:/usr/local/bin:/usr/bin:/bin:/usr/local/games:/usr/games + export TEST_ARGS=-tags xmlroundtrip + go test -tags xmlroundtrip --- FAIL: TestRoundTrip (14.56s) xml_test.go:384: testdata/libvirt/tests/qemuxml2argvdata/net-vhostuser-multiq.xml: /domain[0]/devices[0]/interface[3]/source[0]/reconnect[0]: element in expected XML missing in actual XML FAIL exit status 1 FAIL _<https://ci.centos.org/job/libvirt-go-xml-master-check/systems=libvirt-debia…> 14.696s Build step 'Execute shell' marked build as failure
1 8
0 0
[Libvirt-ci] Build failed in Jenkins: libvirt-go-xml-master-check » libvirt-debian-8 #127
by ci@centos.org 31 Jan '18

31 Jan '18
See <https://ci.centos.org/job/libvirt-go-xml-master-check/systems=libvirt-debia…> ------------------------------------------ Started by upstream project "libvirt-go-xml-master-check" build number 127 originally caused by: Started by upstream project "libvirt-go-xml-master-build" build number 132 originally caused by: Started by upstream project "libvirt-master-build" build number 1135 originally caused by: Started by an SCM change [EnvInject] - Loading node environment variables. Building remotely on libvirt-debian-8 (libvirt) in workspace <https://ci.centos.org/job/libvirt-go-xml-master-check/systems=libvirt-debia…> [libvirt-go-xml-master] $ /bin/sh -xe /tmp/jenkins6099234845081141424.sh + MAKE=make + uname + unamestr=Linux + [ Linux = FreeBSD ] + export PATH=/home/jenkins/build/libvirt/bin:/home/jenkins/build/libvirt/bin:/home/jenkins/build/libvirt/bin:/home/jenkins/build/libvirt/bin:/usr/local/bin:/usr/bin:/bin:/usr/local/games:/usr/games + export TEST_ARGS=-tags xmlroundtrip + go test -tags xmlroundtrip --- FAIL: TestRoundTrip (11.06 seconds) xml_test.go:384: testdata/libvirt/tests/qemuxml2argvdata/net-vhostuser-multiq.xml: /domain[0]/devices[0]/interface[3]/source[0]/reconnect[0]: element in expected XML missing in actual XML FAIL exit status 1 FAIL _<https://ci.centos.org/job/libvirt-go-xml-master-check/systems=libvirt-debia…> 11.305s Build step 'Execute shell' marked build as failure
1 8
0 0
[Libvirt-ci] Jenkins build is back to normal : libvirt-master-mingw » libvirt-fedora-rawhide #1772
by ci@centos.org 29 Jan '18

29 Jan '18
See <https://ci.centos.org/job/libvirt-master-mingw/systems=libvirt-fedora-rawhi…>
1 0
0 0
  • ← Newer
  • 1
  • ...
  • 951
  • 952
  • 953
  • 954
  • 955
  • 956
  • 957
  • ...
  • 1022
  • Older →

HyperKitty Powered by HyperKitty version 1.3.12.