libvirt List Archives
Sign In Sign Up
Manage this list Sign In Sign Up

Keyboard Shortcuts

Thread View

  • j: Next unread message
  • k: Previous unread message
  • j a: Jump to all threads
  • j l: Jump to MailingList overview

CI

Thread Start a new thread
Download
Threads by month
  • ----- 2026 -----
  • September
  • August
  • July
  • June
  • May
  • April
  • March
  • February
  • January
  • ----- 2025 -----
  • December
  • November
  • October
  • September
  • August
  • July
  • June
  • May
  • April
  • March
  • February
  • January
  • ----- 2024 -----
  • December
  • November
  • October
  • September
  • August
  • July
  • June
  • May
  • April
  • March
  • February
  • January
  • ----- 2023 -----
  • December
  • November
  • October
  • September
  • August
  • July
  • June
  • May
  • April
  • March
  • February
  • January
  • ----- 2022 -----
  • December
  • November
  • October
  • September
  • August
  • July
  • June
  • May
  • April
  • March
  • February
  • January
  • ----- 2021 -----
  • December
  • November
  • October
  • September
  • August
  • July
  • June
  • May
  • April
  • March
  • February
  • January
  • ----- 2020 -----
  • December
  • November
  • October
  • September
  • August
  • July
  • June
  • May
  • April
  • March
  • February
  • January
  • ----- 2019 -----
  • December
  • November
  • October
  • September
  • August
  • July
  • June
  • May
  • April
  • March
  • February
  • January
  • ----- 2018 -----
  • December
  • November
  • October
  • September
  • August
  • July
  • June
  • May
  • April
  • March
  • February
  • January
  • ----- 2017 -----
  • December
  • November
  • October
  • September
  • August
  • July
  • June
  • May
  • April
  • March
  • February
  • January
  • ----- 2016 -----
  • December
  • November
  • October
  • September
  • August
  • July
ci@lists.libvirt.org

  • 2 participants
  • 10212 discussions
[Libvirt-ci] Build failed in Jenkins: libvirt-perl-master-test » libvirt-fedora-27 #974
by ci@centos.org 12 Mar '18

12 Mar '18
See <https://ci.centos.org/job/libvirt-perl-master-test/systems=libvirt-fedora-2…> ------------------------------------------ Started by upstream project "libvirt-perl-master-test" build number 974 originally caused by: Started by upstream project "libvirt-perl-master-build" build number 1000 originally caused by: Started by upstream project "libvirt-master-build" build number 1253 originally caused by: Started by an SCM change [EnvInject] - Loading node environment variables. Building remotely on libvirt-fedora-27 (libvirt) in workspace <https://ci.centos.org/job/libvirt-perl-master-test/systems=libvirt-fedora-2…> [libvirt-perl-master] $ /bin/sh -xe /tmp/jenkins3347934641416875162.sh + MAKE=make ++ uname + unamestr=Linux + '[' Linux = FreeBSD ']' + export PATH=/home/jenkins/build/libvirt/bin:/home/jenkins/build/libvirt/bin:/home/jenkins/build/libvirt/bin:/home/jenkins/build/libvirt/bin:/usr/lib64/ccache:/usr/local/sbin:/usr/local/bin:/usr/sbin:/usr/bin:/home/jenkins/.local/bin:/home/jenkins/bin + PATH=/home/jenkins/build/libvirt/bin:/home/jenkins/build/libvirt/bin:/home/jenkins/build/libvirt/bin:/home/jenkins/build/libvirt/bin:/usr/lib64/ccache:/usr/local/sbin:/usr/local/bin:/usr/sbin:/usr/bin:/home/jenkins/.local/bin:/home/jenkins/bin + make -j3 test TEST_MAINTAINER=1 "/usr/bin/perl" -MExtUtils::Command::MM -e 'cp_nonempty' -- Virt.bs blib/arch/auto/Sys/Virt/Virt.bs 644 PERL_DL_NONLAZY=1 "/usr/bin/perl" "-MExtUtils::Command::MM" "-MTest::Harness" "-e" "undef *Test::Harness::Switches; test_harness(0, 'blib/lib', 'blib/arch')" t/*.t t/005-pod.t ............ ok t/010-pod-coverage.t ... ok t/015-changes.t ........ ok t/020-constants.t ...... ok # Failed test 'VIR_KEYCODE_SET_QNUM' # at t/030-api-coverage.t line 173. # Looks like you failed 1 test of 1613. t/030-api-coverage.t ... Dubious, test returned 1 (wstat 256, 0x100) Failed 1/1613 subtests t/100-connect.t ........ ok t/200-domains.t ........ ok t/300-networks.t ....... ok t/400-storage-pools.t .. ok t/500-storage-vols.t ... ok t/600-interfaces.t ..... ok t/800-events.t ......... ok Test Summary Report ------------------- t/030-api-coverage.t (Wstat: 256 Tests: 1613 Failed: 1) Failed test: 1229 Non-zero exit status: 1 Files=12, Tests=1865, 65 wallclock secs ( 0.38 usr 0.07 sys + 7.94 cusr 0.50 csys = 8.89 CPU) Result: FAIL Failed 1/12 test programs. 1/1865 subtests failed. make: *** [Makefile:1018: test_dynamic] Error 255 Build step 'Execute shell' marked build as failure
1 1
0 0
[Libvirt-ci] Build failed in Jenkins: libvirt-perl-master-test » libvirt-fedora-26 #974
by ci@centos.org 12 Mar '18

12 Mar '18
See <https://ci.centos.org/job/libvirt-perl-master-test/systems=libvirt-fedora-2…> ------------------------------------------ Started by upstream project "libvirt-perl-master-test" build number 974 originally caused by: Started by upstream project "libvirt-perl-master-build" build number 1000 originally caused by: Started by upstream project "libvirt-master-build" build number 1253 originally caused by: Started by an SCM change [EnvInject] - Loading node environment variables. Building remotely on libvirt-fedora-26 (libvirt) in workspace <https://ci.centos.org/job/libvirt-perl-master-test/systems=libvirt-fedora-2…> [libvirt-perl-master] $ /bin/sh -xe /tmp/jenkins5905811260542740387.sh + MAKE=make ++ uname + unamestr=Linux + '[' Linux = FreeBSD ']' + export PATH=/home/jenkins/build/libvirt/bin:/home/jenkins/build/libvirt/bin:/home/jenkins/build/libvirt/bin:/home/jenkins/build/libvirt/bin:/usr/lib64/ccache:/usr/local/sbin:/usr/local/bin:/usr/sbin:/usr/bin:/home/jenkins/.local/bin:/home/jenkins/bin + PATH=/home/jenkins/build/libvirt/bin:/home/jenkins/build/libvirt/bin:/home/jenkins/build/libvirt/bin:/home/jenkins/build/libvirt/bin:/usr/lib64/ccache:/usr/local/sbin:/usr/local/bin:/usr/sbin:/usr/bin:/home/jenkins/.local/bin:/home/jenkins/bin + make -j3 test TEST_MAINTAINER=1 "/usr/bin/perl" -MExtUtils::Command::MM -e 'cp_nonempty' -- Virt.bs blib/arch/auto/Sys/Virt/Virt.bs 644 PERL_DL_NONLAZY=1 "/usr/bin/perl" "-MExtUtils::Command::MM" "-MTest::Harness" "-e" "undef *Test::Harness::Switches; test_harness(0, 'blib/lib', 'blib/arch')" t/*.t t/005-pod.t ............ ok t/010-pod-coverage.t ... ok t/015-changes.t ........ ok t/020-constants.t ...... ok # Failed test 'VIR_KEYCODE_SET_QNUM' # at t/030-api-coverage.t line 173. # Looks like you failed 1 test of 1613. t/030-api-coverage.t ... Dubious, test returned 1 (wstat 256, 0x100) Failed 1/1613 subtests t/100-connect.t ........ ok t/200-domains.t ........ ok t/300-networks.t ....... ok t/400-storage-pools.t .. ok t/500-storage-vols.t ... ok t/600-interfaces.t ..... ok t/800-events.t ......... ok Test Summary Report ------------------- t/030-api-coverage.t (Wstat: 256 Tests: 1613 Failed: 1) Failed test: 1229 Non-zero exit status: 1 Files=12, Tests=1865, 64 wallclock secs ( 0.39 usr 0.05 sys + 7.70 cusr 0.50 csys = 8.64 CPU) Result: FAIL Failed 1/12 test programs. 1/1865 subtests failed. make: *** [Makefile:1018: test_dynamic] Error 255 Build step 'Execute shell' marked build as failure
1 1
0 0
[Libvirt-ci] Build failed in Jenkins: libvirt-perl-master-test » libvirt-centos-7 #974
by ci@centos.org 12 Mar '18

12 Mar '18
See <https://ci.centos.org/job/libvirt-perl-master-test/systems=libvirt-centos-7…> ------------------------------------------ Started by upstream project "libvirt-perl-master-test" build number 974 originally caused by: Started by upstream project "libvirt-perl-master-build" build number 1000 originally caused by: Started by upstream project "libvirt-master-build" build number 1253 originally caused by: Started by an SCM change [EnvInject] - Loading node environment variables. Building remotely on libvirt-centos-7 (libvirt) in workspace <https://ci.centos.org/job/libvirt-perl-master-test/systems=libvirt-centos-7…> [libvirt-perl-master] $ /bin/sh -xe /tmp/jenkins2294382971060937918.sh + MAKE=make ++ uname + unamestr=Linux + '[' Linux = FreeBSD ']' + export PATH=/home/jenkins/build/libvirt/bin:/home/jenkins/build/libvirt/bin:/home/jenkins/build/libvirt/bin:/home/jenkins/build/libvirt/bin:/usr/local/sbin:/usr/local/bin:/usr/sbin:/usr/bin:/home/jenkins/.local/bin:/home/jenkins/bin + PATH=/home/jenkins/build/libvirt/bin:/home/jenkins/build/libvirt/bin:/home/jenkins/build/libvirt/bin:/home/jenkins/build/libvirt/bin:/usr/local/sbin:/usr/local/bin:/usr/sbin:/usr/bin:/home/jenkins/.local/bin:/home/jenkins/bin + make -j3 test TEST_MAINTAINER=1 PERL_DL_NONLAZY=1 /usr/bin/perl "-MExtUtils::Command::MM" "-e" "test_harness(0, 'blib/lib', 'blib/arch')" t/*.t t/005-pod.t ............ ok t/010-pod-coverage.t ... ok t/015-changes.t ........ ok t/020-constants.t ...... ok # Failed test 'VIR_KEYCODE_SET_QNUM' # at t/030-api-coverage.t line 173. # Looks like you failed 1 test of 1613. t/030-api-coverage.t ... Dubious, test returned 1 (wstat 256, 0x100) Failed 1/1613 subtests t/100-connect.t ........ ok t/200-domains.t ........ ok t/300-networks.t ....... ok t/400-storage-pools.t .. ok t/500-storage-vols.t ... ok t/600-interfaces.t ..... ok t/800-events.t ......... ok Test Summary Report ------------------- t/030-api-coverage.t (Wstat: 256 Tests: 1613 Failed: 1) Failed test: 1229 Non-zero exit status: 1 Files=12, Tests=1865, 33 wallclock secs ( 0.38 usr 0.04 sys + 7.67 cusr 0.36 csys = 8.45 CPU) Result: FAIL Failed 1/12 test programs. 1/1865 subtests failed. make: *** [test_dynamic] Error 255 Build step 'Execute shell' marked build as failure
1 1
0 0
[Libvirt-ci] Build failed in Jenkins: libvirt-perl-master-test » libvirt-freebsd-10 #974
by ci@centos.org 12 Mar '18

12 Mar '18
See <https://ci.centos.org/job/libvirt-perl-master-test/systems=libvirt-freebsd-…> ------------------------------------------ Started by upstream project "libvirt-perl-master-test" build number 974 originally caused by: Started by upstream project "libvirt-perl-master-build" build number 1000 originally caused by: Started by upstream project "libvirt-master-build" build number 1253 originally caused by: Started by an SCM change [EnvInject] - Loading node environment variables. Building remotely on libvirt-freebsd-10 (libvirt) in workspace <https://ci.centos.org/job/libvirt-perl-master-test/systems=libvirt-freebsd-…> [libvirt-perl-master] $ /bin/sh -xe /tmp/jenkins5967290364989764212.sh + MAKE=make + uname + unamestr=FreeBSD + [ FreeBSD = FreeBSD ] + MAKE=gmake + export PATH=/home/jenkins/build/libvirt/bin:/home/jenkins/build/libvirt/bin:/home/jenkins/build/libvirt/bin:/home/jenkins/build/libvirt/bin:/sbin:/bin:/usr/sbin:/usr/bin:/usr/games:/usr/local/sbin:/usr/local/bin:/home/jenkins/bin + gmake -j3 test TEST_MAINTAINER=1 "/usr/local/bin/perl" -MExtUtils::Command::MM -e 'cp_nonempty' -- Virt.bs blib/arch/auto/Sys/Virt/Virt.bs 644 PERL_DL_NONLAZY=1 "/usr/local/bin/perl" "-MExtUtils::Command::MM" "-MTest::Harness" "-e" "undef *Test::Harness::Switches; test_harness(0, 'blib/lib', 'blib/arch')" t/*.t t/005-pod.t ............ ok t/010-pod-coverage.t ... ok t/015-changes.t ........ ok t/020-constants.t ...... ok # Failed test 'VIR_KEYCODE_SET_QNUM' # at t/030-api-coverage.t line 173. # Looks like you failed 1 test of 1613. t/030-api-coverage.t ... Dubious, test returned 1 (wstat 256, 0x100) Failed 1/1613 subtests t/100-connect.t ........ ok t/200-domains.t ........ ok t/300-networks.t ....... ok t/400-storage-pools.t .. ok t/500-storage-vols.t ... ok t/600-interfaces.t ..... ok t/800-events.t ......... ok Test Summary Report ------------------- t/030-api-coverage.t (Wstat: 256 Tests: 1613 Failed: 1) Failed test: 1229 Non-zero exit status: 1 Files=12, Tests=1865, 31 wallclock secs ( 0.88 usr 0.47 sys + 19.07 cusr 2.60 csys = 23.02 CPU) Result: FAIL Failed 1/12 test programs. 1/1865 subtests failed. gmake: *** [Makefile:1017: test_dynamic] Error 255 Build step 'Execute shell' marked build as failure
1 1
0 0
[Libvirt-ci] Build failed in Jenkins: libvirt-perl-master-test » libvirt-freebsd-11 #974
by ci@centos.org 12 Mar '18

12 Mar '18
See <https://ci.centos.org/job/libvirt-perl-master-test/systems=libvirt-freebsd-…> ------------------------------------------ Started by upstream project "libvirt-perl-master-test" build number 974 originally caused by: Started by upstream project "libvirt-perl-master-build" build number 1000 originally caused by: Started by upstream project "libvirt-master-build" build number 1253 originally caused by: Started by an SCM change [EnvInject] - Loading node environment variables. Building remotely on libvirt-freebsd-11 (libvirt) in workspace <https://ci.centos.org/job/libvirt-perl-master-test/systems=libvirt-freebsd-…> [libvirt-perl-master] $ /bin/sh -xe /tmp/jenkins8026401251401535403.sh + MAKE=make + uname + unamestr=FreeBSD + [ FreeBSD '=' FreeBSD ] + MAKE=gmake + export 'PATH=/home/jenkins/build/libvirt/bin:/home/jenkins/build/libvirt/bin:/home/jenkins/build/libvirt/bin:/home/jenkins/build/libvirt/bin:/sbin:/bin:/usr/sbin:/usr/bin:/usr/local/sbin:/usr/local/bin:/home/jenkins/bin' + gmake -j3 test 'TEST_MAINTAINER=1' "/usr/local/bin/perl5.24.3" -MExtUtils::Command::MM -e 'cp_nonempty' -- Virt.bs blib/arch/auto/Sys/Virt/Virt.bs 644 PERL_DL_NONLAZY=1 "/usr/local/bin/perl5.24.3" "-MExtUtils::Command::MM" "-MTest::Harness" "-e" "undef *Test::Harness::Switches; test_harness(0, 'blib/lib', 'blib/arch')" t/*.t t/005-pod.t ............ ok t/010-pod-coverage.t ... ok t/015-changes.t ........ ok t/020-constants.t ...... ok # Failed test 'VIR_KEYCODE_SET_QNUM' # at t/030-api-coverage.t line 173. # Looks like you failed 1 test of 1613. t/030-api-coverage.t ... Dubious, test returned 1 (wstat 256, 0x100) Failed 1/1613 subtests t/100-connect.t ........ ok t/200-domains.t ........ ok t/300-networks.t ....... ok t/400-storage-pools.t .. ok t/500-storage-vols.t ... ok t/600-interfaces.t ..... ok t/800-events.t ......... ok Test Summary Report ------------------- t/030-api-coverage.t (Wstat: 256 Tests: 1613 Failed: 1) Failed test: 1229 Non-zero exit status: 1 Files=12, Tests=1865, 34 wallclock secs ( 0.82 usr 0.35 sys + 21.90 cusr 1.80 csys = 24.88 CPU) Result: FAIL Failed 1/12 test programs. 1/1865 subtests failed. gmake: *** [Makefile:1018: test_dynamic] Error 255 Build step 'Execute shell' marked build as failure
1 1
0 0
[Libvirt-ci] Build failed in Jenkins: libvirt-go-master-check » libvirt-debian-9 #864
by ci@centos.org 12 Mar '18

12 Mar '18
See <https://ci.centos.org/job/libvirt-go-master-check/systems=libvirt-debian-9/…> ------------------------------------------ Started by upstream project "libvirt-go-master-check" build number 864 originally caused by: Started by upstream project "libvirt-go-master-build" build number 871 originally caused by: Started by upstream project "libvirt-master-build" build number 1253 originally caused by: Started by an SCM change [EnvInject] - Loading node environment variables. Building remotely on libvirt-debian-9 (libvirt) in workspace <https://ci.centos.org/job/libvirt-go-master-check/systems=libvirt-debian-9/…> [libvirt-go-master] $ /bin/sh -xe /tmp/jenkins5653694775165059876.sh + MAKE=make + uname + unamestr=Linux + [ Linux = FreeBSD ] + export PATH=/home/jenkins/build/libvirt/bin:/home/jenkins/build/libvirt/bin:/home/jenkins/build/libvirt/bin:/home/jenkins/build/libvirt/bin:/usr/local/bin:/usr/bin:/bin:/usr/local/games:/usr/games + export TEST_ARGS=-tags api + go test -tags api 2018-03-12 16:41:57.461+0000: 11684: info : libvirt version: 4.2.0 2018-03-12 16:41:57.461+0000: 11684: info : hostname: libvirt-debian-9 2018-03-12 16:41:57.461+0000: 11684: warning : virEventRegisterImpl:245 : Ignoring attempt to replace registered event loop 2018-03-12 16:41:57.461+0000: 11684: warning : virEventRegisterImpl:245 : Ignoring attempt to replace registered event loop 2018-03-12 16:41:57.461+0000: 11684: warning : virEventRegisterImpl:245 : Ignoring attempt to replace registered event loop Missing enum 'VIR_KEYCODE_SET_QNUM' --- FAIL: TestAPICoverage (0.90s) panic: Missing symbols found [recovered] panic: Missing symbols found goroutine 5 [running]: panic(0x561eefabf640, 0xc4201066d0) /usr/lib/go-1.7/src/runtime/panic.go:500 +0x1a1 testing.tRunner.func1(0xc42001a240) /usr/lib/go-1.7/src/testing/testing.go:579 +0x25d panic(0x561eefabf640, 0xc4201066d0) /usr/lib/go-1.7/src/runtime/panic.go:458 +0x243 _<https://ci.centos.org/job/libvirt-go-master-check/systems=libvirt-debian-9/…> <https://ci.centos.org/job/libvirt-go-master-check/systems=libvirt-debian-9/…>:504 +0x5ff testing.tRunner(0xc42001a240, 0x561eefb12e48) /usr/lib/go-1.7/src/testing/testing.go:610 +0x81 created by testing.(*T).Run /usr/lib/go-1.7/src/testing/testing.go:646 +0x2ec exit status 2 FAIL _<https://ci.centos.org/job/libvirt-go-master-check/systems=libvirt-debian-9/…> 1.002s Build step 'Execute shell' marked build as failure
1 1
0 0
[Libvirt-ci] Build failed in Jenkins: libvirt-go-master-check » libvirt-debian-8 #864
by ci@centos.org 12 Mar '18

12 Mar '18
See <https://ci.centos.org/job/libvirt-go-master-check/systems=libvirt-debian-8/…> ------------------------------------------ Started by upstream project "libvirt-go-master-check" build number 864 originally caused by: Started by upstream project "libvirt-go-master-build" build number 871 originally caused by: Started by upstream project "libvirt-master-build" build number 1253 originally caused by: Started by an SCM change [EnvInject] - Loading node environment variables. Building remotely on libvirt-debian-8 (libvirt) in workspace <https://ci.centos.org/job/libvirt-go-master-check/systems=libvirt-debian-8/…> [libvirt-go-master] $ /bin/sh -xe /tmp/jenkins3182265825892567716.sh + MAKE=make + uname + unamestr=Linux + [ Linux = FreeBSD ] + export PATH=/home/jenkins/build/libvirt/bin:/home/jenkins/build/libvirt/bin:/home/jenkins/build/libvirt/bin:/home/jenkins/build/libvirt/bin:/usr/local/bin:/usr/bin:/bin:/usr/local/games:/usr/games + export TEST_ARGS=-tags api + go test -tags api 2018-03-12 22:48:07.690+0000: 30611: info : libvirt version: 4.2.0 2018-03-12 22:48:07.690+0000: 30611: info : hostname: libvirt-debian-8 2018-03-12 22:48:07.690+0000: 30611: warning : virEventRegisterImpl:245 : Ignoring attempt to replace registered event loop 2018-03-12 22:48:07.690+0000: 30611: warning : virEventRegisterImpl:245 : Ignoring attempt to replace registered event loop 2018-03-12 22:48:07.690+0000: 30611: warning : virEventRegisterImpl:245 : Ignoring attempt to replace registered event loop Missing enum 'VIR_KEYCODE_SET_QNUM' --- FAIL: TestAPICoverage (0.89 seconds) panic: Missing symbols found [recovered] panic: Missing symbols found goroutine 20 [running]: runtime.panic(0x5e6880, 0xc208123660) /usr/lib/go/src/pkg/runtime/panic.c:279 +0xf5 testing.func·006() /usr/lib/go/src/pkg/testing/testing.go:416 +0x176 runtime.panic(0x5e6880, 0xc208123660) /usr/lib/go/src/pkg/runtime/panic.c:248 +0x18d _<https://ci.centos.org/job/libvirt-go-master-check/systems=libvirt-debian-8/…> <https://ci.centos.org/job/libvirt-go-master-check/systems=libvirt-debian-8/…>:504 +0x515 testing.tRunner(0xc208026090, 0xa01300) /usr/lib/go/src/pkg/testing/testing.go:422 +0x8b created by testing.RunTests /usr/lib/go/src/pkg/testing/testing.go:504 +0x8db goroutine 16 [chan receive]: testing.RunTests(0x70f8c0, 0xa01300, 0x77, 0x77, 0x41c001) /usr/lib/go/src/pkg/testing/testing.go:505 +0x923 testing.Main(0x70f8c0, 0xa01300, 0x77, 0x77, 0xa14700, 0x0, 0x0, 0xa14700, 0x0, 0x0) /usr/lib/go/src/pkg/testing/testing.go:435 +0x84 main.main() _<https://ci.centos.org/job/libvirt-go-master-check/systems=libvirt-debian-8/…>:283 +0x9c goroutine 19 [finalizer wait]: runtime.park(0x42b430, 0xa10650, 0x9ffec9) /usr/lib/go/src/pkg/runtime/proc.c:1369 +0x89 runtime.parkunlock(0xa10650, 0x9ffec9) /usr/lib/go/src/pkg/runtime/proc.c:1385 +0x3b runfinq() /usr/lib/go/src/pkg/runtime/mgc0.c:2644 +0xcf runtime.goexit() /usr/lib/go/src/pkg/runtime/proc.c:1445 goroutine 17 [syscall]: runtime.goexit() /usr/lib/go/src/pkg/runtime/proc.c:1445 exit status 2 FAIL _<https://ci.centos.org/job/libvirt-go-master-check/systems=libvirt-debian-8/…> 0.948s Build step 'Execute shell' marked build as failure
1 1
0 0
[Libvirt-ci] Build failed in Jenkins: libvirt-perl-master-test » libvirt-centos-6 #974
by ci@centos.org 12 Mar '18

12 Mar '18
See <https://ci.centos.org/job/libvirt-perl-master-test/systems=libvirt-centos-6…> ------------------------------------------ Started by upstream project "libvirt-perl-master-test" build number 974 originally caused by: Started by upstream project "libvirt-perl-master-build" build number 1000 originally caused by: Started by upstream project "libvirt-master-build" build number 1253 originally caused by: Started by an SCM change [EnvInject] - Loading node environment variables. Building remotely on libvirt-centos-6 (libvirt) in workspace <https://ci.centos.org/job/libvirt-perl-master-test/systems=libvirt-centos-6…> [libvirt-perl-master] $ /bin/sh -xe /tmp/jenkins3099695754090718915.sh + MAKE=make ++ uname + unamestr=Linux + '[' Linux = FreeBSD ']' + export PATH=/home/jenkins/build/libvirt/bin:/home/jenkins/build/libvirt/bin:/home/jenkins/build/libvirt/bin:/home/jenkins/build/libvirt/bin:/usr/local/bin:/bin:/usr/bin:/usr/local/sbin:/usr/sbin:/sbin:/home/jenkins/bin + PATH=/home/jenkins/build/libvirt/bin:/home/jenkins/build/libvirt/bin:/home/jenkins/build/libvirt/bin:/home/jenkins/build/libvirt/bin:/usr/local/bin:/bin:/usr/bin:/usr/local/sbin:/usr/sbin:/sbin:/home/jenkins/bin + make -j3 test TEST_MAINTAINER=1 PERL_DL_NONLAZY=1 /usr/bin/perl "-MExtUtils::Command::MM" "-e" "test_harness(0, 'blib/lib', 'blib/arch')" t/*.t t/005-pod.t ............ ok t/010-pod-coverage.t ... ok t/015-changes.t ........ skipped: Test::CPAN::Changes required for this test t/020-constants.t ...... ok # Failed test 'VIR_KEYCODE_SET_QNUM' # at t/030-api-coverage.t line 173. # Looks like you failed 1 test of 1613. t/030-api-coverage.t ... Dubious, test returned 1 (wstat 256, 0x100) Failed 1/1613 subtests t/100-connect.t ........ ok t/200-domains.t ........ ok t/300-networks.t ....... ok t/400-storage-pools.t .. ok t/500-storage-vols.t ... ok t/600-interfaces.t ..... ok t/800-events.t ......... ok Test Summary Report ------------------- t/030-api-coverage.t (Wstat: 256 Tests: 1613 Failed: 1) Failed test: 1229 Non-zero exit status: 1 Files=12, Tests=1861, 21 wallclock secs ( 1.03 usr 0.12 sys + 15.58 cusr 0.61 csys = 17.34 CPU) Result: FAIL Failed 1/12 test programs. 1/1861 subtests failed. make: *** [test_dynamic] Error 255 Build step 'Execute shell' marked build as failure
1 1
0 0
[Libvirt-ci] Build failed in Jenkins: libvirt-perl-master-test » libvirt-debian-8 #974
by ci@centos.org 12 Mar '18

12 Mar '18
See <https://ci.centos.org/job/libvirt-perl-master-test/systems=libvirt-debian-8…> ------------------------------------------ Started by upstream project "libvirt-perl-master-test" build number 974 originally caused by: Started by upstream project "libvirt-perl-master-build" build number 1000 originally caused by: Started by upstream project "libvirt-master-build" build number 1253 originally caused by: Started by an SCM change [EnvInject] - Loading node environment variables. Building remotely on libvirt-debian-8 (libvirt) in workspace <https://ci.centos.org/job/libvirt-perl-master-test/systems=libvirt-debian-8…> [libvirt-perl-master] $ /bin/sh -xe /tmp/jenkins9094575979815591444.sh + MAKE=make + uname + unamestr=Linux + [ Linux = FreeBSD ] + export PATH=/home/jenkins/build/libvirt/bin:/home/jenkins/build/libvirt/bin:/home/jenkins/build/libvirt/bin:/home/jenkins/build/libvirt/bin:/usr/local/bin:/usr/bin:/bin:/usr/local/games:/usr/games + make -j3 test TEST_MAINTAINER=1 PERL_DL_NONLAZY=1 PERL_USE_UNSAFE_INC=1 /usr/bin/perl "-MExtUtils::Command::MM" "-MTest::Harness" "-e" "undef *Test::Harness::Switches; test_harness(0, 'blib/lib', 'blib/arch')" t/*.t t/005-pod.t ............ ok t/010-pod-coverage.t ... ok t/015-changes.t ........ ok t/020-constants.t ...... ok # Failed test 'VIR_KEYCODE_SET_QNUM' # at t/030-api-coverage.t line 173. # Looks like you failed 1 test of 1613. t/030-api-coverage.t ... Dubious, test returned 1 (wstat 256, 0x100) Failed 1/1613 subtests t/100-connect.t ........ ok t/200-domains.t ........ ok t/300-networks.t ....... ok t/400-storage-pools.t .. ok t/500-storage-vols.t ... ok t/600-interfaces.t ..... ok t/800-events.t ......... ok Test Summary Report ------------------- t/030-api-coverage.t (Wstat: 256 Tests: 1613 Failed: 1) Failed test: 1229 Non-zero exit status: 1 Files=12, Tests=1865, 23 wallclock secs ( 0.80 usr 0.07 sys + 12.47 cusr 0.58 csys = 13.92 CPU) Result: FAIL Failed 1/12 test programs. 1/1865 subtests failed. Makefile:1004: recipe for target 'test_dynamic' failed make: *** [test_dynamic] Error 255 Build step 'Execute shell' marked build as failure
1 1
0 0
[Libvirt-ci] Build failed in Jenkins: libvirt-perl-master-test » libvirt-debian-9 #974
by ci@centos.org 12 Mar '18

12 Mar '18
See <https://ci.centos.org/job/libvirt-perl-master-test/systems=libvirt-debian-9…> ------------------------------------------ Started by upstream project "libvirt-perl-master-test" build number 974 originally caused by: Started by upstream project "libvirt-perl-master-build" build number 1000 originally caused by: Started by upstream project "libvirt-master-build" build number 1253 originally caused by: Started by an SCM change [EnvInject] - Loading node environment variables. Building remotely on libvirt-debian-9 (libvirt) in workspace <https://ci.centos.org/job/libvirt-perl-master-test/systems=libvirt-debian-9…> [libvirt-perl-master] $ /bin/sh -xe /tmp/jenkins3556050726078337902.sh + MAKE=make + uname + unamestr=Linux + [ Linux = FreeBSD ] + export PATH=/home/jenkins/build/libvirt/bin:/home/jenkins/build/libvirt/bin:/home/jenkins/build/libvirt/bin:/home/jenkins/build/libvirt/bin:/usr/local/bin:/usr/bin:/bin:/usr/local/games:/usr/games + make -j3 test TEST_MAINTAINER=1 PERL_DL_NONLAZY=1 PERL_USE_UNSAFE_INC=1 "/usr/bin/perl" "-MExtUtils::Command::MM" "-MTest::Harness" "-e" "undef *Test::Harness::Switches; test_harness(0, 'blib/lib', 'blib/arch')" t/*.t t/005-pod.t ............ ok t/010-pod-coverage.t ... ok t/015-changes.t ........ ok t/020-constants.t ...... ok # Failed test 'VIR_KEYCODE_SET_QNUM' # at t/030-api-coverage.t line 173. # Looks like you failed 1 test of 1613. t/030-api-coverage.t ... Dubious, test returned 1 (wstat 256, 0x100) Failed 1/1613 subtests t/100-connect.t ........ ok t/200-domains.t ........ ok t/300-networks.t ....... ok t/400-storage-pools.t .. ok t/500-storage-vols.t ... ok t/600-interfaces.t ..... ok t/800-events.t ......... ok Test Summary Report ------------------- t/030-api-coverage.t (Wstat: 256 Tests: 1613 Failed: 1) Failed test: 1229 Non-zero exit status: 1 Files=12, Tests=1865, 31 wallclock secs ( 0.82 usr 0.22 sys + 15.08 cusr 0.86 csys = 16.98 CPU) Result: FAIL Failed 1/12 test programs. 1/1865 subtests failed. Makefile:1009: recipe for target 'test_dynamic' failed make: *** [test_dynamic] Error 255 Build step 'Execute shell' marked build as failure
1 1
0 0
  • ← Newer
  • 1
  • ...
  • 932
  • 933
  • 934
  • 935
  • 936
  • 937
  • 938
  • ...
  • 1022
  • Older →

HyperKitty Powered by HyperKitty version 1.3.12.