libvirt List Archives
Sign In Sign Up
Manage this list Sign In Sign Up

Keyboard Shortcuts

Thread View

  • j: Next unread message
  • k: Previous unread message
  • j a: Jump to all threads
  • j l: Jump to MailingList overview

CI

Thread Start a new thread
Download
Threads by month
  • ----- 2026 -----
  • September
  • August
  • July
  • June
  • May
  • April
  • March
  • February
  • January
  • ----- 2025 -----
  • December
  • November
  • October
  • September
  • August
  • July
  • June
  • May
  • April
  • March
  • February
  • January
  • ----- 2024 -----
  • December
  • November
  • October
  • September
  • August
  • July
  • June
  • May
  • April
  • March
  • February
  • January
  • ----- 2023 -----
  • December
  • November
  • October
  • September
  • August
  • July
  • June
  • May
  • April
  • March
  • February
  • January
  • ----- 2022 -----
  • December
  • November
  • October
  • September
  • August
  • July
  • June
  • May
  • April
  • March
  • February
  • January
  • ----- 2021 -----
  • December
  • November
  • October
  • September
  • August
  • July
  • June
  • May
  • April
  • March
  • February
  • January
  • ----- 2020 -----
  • December
  • November
  • October
  • September
  • August
  • July
  • June
  • May
  • April
  • March
  • February
  • January
  • ----- 2019 -----
  • December
  • November
  • October
  • September
  • August
  • July
  • June
  • May
  • April
  • March
  • February
  • January
  • ----- 2018 -----
  • December
  • November
  • October
  • September
  • August
  • July
  • June
  • May
  • April
  • March
  • February
  • January
  • ----- 2017 -----
  • December
  • November
  • October
  • September
  • August
  • July
  • June
  • May
  • April
  • March
  • February
  • January
  • ----- 2016 -----
  • December
  • November
  • October
  • September
  • August
  • July
ci@lists.libvirt.org

  • 2 participants
  • 10212 discussions
[Libvirt-ci] Build failed in Jenkins: virt-manager-master-py3-check » libvirt-fedora-27 #1
by ci@centos.org 16 Feb '18

16 Feb '18
See <https://ci.centos.org/job/virt-manager-master-py3-check/systems=libvirt-fed…> ------------------------------------------ Started by upstream project "virt-manager-master-py3-check" build number 1 originally caused by: Started by upstream project "virt-manager-master-py3-build" build number 1 originally caused by: Started by upstream project "libvirt-python-master-py3-build" build number 1 originally caused by: Started by an SCM change [EnvInject] - Loading node environment variables. Building remotely on libvirt-fedora-27 (libvirt) in workspace <https://ci.centos.org/job/virt-manager-master-py3-check/systems=libvirt-fed…> [virt-manager-master] $ /bin/sh -xe /tmp/jenkins1466454522131134835.sh + MAKE=make ++ uname + unamestr=Linux + '[' Linux = FreeBSD ']' + export PATH=/home/jenkins/build/libvirt/bin:/home/jenkins/build/libvirt/bin:/home/jenkins/build/libvirt/bin:/home/jenkins/build/libvirt/bin:/usr/lib64/ccache:/usr/local/sbin:/usr/local/bin:/usr/sbin:/usr/bin:/home/jenkins/.local/bin:/home/jenkins/bin + PATH=/home/jenkins/build/libvirt/bin:/home/jenkins/build/libvirt/bin:/home/jenkins/build/libvirt/bin:/home/jenkins/build/libvirt/bin:/usr/lib64/ccache:/usr/local/sbin:/usr/local/bin:/usr/sbin:/usr/bin:/home/jenkins/.local/bin:/home/jenkins/bin + python3 ./setup.py test running test Traceback (most recent call last): File "/home/jenkins/build/libvirt/lib64/python2.7/site-packages/libvirt.py", line 24, in <module> import cygvirtmod as libvirtmod ModuleNotFoundError: No module named 'cygvirtmod' During handling of the above exception, another exception occurred: Traceback (most recent call last): File "./setup.py", line 673, in <module> distclass=VMMDistribution, File "/usr/lib64/python3.6/distutils/core.py", line 148, in setup dist.run_commands() File "/usr/lib64/python3.6/distutils/dist.py", line 955, in run_commands self.run_command(cmd) File "/usr/lib64/python3.6/distutils/dist.py", line 974, in run_command cmd_obj.run() File "./setup.py", line 514, in run TestBaseCommand.run(self) File "./setup.py", line 433, in run import tests as testsmodule File "<https://ci.centos.org/job/virt-manager-master-py3-check/systems=libvirt-fed…",> line 33, in <module> from tests import utils File "<https://ci.centos.org/job/virt-manager-master-py3-check/systems=libvirt-fed…",> line 21, in <module> import virtinst File "<https://ci.centos.org/job/virt-manager-master-py3-check/systems=libvirt-fed…",> line 39, in <module> from virtinst import util File "<https://ci.centos.org/job/virt-manager-master-py3-check/systems=libvirt-fed…",> line 27, in <module> import libvirt File "/home/jenkins/build/libvirt/lib64/python2.7/site-packages/libvirt.py", line 28, in <module> raise lib_e File "/home/jenkins/build/libvirt/lib64/python2.7/site-packages/libvirt.py", line 20, in <module> import libvirtmod ImportError: dynamic module does not define module export function (PyInit_libvirtmod) Build step 'Execute shell' marked build as failure
1 1
0 0
[Libvirt-ci] Build failed in Jenkins: libvirt-python-master-py3-check » libvirt-fedora-rawhide #1
by ci@centos.org 16 Feb '18

16 Feb '18
See <https://ci.centos.org/job/libvirt-python-master-py3-check/systems=libvirt-f…> ------------------------------------------ Started by upstream project "libvirt-python-master-py3-check" build number 1 originally caused by: Started by upstream project "libvirt-python-master-py3-build" build number 1 originally caused by: Started by an SCM change [EnvInject] - Loading node environment variables. Building remotely on libvirt-fedora-rawhide (libvirt) in workspace <https://ci.centos.org/job/libvirt-python-master-py3-check/systems=libvirt-f…> [libvirt-python-master] $ /bin/sh -xe /tmp/jenkins3743380221329472147.sh + MAKE=make ++ uname + unamestr=Linux + '[' Linux = FreeBSD ']' + export PATH=/home/jenkins/build/libvirt/bin:/home/jenkins/build/libvirt/bin:/home/jenkins/build/libvirt/bin:/home/jenkins/build/libvirt/bin:/usr/lib64/ccache:/usr/local/sbin:/usr/local/bin:/usr/sbin:/usr/bin:/home/jenkins/.local/bin:/home/jenkins/bin + PATH=/home/jenkins/build/libvirt/bin:/home/jenkins/build/libvirt/bin:/home/jenkins/build/libvirt/bin:/home/jenkins/build/libvirt/bin:/usr/lib64/ccache:/usr/local/sbin:/usr/local/bin:/usr/sbin:/usr/bin:/home/jenkins/.local/bin:/home/jenkins/bin + python3 ./setup.py test running test /usr/bin/python3 sanitytest.py build/lib.linux-x86_64-3.6 /home/jenkins/build/libvirt/share/libvirt/api/libvirt-api.xml Traceback (most recent call last): File "/home/jenkins/build/libvirt/lib64/python2.7/site-packages/libvirt.py", line 24, in <module> import cygvirtmod as libvirtmod ModuleNotFoundError: No module named 'cygvirtmod' During handling of the above exception, another exception occurred: Traceback (most recent call last): File "sanitytest.py", line 11, in <module> import libvirt File "/home/jenkins/build/libvirt/lib64/python2.7/site-packages/libvirt.py", line 28, in <module> raise lib_e File "/home/jenkins/build/libvirt/lib64/python2.7/site-packages/libvirt.py", line 20, in <module> import libvirtmod ImportError: dynamic module does not define module export function (PyInit_libvirtmod) error: command '/usr/bin/python3' failed with exit status 1 Build step 'Execute shell' marked build as failure
1 2
0 0
[Libvirt-ci] Build failed in Jenkins: libvirt-python-master-py3-check » libvirt-freebsd-10 #1
by ci@centos.org 16 Feb '18

16 Feb '18
See <https://ci.centos.org/job/libvirt-python-master-py3-check/systems=libvirt-f…> ------------------------------------------ Started by upstream project "libvirt-python-master-py3-check" build number 1 originally caused by: Started by upstream project "libvirt-python-master-py3-build" build number 1 originally caused by: Started by an SCM change [EnvInject] - Loading node environment variables. Building remotely on libvirt-freebsd-10 (libvirt) in workspace <https://ci.centos.org/job/libvirt-python-master-py3-check/systems=libvirt-f…> [libvirt-python-master] $ /bin/sh -xe /tmp/jenkins5976771266941427713.sh + MAKE=make + uname + unamestr=FreeBSD + [ FreeBSD = FreeBSD ] + MAKE=gmake + export PATH=/home/jenkins/build/libvirt/bin:/home/jenkins/build/libvirt/bin:/home/jenkins/build/libvirt/bin:/home/jenkins/build/libvirt/bin:/sbin:/bin:/usr/sbin:/usr/bin:/usr/games:/usr/local/sbin:/usr/local/bin:/home/jenkins/bin + python3 ./setup.py test running test /usr/local/bin/python3 sanitytest.py build/lib.freebsd-10.4-RELEASE-amd64-3.6 /home/jenkins/build/libvirt/share/libvirt/api/libvirt-api.xml Traceback (most recent call last): File "/home/jenkins/build/libvirt/lib/python2.7/site-packages/libvirt.py", line 24, in <module> import cygvirtmod as libvirtmod ModuleNotFoundError: No module named 'cygvirtmod' During handling of the above exception, another exception occurred: Traceback (most recent call last): File "sanitytest.py", line 11, in <module> import libvirt File "/home/jenkins/build/libvirt/lib/python2.7/site-packages/libvirt.py", line 28, in <module> raise lib_e File "/home/jenkins/build/libvirt/lib/python2.7/site-packages/libvirt.py", line 20, in <module> import libvirtmod ImportError: dynamic module does not define module export function (PyInit_libvirtmod) error: command '/usr/local/bin/python3' failed with exit status 1 Build step 'Execute shell' marked build as failure
1 2
0 0
[Libvirt-ci] Build failed in Jenkins: libvirt-python-master-py3-check » libvirt-freebsd-11 #1
by ci@centos.org 16 Feb '18

16 Feb '18
See <https://ci.centos.org/job/libvirt-python-master-py3-check/systems=libvirt-f…> ------------------------------------------ Started by upstream project "libvirt-python-master-py3-check" build number 1 originally caused by: Started by upstream project "libvirt-python-master-py3-build" build number 1 originally caused by: Started by an SCM change [EnvInject] - Loading node environment variables. Building remotely on libvirt-freebsd-11 (libvirt) in workspace <https://ci.centos.org/job/libvirt-python-master-py3-check/systems=libvirt-f…> [libvirt-python-master] $ /bin/sh -xe /tmp/jenkins120359976762450322.sh + MAKE=make + uname + unamestr=FreeBSD + [ FreeBSD '=' FreeBSD ] + MAKE=gmake + export 'PATH=/home/jenkins/build/libvirt/bin:/home/jenkins/build/libvirt/bin:/home/jenkins/build/libvirt/bin:/home/jenkins/build/libvirt/bin:/sbin:/bin:/usr/sbin:/usr/bin:/usr/local/sbin:/usr/local/bin:/home/jenkins/bin' + python3 ./setup.py test running test /usr/local/bin/python3 sanitytest.py build/lib.freebsd-11.1-RELEASE-amd64-3.6 /home/jenkins/build/libvirt/share/libvirt/api/libvirt-api.xml Traceback (most recent call last): File "/home/jenkins/build/libvirt/lib/python2.7/site-packages/libvirt.py", line 24, in <module> import cygvirtmod as libvirtmod ModuleNotFoundError: No module named 'cygvirtmod' During handling of the above exception, another exception occurred: Traceback (most recent call last): File "sanitytest.py", line 11, in <module> import libvirt File "/home/jenkins/build/libvirt/lib/python2.7/site-packages/libvirt.py", line 28, in <module> raise lib_e File "/home/jenkins/build/libvirt/lib/python2.7/site-packages/libvirt.py", line 20, in <module> import libvirtmod ImportError: dynamic module does not define module export function (PyInit_libvirtmod) error: command '/usr/local/bin/python3' failed with exit status 1 Build step 'Execute shell' marked build as failure
1 2
0 0
[Libvirt-ci] Build failed in Jenkins: libvirt-python-master-py3-check » libvirt-fedora-26 #1
by ci@centos.org 16 Feb '18

16 Feb '18
See <https://ci.centos.org/job/libvirt-python-master-py3-check/systems=libvirt-f…> ------------------------------------------ Started by upstream project "libvirt-python-master-py3-check" build number 1 originally caused by: Started by upstream project "libvirt-python-master-py3-build" build number 1 originally caused by: Started by an SCM change [EnvInject] - Loading node environment variables. Building remotely on libvirt-fedora-26 (libvirt) in workspace <https://ci.centos.org/job/libvirt-python-master-py3-check/systems=libvirt-f…> [libvirt-python-master] $ /bin/sh -xe /tmp/jenkins5150365744467936008.sh + MAKE=make ++ uname + unamestr=Linux + '[' Linux = FreeBSD ']' + export PATH=/home/jenkins/build/libvirt/bin:/home/jenkins/build/libvirt/bin:/home/jenkins/build/libvirt/bin:/home/jenkins/build/libvirt/bin:/usr/lib64/ccache:/usr/local/sbin:/usr/local/bin:/usr/sbin:/usr/bin:/home/jenkins/.local/bin:/home/jenkins/bin + PATH=/home/jenkins/build/libvirt/bin:/home/jenkins/build/libvirt/bin:/home/jenkins/build/libvirt/bin:/home/jenkins/build/libvirt/bin:/usr/lib64/ccache:/usr/local/sbin:/usr/local/bin:/usr/sbin:/usr/bin:/home/jenkins/.local/bin:/home/jenkins/bin + python3 ./setup.py test running test /usr/bin/python3 sanitytest.py build/lib.linux-x86_64-3.6 /home/jenkins/build/libvirt/share/libvirt/api/libvirt-api.xml Traceback (most recent call last): File "/home/jenkins/build/libvirt/lib64/python2.7/site-packages/libvirt.py", line 24, in <module> import cygvirtmod as libvirtmod ModuleNotFoundError: No module named 'cygvirtmod' During handling of the above exception, another exception occurred: Traceback (most recent call last): File "sanitytest.py", line 11, in <module> import libvirt File "/home/jenkins/build/libvirt/lib64/python2.7/site-packages/libvirt.py", line 28, in <module> raise lib_e File "/home/jenkins/build/libvirt/lib64/python2.7/site-packages/libvirt.py", line 20, in <module> import libvirtmod ImportError: dynamic module does not define module export function (PyInit_libvirtmod) error: command '/usr/bin/python3' failed with exit status 1 Build step 'Execute shell' marked build as failure
1 2
0 0
[Libvirt-ci] Build failed in Jenkins: libvirt-python-master-py3-check » libvirt-fedora-27 #1
by ci@centos.org 16 Feb '18

16 Feb '18
See <https://ci.centos.org/job/libvirt-python-master-py3-check/systems=libvirt-f…> ------------------------------------------ Started by upstream project "libvirt-python-master-py3-check" build number 1 originally caused by: Started by upstream project "libvirt-python-master-py3-build" build number 1 originally caused by: Started by an SCM change [EnvInject] - Loading node environment variables. Building remotely on libvirt-fedora-27 (libvirt) in workspace <https://ci.centos.org/job/libvirt-python-master-py3-check/systems=libvirt-f…> [libvirt-python-master] $ /bin/sh -xe /tmp/jenkins56633790172310467.sh + MAKE=make ++ uname + unamestr=Linux + '[' Linux = FreeBSD ']' + export PATH=/home/jenkins/build/libvirt/bin:/home/jenkins/build/libvirt/bin:/home/jenkins/build/libvirt/bin:/home/jenkins/build/libvirt/bin:/usr/lib64/ccache:/usr/local/sbin:/usr/local/bin:/usr/sbin:/usr/bin:/home/jenkins/.local/bin:/home/jenkins/bin + PATH=/home/jenkins/build/libvirt/bin:/home/jenkins/build/libvirt/bin:/home/jenkins/build/libvirt/bin:/home/jenkins/build/libvirt/bin:/usr/lib64/ccache:/usr/local/sbin:/usr/local/bin:/usr/sbin:/usr/bin:/home/jenkins/.local/bin:/home/jenkins/bin + python3 ./setup.py test running test /usr/bin/python3 sanitytest.py build/lib.linux-x86_64-3.6 /home/jenkins/build/libvirt/share/libvirt/api/libvirt-api.xml Traceback (most recent call last): File "/home/jenkins/build/libvirt/lib64/python2.7/site-packages/libvirt.py", line 24, in <module> import cygvirtmod as libvirtmod ModuleNotFoundError: No module named 'cygvirtmod' During handling of the above exception, another exception occurred: Traceback (most recent call last): File "sanitytest.py", line 11, in <module> import libvirt File "/home/jenkins/build/libvirt/lib64/python2.7/site-packages/libvirt.py", line 28, in <module> raise lib_e File "/home/jenkins/build/libvirt/lib64/python2.7/site-packages/libvirt.py", line 20, in <module> import libvirtmod ImportError: dynamic module does not define module export function (PyInit_libvirtmod) error: command '/usr/bin/python3' failed with exit status 1 Build step 'Execute shell' marked build as failure
1 2
0 0
[Libvirt-ci] Build failed in Jenkins: libvirt-python-master-py3-check » libvirt-debian-9 #1
by ci@centos.org 16 Feb '18

16 Feb '18
See <https://ci.centos.org/job/libvirt-python-master-py3-check/systems=libvirt-d…> ------------------------------------------ Started by upstream project "libvirt-python-master-py3-check" build number 1 originally caused by: Started by upstream project "libvirt-python-master-py3-build" build number 1 originally caused by: Started by an SCM change [EnvInject] - Loading node environment variables. Building remotely on libvirt-debian-9 (libvirt) in workspace <https://ci.centos.org/job/libvirt-python-master-py3-check/systems=libvirt-d…> [libvirt-python-master] $ /bin/sh -xe /tmp/jenkins3243846676249006898.sh + MAKE=make + uname + unamestr=Linux + [ Linux = FreeBSD ] + export PATH=/home/jenkins/build/libvirt/bin:/home/jenkins/build/libvirt/bin:/home/jenkins/build/libvirt/bin:/home/jenkins/build/libvirt/bin:/usr/local/bin:/usr/bin:/bin:/usr/local/games:/usr/games + python3 ./setup.py test running test /usr/bin/python3 sanitytest.py build/lib.linux-x86_64-3.5 /home/jenkins/build/libvirt/share/libvirt/api/libvirt-api.xml Traceback (most recent call last): File "/home/jenkins/build/libvirt/lib/python2.7/site-packages/libvirt.py", line 24, in <module> import cygvirtmod as libvirtmod ImportError: No module named 'cygvirtmod' During handling of the above exception, another exception occurred: Traceback (most recent call last): File "sanitytest.py", line 11, in <module> import libvirt File "/home/jenkins/build/libvirt/lib/python2.7/site-packages/libvirt.py", line 28, in <module> raise lib_e File "/home/jenkins/build/libvirt/lib/python2.7/site-packages/libvirt.py", line 20, in <module> import libvirtmod ImportError: /home/jenkins/build/libvirt/lib/python2.7/site-packages/libvirtmod.so: undefined symbol: _Py_ZeroStruct error: command '/usr/bin/python3' failed with exit status 1 Build step 'Execute shell' marked build as failure
1 2
0 0
[Libvirt-ci] Build failed in Jenkins: libvirt-python-master-py3-check » libvirt-debian-8 #1
by ci@centos.org 16 Feb '18

16 Feb '18
See <https://ci.centos.org/job/libvirt-python-master-py3-check/systems=libvirt-d…> ------------------------------------------ Started by upstream project "libvirt-python-master-py3-check" build number 1 originally caused by: Started by upstream project "libvirt-python-master-py3-build" build number 1 originally caused by: Started by an SCM change [EnvInject] - Loading node environment variables. Building remotely on libvirt-debian-8 (libvirt) in workspace <https://ci.centos.org/job/libvirt-python-master-py3-check/systems=libvirt-d…> [libvirt-python-master] $ /bin/sh -xe /tmp/jenkins504756205264958299.sh + MAKE=make + uname + unamestr=Linux + [ Linux = FreeBSD ] + export PATH=/home/jenkins/build/libvirt/bin:/home/jenkins/build/libvirt/bin:/home/jenkins/build/libvirt/bin:/home/jenkins/build/libvirt/bin:/usr/local/bin:/usr/bin:/bin:/usr/local/games:/usr/games + python3 ./setup.py test running test /usr/bin/python3 sanitytest.py build/lib.linux-x86_64-3.4 /home/jenkins/build/libvirt/share/libvirt/api/libvirt-api.xml Traceback (most recent call last): File "/home/jenkins/build/libvirt/lib/python2.7/site-packages/libvirt.py", line 24, in <module> import cygvirtmod as libvirtmod ImportError: No module named 'cygvirtmod' During handling of the above exception, another exception occurred: Traceback (most recent call last): File "sanitytest.py", line 11, in <module> import libvirt File "/home/jenkins/build/libvirt/lib/python2.7/site-packages/libvirt.py", line 28, in <module> raise lib_e File "/home/jenkins/build/libvirt/lib/python2.7/site-packages/libvirt.py", line 20, in <module> import libvirtmod ImportError: /home/jenkins/build/libvirt/lib/python2.7/site-packages/libvirtmod.so: undefined symbol: _Py_ZeroStruct error: command '/usr/bin/python3' failed with exit status 1 Build step 'Execute shell' marked build as failure
1 2
0 0
[Libvirt-ci] Errored: libvirt/libvirt#911 (v3.7-maint - 979a7b3)
by Travis CI 14 Feb '18

14 Feb '18
Build Update for libvirt/libvirt ------------------------------------- Build: #911 Status: Errored Duration: 10 minutes and 27 seconds Commit: 979a7b3 (v3.7-maint) Author: Michal Privoznik Message: qemuDomainAttachDeviceMknodHelper: Remove symlink before creating it https://bugzilla.redhat.com/show_bug.cgi?id=1528502 So imagine you have /dev/blah symlink which points to /dev/sda. You attach /dev/blah as disk to your domain. Libvirt correctly creates the /dev/blah -> /dev/sda symlink in the qemu namespace. However, then you detach the disk, change the symlink so that it points to /dev/sdb and tries to attach the disk again. This time, however, the attach fails (well, qemu attaches wrong disk) because the code assumes that symlinks don't change. Well they do. This is inspired by test fix written by Eduardo Habkost. Signed-off-by: Michal Privoznik <mprivozn(a)redhat.com> Reviewed-by: Andrea Bolognani <abologna(a)redhat.com> (cherry picked from commit db98e7f67ea0d7699410f514f01947cef5128a6c) View the changeset: https://github.com/libvirt/libvirt/compare/290886b16c22...979a7b3feba1 View the full build log and details: https://travis-ci.org/libvirt/libvirt/builds/341094230?utm_source=email&utm… -- You can configure recipients for build notifications in your .travis.yml file. See https://docs.travis-ci.com/user/notifications
1 0
0 0
[Libvirt-ci] Errored: libvirt/libvirt#910 (master - 6fc33b6)
by Travis CI 14 Feb '18

14 Feb '18
Build Update for libvirt/libvirt ------------------------------------- Build: #910 Status: Errored Duration: 8 minutes and 52 seconds Commit: 6fc33b6 (master) Author: Bjoern Walk Message: tests: run virshtest independent of current pwd virshtest execves the virsh binary. Make sure that it finds the binary's location independent of the current working directory by specifying the absolute path as determined by the build environment. Reviewed-by: Marc Hartmayer <mhartmay(a)linux.vnet.ibm.com> Reviewed-by: Boris Fiuczynski <fiuczy(a)linux.vnet.ibm.com> Signed-off-by: Bjoern Walk <bwalk(a)linux.vnet.ibm.com> View the changeset: https://github.com/libvirt/libvirt/compare/e6f36ae43544...6fc33b6f37af View the full build log and details: https://travis-ci.org/libvirt/libvirt/builds/341004984?utm_source=email&utm… -- You can configure recipients for build notifications in your .travis.yml file. See https://docs.travis-ci.com/user/notifications
1 0
0 0
  • ← Newer
  • 1
  • ...
  • 944
  • 945
  • 946
  • 947
  • 948
  • 949
  • 950
  • ...
  • 1022
  • Older →

HyperKitty Powered by HyperKitty version 1.3.12.