libvirt List Archives
Sign In Sign Up
Manage this list Sign In Sign Up

Keyboard Shortcuts

Thread View

  • j: Next unread message
  • k: Previous unread message
  • j a: Jump to all threads
  • j l: Jump to MailingList overview

CI

Thread Start a new thread
Download
Threads by month
  • ----- 2026 -----
  • September
  • August
  • July
  • June
  • May
  • April
  • March
  • February
  • January
  • ----- 2025 -----
  • December
  • November
  • October
  • September
  • August
  • July
  • June
  • May
  • April
  • March
  • February
  • January
  • ----- 2024 -----
  • December
  • November
  • October
  • September
  • August
  • July
  • June
  • May
  • April
  • March
  • February
  • January
  • ----- 2023 -----
  • December
  • November
  • October
  • September
  • August
  • July
  • June
  • May
  • April
  • March
  • February
  • January
  • ----- 2022 -----
  • December
  • November
  • October
  • September
  • August
  • July
  • June
  • May
  • April
  • March
  • February
  • January
  • ----- 2021 -----
  • December
  • November
  • October
  • September
  • August
  • July
  • June
  • May
  • April
  • March
  • February
  • January
  • ----- 2020 -----
  • December
  • November
  • October
  • September
  • August
  • July
  • June
  • May
  • April
  • March
  • February
  • January
  • ----- 2019 -----
  • December
  • November
  • October
  • September
  • August
  • July
  • June
  • May
  • April
  • March
  • February
  • January
  • ----- 2018 -----
  • December
  • November
  • October
  • September
  • August
  • July
  • June
  • May
  • April
  • March
  • February
  • January
  • ----- 2017 -----
  • December
  • November
  • October
  • September
  • August
  • July
  • June
  • May
  • April
  • March
  • February
  • January
  • ----- 2016 -----
  • December
  • November
  • October
  • September
  • August
  • July
ci@lists.libvirt.org

  • 2 participants
  • 10211 discussions
[Libvirt-ci] Build failed in Jenkins: libvirt-go-master-check » libvirt-fedora-rawhide #1189
by ci@centos.org 18 Jul '18

18 Jul '18
See <https://ci.centos.org/job/libvirt-go-master-check/systems=libvirt-fedora-ra…> ------------------------------------------ Started by upstream project "libvirt-go-master-check" build number 1189 originally caused by: Started by upstream project "libvirt-go-master-build" build number 1201 originally caused by: Started by upstream project "libvirt-master-build" build number 1600 originally caused by: Started by an SCM change [EnvInject] - Loading node environment variables. Building remotely on libvirt-fedora-rawhide (libvirt) in workspace <https://ci.centos.org/job/libvirt-go-master-check/systems=libvirt-fedora-ra…> [libvirt-go-master] $ /bin/sh -xe /tmp/jenkins6502635157729547054.sh + export 'TEST_ARGS=-tags api' + TEST_ARGS='-tags api' + go test -tags api Missing enum 'VIR_DOMAIN_MEMORY_STAT_DISK_CACHES' --- FAIL: TestAPICoverage (1.00s) panic: Missing symbols found [recovered] panic: Missing symbols found goroutine 19 [running]: testing.tRunner.func1(0xc0000c4100) /usr/lib/golang/src/testing/testing.go:792 +0x387 panic(0x5b6d00, 0x6248e0) /usr/lib/golang/src/runtime/panic.go:494 +0x1b9 _<https://ci.centos.org/job/libvirt-go-master-check/systems=libvirt-fedora-ra…> <https://ci.centos.org/job/libvirt-go-master-check/systems=libvirt-fedora-ra…>:506 +0x554 testing.tRunner(0xc0000c4100, 0x605c18) /usr/lib/golang/src/testing/testing.go:827 +0xbf created by testing.(*T).Run /usr/lib/golang/src/testing/testing.go:878 +0x353 exit status 2 FAIL _<https://ci.centos.org/job/libvirt-go-master-check/systems=libvirt-fedora-ra…> 1.195s Build step 'Execute shell' marked build as failure
1 8
0 0
[Libvirt-ci] Build failed in Jenkins: libvirt-go-master-check » libvirt-fedora-28 #1189
by ci@centos.org 18 Jul '18

18 Jul '18
See <https://ci.centos.org/job/libvirt-go-master-check/systems=libvirt-fedora-28…> ------------------------------------------ Started by upstream project "libvirt-go-master-check" build number 1189 originally caused by: Started by upstream project "libvirt-go-master-build" build number 1201 originally caused by: Started by upstream project "libvirt-master-build" build number 1600 originally caused by: Started by an SCM change [EnvInject] - Loading node environment variables. Building remotely on libvirt-fedora-28 (libvirt) in workspace <https://ci.centos.org/job/libvirt-go-master-check/systems=libvirt-fedora-28…> [libvirt-go-master] $ /bin/sh -xe /tmp/jenkins1252634747492223869.sh + export 'TEST_ARGS=-tags api' + TEST_ARGS='-tags api' + go test -tags api Missing enum 'VIR_DOMAIN_MEMORY_STAT_DISK_CACHES' --- FAIL: TestAPICoverage (0.88s) panic: Missing symbols found [recovered] panic: Missing symbols found goroutine 5 [running]: testing.tRunner.func1(0xc4200aa0f0) /usr/lib/golang/src/testing/testing.go:742 +0x29d panic(0x5ae4e0, 0x6128d0) /usr/lib/golang/src/runtime/panic.go:502 +0x229 _<https://ci.centos.org/job/libvirt-go-master-check/systems=libvirt-fedora-28…> <https://ci.centos.org/job/libvirt-go-master-check/systems=libvirt-fedora-28…>:506 +0x548 testing.tRunner(0xc4200aa0f0, 0x5fd9a0) /usr/lib/golang/src/testing/testing.go:777 +0xd0 created by testing.(*T).Run /usr/lib/golang/src/testing/testing.go:824 +0x2e0 exit status 2 FAIL _<https://ci.centos.org/job/libvirt-go-master-check/systems=libvirt-fedora-28…> 1.232s Build step 'Execute shell' marked build as failure
1 8
0 0
[Libvirt-ci] Build failed in Jenkins: libvirt-go-master-check » libvirt-fedora-27 #1189
by ci@centos.org 18 Jul '18

18 Jul '18
See <https://ci.centos.org/job/libvirt-go-master-check/systems=libvirt-fedora-27…> ------------------------------------------ Started by upstream project "libvirt-go-master-check" build number 1189 originally caused by: Started by upstream project "libvirt-go-master-build" build number 1201 originally caused by: Started by upstream project "libvirt-master-build" build number 1600 originally caused by: Started by an SCM change [EnvInject] - Loading node environment variables. Building remotely on libvirt-fedora-27 (libvirt) in workspace <https://ci.centos.org/job/libvirt-go-master-check/systems=libvirt-fedora-27…> [libvirt-go-master] $ /bin/sh -xe /tmp/jenkins358994238204870706.sh + export 'TEST_ARGS=-tags api' + TEST_ARGS='-tags api' + go test -tags api Missing enum 'VIR_DOMAIN_MEMORY_STAT_DISK_CACHES' --- FAIL: TestAPICoverage (0.58s) panic: Missing symbols found [recovered] panic: Missing symbols found goroutine 5 [running]: testing.tRunner.func1(0xc4200980f0) /usr/lib/golang/src/testing/testing.go:711 +0x2d2 panic(0x5b6d40, 0x61b360) /usr/lib/golang/src/runtime/panic.go:491 +0x283 _<https://ci.centos.org/job/libvirt-go-master-check/systems=libvirt-fedora-27…> <https://ci.centos.org/job/libvirt-go-master-check/systems=libvirt-fedora-27…>:506 +0x5b1 testing.tRunner(0xc4200980f0, 0x605b90) /usr/lib/golang/src/testing/testing.go:746 +0xd0 created by testing.(*T).Run /usr/lib/golang/src/testing/testing.go:789 +0x2de exit status 2 FAIL _<https://ci.centos.org/job/libvirt-go-master-check/systems=libvirt-fedora-27…> 0.771s Build step 'Execute shell' marked build as failure
1 8
0 0
[Libvirt-ci] Build failed in Jenkins: libvirt-go-master-check » libvirt-freebsd-11 #1189
by ci@centos.org 18 Jul '18

18 Jul '18
See <https://ci.centos.org/job/libvirt-go-master-check/systems=libvirt-freebsd-1…> ------------------------------------------ Started by upstream project "libvirt-go-master-check" build number 1189 originally caused by: Started by upstream project "libvirt-go-master-build" build number 1201 originally caused by: Started by upstream project "libvirt-master-build" build number 1600 originally caused by: Started by an SCM change [EnvInject] - Loading node environment variables. Building remotely on libvirt-freebsd-11 (libvirt) in workspace <https://ci.centos.org/job/libvirt-go-master-check/systems=libvirt-freebsd-1…> [libvirt-go-master] $ /bin/sh -xe /tmp/jenkins7143006019386312134.sh + export 'TEST_ARGS=-tags api' + go test -tags api Missing enum 'VIR_DOMAIN_MEMORY_STAT_DISK_CACHES' --- FAIL: TestAPICoverage (0.52s) panic: Missing symbols found [recovered] panic: Missing symbols found goroutine 19 [running]: testing.tRunner.func1(0xc4200cc0f0) /usr/local/go/src/testing/testing.go:742 +0x29d panic(0x5ae8c0, 0x611b90) /usr/local/go/src/runtime/panic.go:502 +0x229 _/usr<https://ci.centos.org/job/libvirt-go-master-check/systems=libvirt-freebsd-1…> /usr<https://ci.centos.org/job/libvirt-go-master-check/systems=libvirt-freebsd-1…>:506 +0x548 testing.tRunner(0xc4200cc0f0, 0x5fcdf0) /usr/local/go/src/testing/testing.go:777 +0xd0 created by testing.(*T).Run /usr/local/go/src/testing/testing.go:824 +0x2e0 exit status 2 FAIL _/usr<https://ci.centos.org/job/libvirt-go-master-check/systems=libvirt-freebsd-1…> 0.598s Build step 'Execute shell' marked build as failure
1 8
0 0
[Libvirt-ci] Build failed in Jenkins: libvirt-go-master-check » libvirt-debian-9 #1189
by ci@centos.org 18 Jul '18

18 Jul '18
See <https://ci.centos.org/job/libvirt-go-master-check/systems=libvirt-debian-9/…> ------------------------------------------ Started by upstream project "libvirt-go-master-check" build number 1189 originally caused by: Started by upstream project "libvirt-go-master-build" build number 1201 originally caused by: Started by upstream project "libvirt-master-build" build number 1600 originally caused by: Started by an SCM change [EnvInject] - Loading node environment variables. Building remotely on libvirt-debian-9 (libvirt) in workspace <https://ci.centos.org/job/libvirt-go-master-check/systems=libvirt-debian-9/…> [libvirt-go-master] $ /bin/sh -xe /tmp/jenkins7317911596597294705.sh + export TEST_ARGS=-tags api + go test -tags api Missing enum 'VIR_DOMAIN_MEMORY_STAT_DISK_CACHES' --- FAIL: TestAPICoverage (1.05s) panic: Missing symbols found [recovered] panic: Missing symbols found goroutine 5 [running]: panic(0x555da15ab520, 0xc42010ec90) /usr/lib/go-1.7/src/runtime/panic.go:500 +0x1a1 testing.tRunner.func1(0xc42007a180) /usr/lib/go-1.7/src/testing/testing.go:579 +0x25d panic(0x555da15ab520, 0xc42010ec90) /usr/lib/go-1.7/src/runtime/panic.go:458 +0x243 _<https://ci.centos.org/job/libvirt-go-master-check/systems=libvirt-debian-9/…> <https://ci.centos.org/job/libvirt-go-master-check/systems=libvirt-debian-9/…>:506 +0x5ff testing.tRunner(0xc42007a180, 0x555da15fedc8) /usr/lib/go-1.7/src/testing/testing.go:610 +0x81 created by testing.(*T).Run /usr/lib/go-1.7/src/testing/testing.go:646 +0x2ec exit status 2 FAIL _<https://ci.centos.org/job/libvirt-go-master-check/systems=libvirt-debian-9/…> 1.329s Build step 'Execute shell' marked build as failure
1 8
0 0
[Libvirt-ci] Build failed in Jenkins: libvirt-go-master-check » libvirt-centos-7 #1189
by ci@centos.org 18 Jul '18

18 Jul '18
See <https://ci.centos.org/job/libvirt-go-master-check/systems=libvirt-centos-7/…> ------------------------------------------ Started by upstream project "libvirt-go-master-check" build number 1189 originally caused by: Started by upstream project "libvirt-go-master-build" build number 1201 originally caused by: Started by upstream project "libvirt-master-build" build number 1600 originally caused by: Started by an SCM change [EnvInject] - Loading node environment variables. Building remotely on libvirt-centos-7 (libvirt) in workspace <https://ci.centos.org/job/libvirt-go-master-check/systems=libvirt-centos-7/…> [libvirt-go-master] $ /bin/sh -xe /tmp/jenkins7212727454942725471.sh + export 'TEST_ARGS=-tags api' + TEST_ARGS='-tags api' + go test -tags api Missing enum 'VIR_DOMAIN_MEMORY_STAT_DISK_CACHES' --- FAIL: TestAPICoverage (0.37s) panic: Missing symbols found [recovered] panic: Missing symbols found goroutine 19 [running]: testing.tRunner.func1(0xc4200ae0f0) /usr/lib/golang/src/testing/testing.go:711 +0x2d2 panic(0x5b6e00, 0x61b420) /usr/lib/golang/src/runtime/panic.go:491 +0x283 _<https://ci.centos.org/job/libvirt-go-master-check/systems=libvirt-centos-7/…> <https://ci.centos.org/job/libvirt-go-master-check/systems=libvirt-centos-7/…>:506 +0x5b1 testing.tRunner(0xc4200ae0f0, 0x605c50) /usr/lib/golang/src/testing/testing.go:746 +0xd0 created by testing.(*T).Run /usr/lib/golang/src/testing/testing.go:789 +0x2de exit status 2 FAIL _<https://ci.centos.org/job/libvirt-go-master-check/systems=libvirt-centos-7/…> 0.473s Build step 'Execute shell' marked build as failure
1 8
0 0
[Libvirt-ci] Build failed in Jenkins: libvirt-go-master-check » libvirt-debian-8 #1189
by ci@centos.org 18 Jul '18

18 Jul '18
See <https://ci.centos.org/job/libvirt-go-master-check/systems=libvirt-debian-8/…> ------------------------------------------ Started by upstream project "libvirt-go-master-check" build number 1189 originally caused by: Started by upstream project "libvirt-go-master-build" build number 1201 originally caused by: Started by upstream project "libvirt-master-build" build number 1600 originally caused by: Started by an SCM change [EnvInject] - Loading node environment variables. Building remotely on libvirt-debian-8 (libvirt) in workspace <https://ci.centos.org/job/libvirt-go-master-check/systems=libvirt-debian-8/…> [libvirt-go-master] $ /bin/sh -xe /tmp/jenkins1158957575625066664.sh + export TEST_ARGS=-tags api + go test -tags api Missing enum 'VIR_DOMAIN_MEMORY_STAT_DISK_CACHES' --- FAIL: TestAPICoverage (0.51 seconds) panic: Missing symbols found [recovered] panic: Missing symbols found goroutine 20 [running]: runtime.panic(0x5ea400, 0xc2080f0470) /usr/lib/go/src/pkg/runtime/panic.c:279 +0xf5 testing.func·006() /usr/lib/go/src/pkg/testing/testing.go:416 +0x176 runtime.panic(0x5ea400, 0xc2080f0470) /usr/lib/go/src/pkg/runtime/panic.c:248 +0x18d _<https://ci.centos.org/job/libvirt-go-master-check/systems=libvirt-debian-8/…> <https://ci.centos.org/job/libvirt-go-master-check/systems=libvirt-debian-8/…>:506 +0x515 testing.tRunner(0xc208026090, 0xa09600) /usr/lib/go/src/pkg/testing/testing.go:422 +0x8b created by testing.RunTests /usr/lib/go/src/pkg/testing/testing.go:504 +0x8db goroutine 16 [chan receive]: testing.RunTests(0x715760, 0xa09600, 0x77, 0x77, 0x41ce01) /usr/lib/go/src/pkg/testing/testing.go:505 +0x923 testing.Main(0x715760, 0xa09600, 0x77, 0x77, 0xa1ca00, 0x0, 0x0, 0xa1ca00, 0x0, 0x0) /usr/lib/go/src/pkg/testing/testing.go:435 +0x84 main.main() _<https://ci.centos.org/job/libvirt-go-master-check/systems=libvirt-debian-8/…>:283 +0x9c goroutine 19 [finalizer wait]: runtime.park(0x42c2c0, 0xa18950, 0xa081c9) /usr/lib/go/src/pkg/runtime/proc.c:1369 +0x89 runtime.parkunlock(0xa18950, 0xa081c9) /usr/lib/go/src/pkg/runtime/proc.c:1385 +0x3b runfinq() /usr/lib/go/src/pkg/runtime/mgc0.c:2644 +0xcf runtime.goexit() /usr/lib/go/src/pkg/runtime/proc.c:1445 goroutine 17 [syscall]: runtime.goexit() /usr/lib/go/src/pkg/runtime/proc.c:1445 exit status 2 FAIL _<https://ci.centos.org/job/libvirt-go-master-check/systems=libvirt-debian-8/…> 0.573s Build step 'Execute shell' marked build as failure
1 8
0 0
[Libvirt-ci] Build failed in Jenkins: libvirt-dbus-master-check » libvirt-fedora-rawhide #278
by ci@centos.org 18 Jul '18

18 Jul '18
See <https://ci.centos.org/job/libvirt-dbus-master-check/systems=libvirt-fedora-…> ------------------------------------------ [...truncated 9.68 KB...] method=method) # Add the arguments to the function try: message.append(signature=signature, *args) except Exception as e: logging.basicConfig() _logger.error('Unable to set arguments %r according to ' 'signature %r: %s: %s', args, signature, e.__class__, e) raise # make a blocking call reply_message = self.send_message_with_reply_and_block( > message, timeout) E dbus.exceptions.DBusException: org.libvirt.Error: internal error: domain 'test' not running /usr/lib64/python3.6/site-packages/dbus/connection.py:651: DBusException --------------------------- Captured stderr teardown --------------------------- Disconnected from D-Bus. ___________________________ TestDomain.test_shutdown ___________________________ self = <test_domain.TestDomain object at 0x7fe19e345748> def test_shutdown(self): def domain_stopped(path, event, detail): if event != libvirttest.DomainEvent.STOPPED: return assert detail == libvirttest.DomainEventStoppedDetailType.SHUTDOWN assert isinstance(path, dbus.ObjectPath) self.loop.quit() self.connect.connect_to_signal('DomainEvent', domain_stopped) obj, domain = self.get_test_domain() > domain.Shutdown(0) ../../tests/test_domain.py:106: _ _ _ _ _ _ _ _ _ _ _ _ _ _ _ _ _ _ _ _ _ _ _ _ _ _ _ _ _ _ _ _ _ _ _ _ _ _ _ _ /usr/lib64/python3.6/site-packages/dbus/proxies.py:70: in __call__ return self._proxy_method(*args, **keywords) /usr/lib64/python3.6/site-packages/dbus/proxies.py:145: in __call__ **keywords) _ _ _ _ _ _ _ _ _ _ _ _ _ _ _ _ _ _ _ _ _ _ _ _ _ _ _ _ _ _ _ _ _ _ _ _ _ _ _ _ self = <dbus._dbus.SessionBus (session) at 0x7fe19e35c570> bus_name = dbus.String(':1.1') object_path = dbus.ObjectPath('/org/libvirt/Test/domain/_6695eb01_f6a4_8304_79aa_97f2502e193f') dbus_interface = 'org.libvirt.Domain', method = 'Shutdown', signature = 'u' args = (0,), timeout = -1.0, byte_arrays = False, kwargs = {} get_args_opts = {'byte_arrays': False} message = <dbus.lowlevel.MethodCallMessage path: /org/libvirt/Test/domain/_6695eb01_f6a4_8304_79aa_97f2502e193f, iface: org.libvirt.Domain, member: Shutdown dest: :1.1> def call_blocking(self, bus_name, object_path, dbus_interface, method, signature, args, timeout=-1.0, byte_arrays=False, **kwargs): """Call the given method, synchronously. :Since: 0.81.0 """ if object_path == LOCAL_PATH: raise DBusException('Methods may not be called on the reserved ' 'path %s' % LOCAL_PATH) if dbus_interface == LOCAL_IFACE: raise DBusException('Methods may not be called on the reserved ' 'interface %s' % LOCAL_IFACE) # no need to validate other args - MethodCallMessage ctor will do get_args_opts = dict(byte_arrays=byte_arrays) if is_py2: get_args_opts['utf8_strings'] = kwargs.get('utf8_strings', False) elif 'utf8_strings' in kwargs: raise TypeError("unexpected keyword argument 'utf8_strings'") message = MethodCallMessage(destination=bus_name, path=object_path, interface=dbus_interface, method=method) # Add the arguments to the function try: message.append(signature=signature, *args) except Exception as e: logging.basicConfig() _logger.error('Unable to set arguments %r according to ' 'signature %r: %s: %s', args, signature, e.__class__, e) raise # make a blocking call reply_message = self.send_message_with_reply_and_block( > message, timeout) E dbus.exceptions.DBusException: org.libvirt.Error: internal error: domain 'test' not running /usr/lib64/python3.6/site-packages/dbus/connection.py:651: DBusException --------------------------- Captured stderr teardown --------------------------- Disconnected from D-Bus. ___________________________ TestDomain.test_suspend ____________________________ self = <test_domain.TestDomain object at 0x7fe19e07cfd0> def test_suspend(self): def domain_suspended(path, event, detail): if event != libvirttest.DomainEvent.SUSPENDED: return assert detail == libvirttest.DomainEventSuspendedDetailType.PAUSED assert isinstance(path, dbus.ObjectPath) self.loop.quit() self.connect.connect_to_signal('DomainEvent', domain_suspended) obj, domain = self.get_test_domain() > domain.Suspend() ../../tests/test_domain.py:124: _ _ _ _ _ _ _ _ _ _ _ _ _ _ _ _ _ _ _ _ _ _ _ _ _ _ _ _ _ _ _ _ _ _ _ _ _ _ _ _ /usr/lib64/python3.6/site-packages/dbus/proxies.py:70: in __call__ return self._proxy_method(*args, **keywords) /usr/lib64/python3.6/site-packages/dbus/proxies.py:145: in __call__ **keywords) _ _ _ _ _ _ _ _ _ _ _ _ _ _ _ _ _ _ _ _ _ _ _ _ _ _ _ _ _ _ _ _ _ _ _ _ _ _ _ _ self = <dbus._dbus.SessionBus (session) at 0x7fe19e35c570> bus_name = dbus.String(':1.1') object_path = dbus.ObjectPath('/org/libvirt/Test/domain/_6695eb01_f6a4_8304_79aa_97f2502e193f') dbus_interface = 'org.libvirt.Domain', method = 'Suspend', signature = '' args = (), timeout = -1.0, byte_arrays = False, kwargs = {} get_args_opts = {'byte_arrays': False} message = <dbus.lowlevel.MethodCallMessage path: /org/libvirt/Test/domain/_6695eb01_f6a4_8304_79aa_97f2502e193f, iface: org.libvirt.Domain, member: Suspend dest: :1.1> def call_blocking(self, bus_name, object_path, dbus_interface, method, signature, args, timeout=-1.0, byte_arrays=False, **kwargs): """Call the given method, synchronously. :Since: 0.81.0 """ if object_path == LOCAL_PATH: raise DBusException('Methods may not be called on the reserved ' 'path %s' % LOCAL_PATH) if dbus_interface == LOCAL_IFACE: raise DBusException('Methods may not be called on the reserved ' 'interface %s' % LOCAL_IFACE) # no need to validate other args - MethodCallMessage ctor will do get_args_opts = dict(byte_arrays=byte_arrays) if is_py2: get_args_opts['utf8_strings'] = kwargs.get('utf8_strings', False) elif 'utf8_strings' in kwargs: raise TypeError("unexpected keyword argument 'utf8_strings'") message = MethodCallMessage(destination=bus_name, path=object_path, interface=dbus_interface, method=method) # Add the arguments to the function try: message.append(signature=signature, *args) except Exception as e: logging.basicConfig() _logger.error('Unable to set arguments %r according to ' 'signature %r: %s: %s', args, signature, e.__class__, e) raise # make a blocking call reply_message = self.send_message_with_reply_and_block( > message, timeout) E dbus.exceptions.DBusException: org.libvirt.Error: internal error: domain 'test' not running /usr/lib64/python3.6/site-packages/dbus/connection.py:651: DBusException --------------------------- Captured stderr teardown --------------------------- Disconnected from D-Bus. ___________________________ TestDomain.test_undefine ___________________________ self = <test_domain.TestDomain object at 0x7fe19e0d3da0> def test_undefine(self): def domain_undefined(path, event, detail): if event != libvirttest.DomainEvent.UNDEFINED: return assert detail == libvirttest.DomainEventUndefinedDetailType.REMOVED assert isinstance(path, dbus.ObjectPath) self.loop.quit() self.connect.connect_to_signal('DomainEvent', domain_undefined) _, domain = self.get_test_domain() > domain.Shutdown(0) ../../tests/test_domain.py:142: _ _ _ _ _ _ _ _ _ _ _ _ _ _ _ _ _ _ _ _ _ _ _ _ _ _ _ _ _ _ _ _ _ _ _ _ _ _ _ _ /usr/lib64/python3.6/site-packages/dbus/proxies.py:70: in __call__ return self._proxy_method(*args, **keywords) /usr/lib64/python3.6/site-packages/dbus/proxies.py:145: in __call__ **keywords) _ _ _ _ _ _ _ _ _ _ _ _ _ _ _ _ _ _ _ _ _ _ _ _ _ _ _ _ _ _ _ _ _ _ _ _ _ _ _ _ self = <dbus._dbus.SessionBus (session) at 0x7fe19e35c570> bus_name = dbus.String(':1.1') object_path = dbus.ObjectPath('/org/libvirt/Test/domain/_6695eb01_f6a4_8304_79aa_97f2502e193f') dbus_interface = 'org.libvirt.Domain', method = 'Shutdown', signature = 'u' args = (0,), timeout = -1.0, byte_arrays = False, kwargs = {} get_args_opts = {'byte_arrays': False} message = <dbus.lowlevel.MethodCallMessage path: /org/libvirt/Test/domain/_6695eb01_f6a4_8304_79aa_97f2502e193f, iface: org.libvirt.Domain, member: Shutdown dest: :1.1> def call_blocking(self, bus_name, object_path, dbus_interface, method, signature, args, timeout=-1.0, byte_arrays=False, **kwargs): """Call the given method, synchronously. :Since: 0.81.0 """ if object_path == LOCAL_PATH: raise DBusException('Methods may not be called on the reserved ' 'path %s' % LOCAL_PATH) if dbus_interface == LOCAL_IFACE: raise DBusException('Methods may not be called on the reserved ' 'interface %s' % LOCAL_IFACE) # no need to validate other args - MethodCallMessage ctor will do get_args_opts = dict(byte_arrays=byte_arrays) if is_py2: get_args_opts['utf8_strings'] = kwargs.get('utf8_strings', False) elif 'utf8_strings' in kwargs: raise TypeError("unexpected keyword argument 'utf8_strings'") message = MethodCallMessage(destination=bus_name, path=object_path, interface=dbus_interface, method=method) # Add the arguments to the function try: message.append(signature=signature, *args) except Exception as e: logging.basicConfig() _logger.error('Unable to set arguments %r according to ' 'signature %r: %s: %s', args, signature, e.__class__, e) raise # make a blocking call reply_message = self.send_message_with_reply_and_block( > message, timeout) E dbus.exceptions.DBusException: org.libvirt.Error: internal error: domain 'test' not running /usr/lib64/python3.6/site-packages/dbus/connection.py:651: DBusException --------------------------- Captured stderr teardown --------------------------- Disconnected from D-Bus. ================= 4 failed, 5 passed, 1 error in 6.60 seconds ================== FAIL test_domain.py (exit status: 1) + exit 1 Build step 'Execute shell' marked build as failure
1 1
0 0
[Libvirt-ci] Build failed in Jenkins: libosinfo-master-check » libvirt-freebsd-10 #139
by ci@centos.org 18 Jul '18

18 Jul '18
See <https://ci.centos.org/job/libosinfo-master-check/systems=libvirt-freebsd-10…> ------------------------------------------ Started by upstream project "libosinfo-master-check" build number 139 originally caused by: Started by upstream project "libosinfo-master-syntax-check" build number 143 originally caused by: Started by upstream project "libosinfo-master-build" build number 163 originally caused by: Started by an SCM change [EnvInject] - Loading node environment variables. Building remotely on libvirt-freebsd-10 (libvirt) in workspace <https://ci.centos.org/job/libosinfo-master-check/systems=libvirt-freebsd-10…> [libosinfo-master] $ /bin/sh -xe /tmp/jenkins6021331599083032445.sh + cd build + /usr/local/bin/gmake check GEN public-submodule-commit Making check in osinfo gmake[1]: Entering directory '/usr<https://ci.centos.org/job/libosinfo-master-check/systems=libvirt-freebsd-10…'> /usr/local/bin/gmake check-am gmake[2]: Entering directory '/usr<https://ci.centos.org/job/libosinfo-master-check/systems=libvirt-freebsd-10…'> /usr/local/bin/gmake check-local gmake[3]: Entering directory '/usr<https://ci.centos.org/job/libosinfo-master-check/systems=libvirt-freebsd-10…'> GEN check-symsorting gmake[3]: Leaving directory '/usr<https://ci.centos.org/job/libosinfo-master-check/systems=libvirt-freebsd-10…'> gmake[2]: Leaving directory '/usr<https://ci.centos.org/job/libosinfo-master-check/systems=libvirt-freebsd-10…'> gmake[1]: Leaving directory '/usr<https://ci.centos.org/job/libosinfo-master-check/systems=libvirt-freebsd-10…'> Making check in tools gmake[1]: Entering directory '/usr<https://ci.centos.org/job/libosinfo-master-check/systems=libvirt-freebsd-10…'> gmake[1]: Nothing to be done for 'check'. gmake[1]: Leaving directory '/usr<https://ci.centos.org/job/libosinfo-master-check/systems=libvirt-freebsd-10…'> Making check in docs gmake[1]: Entering directory '/usr<https://ci.centos.org/job/libosinfo-master-check/systems=libvirt-freebsd-10…'> Making check in reference gmake[2]: Entering directory '/usr<https://ci.centos.org/job/libosinfo-master-check/systems=libvirt-freebsd-10…'> gmake[2]: Nothing to be done for 'check'. gmake[2]: Leaving directory '/usr<https://ci.centos.org/job/libosinfo-master-check/systems=libvirt-freebsd-10…'> gmake[2]: Entering directory '/usr<https://ci.centos.org/job/libosinfo-master-check/systems=libvirt-freebsd-10…'> gmake[2]: Nothing to be done for 'check-am'. gmake[2]: Leaving directory '/usr<https://ci.centos.org/job/libosinfo-master-check/systems=libvirt-freebsd-10…'> gmake[1]: Leaving directory '/usr<https://ci.centos.org/job/libosinfo-master-check/systems=libvirt-freebsd-10…'> Making check in po gmake[1]: Entering directory '/usr<https://ci.centos.org/job/libosinfo-master-check/systems=libvirt-freebsd-10…'> INTLTOOL_EXTRACT="/usr/local/bin/intltool-extract" XGETTEXT="/usr/local/bin/xgettext" srcdir=../../po /usr/local/bin/intltool-update --gettext-package libosinfo --pot rm -f missing notexist srcdir=../../po /usr/local/bin/intltool-update -m if [ -r missing -o -r notexist ]; then \ exit 1; \ fi gmake[1]: Leaving directory '/usr<https://ci.centos.org/job/libosinfo-master-check/systems=libvirt-freebsd-10…'> Making check in examples gmake[1]: Entering directory '/usr<https://ci.centos.org/job/libosinfo-master-check/systems=libvirt-freebsd-10…'> gmake[1]: Nothing to be done for 'check'. gmake[1]: Leaving directory '/usr<https://ci.centos.org/job/libosinfo-master-check/systems=libvirt-freebsd-10…'> Making check in tests gmake[1]: Entering directory '/usr<https://ci.centos.org/job/libosinfo-master-check/systems=libvirt-freebsd-10…'> /usr/local/bin/gmake test-entity test-device test-list test-devicelist test-filter test-product test-os test-oslist test-productfilter test-platform test-platformlist test-db test-loader test-isodetect test-install-script test-os-resources test-mediauris test-treeuris gmake[2]: Entering directory '/usr<https://ci.centos.org/job/libosinfo-master-check/systems=libvirt-freebsd-10…'> CC test_entity-test-entity.o CC test_device-test-device.o CC test_list-test-list.o CC test_devicelist-test-devicelist.o CC test_filter-test-filter.o CC test_product-test-product.o CC test_os-test-os.o CC test_oslist-test-oslist.o CC test_platform-test-platform.o CC test_productfilter-test-productfilter.o CC test_platformlist-test-platformlist.o CC test_db-test-db.o CC test_loader-test-loader.o CC test_isodetect-test-isodetect.o CC test_install_script-test-install-script.o CC test_os_resources-test-os-resources.o CC test_mediauris-test-mediauris.o CC test_treeuris-test-treeuris.o CCLD test-entity CCLD test-device CCLD test-list CCLD test-devicelist CCLD test-filter CCLD test-product CCLD test-os CCLD test-oslist CCLD test-productfilter CCLD test-platform CCLD test-platformlist CCLD test-db CCLD test-loader CCLD test-isodetect CCLD test-install-script CCLD test-os-resources CCLD test-mediauris CCLD test-treeuris gmake[2]: Leaving directory '/usr<https://ci.centos.org/job/libosinfo-master-check/systems=libvirt-freebsd-10…'> /usr/local/bin/gmake check-TESTS gmake[2]: Entering directory '/usr<https://ci.centos.org/job/libosinfo-master-check/systems=libvirt-freebsd-10…'> gmake[3]: Entering directory '/usr<https://ci.centos.org/job/libosinfo-master-check/systems=libvirt-freebsd-10…'> PASS: test-entity PASS: test-list PASS: test-device PASS: test-product PASS: test-filter PASS: test-devicelist PASS: test-productfilter PASS: test-oslist PASS: test-platformlist PASS: test-platform PASS: test-os PASS: test-db PASS: test-install-script PASS: test-loader PASS: test-os-resources SKIP: test-treeuris SKIP: test-mediauris Trace/BPT trap (core dumped) FAIL: test-isodetect ============================================================================ Testsuite summary for libosinfo 1.3.0 ============================================================================ # TOTAL: 18 # PASS: 15 # SKIP: 2 # XFAIL: 0 # FAIL: 1 # XPASS: 0 # ERROR: 0 ============================================================================ See tests/test-suite.log Please report to libosinfo(a)redhat.com ============================================================================ gmake[3]: *** [Makefile:1313: test-suite.log] Error 1 gmake[3]: Leaving directory '/usr<https://ci.centos.org/job/libosinfo-master-check/systems=libvirt-freebsd-10…'> gmake[2]: *** [Makefile:1421: check-TESTS] Error 2 gmake[2]: Leaving directory '/usr<https://ci.centos.org/job/libosinfo-master-check/systems=libvirt-freebsd-10…'> gmake[1]: *** [Makefile:1614: check-am] Error 2 gmake[1]: Leaving directory '/usr<https://ci.centos.org/job/libosinfo-master-check/systems=libvirt-freebsd-10…'> gmake: *** [Makefile:594: check-recursive] Error 1 + cat tests/test-suite.log =========================================== libosinfo 1.3.0: tests/test-suite.log =========================================== # TOTAL: 18 # PASS: 15 # SKIP: 2 # XFAIL: 0 # FAIL: 1 # XPASS: 0 # ERROR: 0 .. contents:: :depth: 2 FAIL: test-isodetect ==================== /isodetect/windows: OK /isodetect/ubuntu: OK /isodetect/sles: OK /isodetect/sled: OK /isodetect/rhel: OK /isodetect/popos: OK /isodetect/opensuse: OK /isodetect/openbsd: OK /isodetect/netbsd: OK /isodetect/mageia: OK /isodetect/gnome: OK /isodetect/freedos: OK /isodetect/freebsd: OK /isodetect/fedora: OK /isodetect/debian: OK /isodetect/centos: OK /isodetect/asianux: OK /isodetect/altlinux: OK /isodetect/alpinelinux: ** (/usr<https://ci.centos.org/job/libosinfo-master-check/systems=libvirt-freebsd-10…>:55965): ERROR **: ISO alpine-standard-3.8.0-ppc64le.iso.txt was not matched by OS alpinelinux3.8 FAIL test-isodetect (exit status: 133) SKIP: test-mediauris ==================== SKIP test-mediauris (exit status: 77) SKIP: test-treeuris =================== SKIP test-treeuris (exit status: 77) + exit 1 Build step 'Execute shell' marked build as failure
1 1
0 0
[Libvirt-ci] Build failed in Jenkins: libosinfo-master-check » libvirt-freebsd-11 #139
by ci@centos.org 18 Jul '18

18 Jul '18
See <https://ci.centos.org/job/libosinfo-master-check/systems=libvirt-freebsd-11…> ------------------------------------------ Started by upstream project "libosinfo-master-check" build number 139 originally caused by: Started by upstream project "libosinfo-master-syntax-check" build number 143 originally caused by: Started by upstream project "libosinfo-master-build" build number 163 originally caused by: Started by an SCM change [EnvInject] - Loading node environment variables. Building remotely on libvirt-freebsd-11 (libvirt) in workspace <https://ci.centos.org/job/libosinfo-master-check/systems=libvirt-freebsd-11…> [libosinfo-master] $ /bin/sh -xe /tmp/jenkins8090648805020584102.sh + cd build + /usr/local/bin/gmake check Making check in osinfo GEN public-submodule-commit gmake[1]: Entering directory '/usr<https://ci.centos.org/job/libosinfo-master-check/systems=libvirt-freebsd-11…'> /usr/local/bin/gmake check-am gmake[2]: Entering directory '/usr<https://ci.centos.org/job/libosinfo-master-check/systems=libvirt-freebsd-11…'> /usr/local/bin/gmake check-local gmake[3]: Entering directory '/usr<https://ci.centos.org/job/libosinfo-master-check/systems=libvirt-freebsd-11…'> GEN check-symsorting gmake[3]: Leaving directory '/usr<https://ci.centos.org/job/libosinfo-master-check/systems=libvirt-freebsd-11…'> gmake[2]: Leaving directory '/usr<https://ci.centos.org/job/libosinfo-master-check/systems=libvirt-freebsd-11…'> gmake[1]: Leaving directory '/usr<https://ci.centos.org/job/libosinfo-master-check/systems=libvirt-freebsd-11…'> Making check in tools gmake[1]: Entering directory '/usr<https://ci.centos.org/job/libosinfo-master-check/systems=libvirt-freebsd-11…'> gmake[1]: Nothing to be done for 'check'. gmake[1]: Leaving directory '/usr<https://ci.centos.org/job/libosinfo-master-check/systems=libvirt-freebsd-11…'> Making check in docs gmake[1]: Entering directory '/usr<https://ci.centos.org/job/libosinfo-master-check/systems=libvirt-freebsd-11…'> Making check in reference gmake[2]: Entering directory '/usr<https://ci.centos.org/job/libosinfo-master-check/systems=libvirt-freebsd-11…'> gmake[2]: Nothing to be done for 'check'. gmake[2]: Leaving directory '/usr<https://ci.centos.org/job/libosinfo-master-check/systems=libvirt-freebsd-11…'> gmake[2]: Entering directory '/usr<https://ci.centos.org/job/libosinfo-master-check/systems=libvirt-freebsd-11…'> gmake[2]: Nothing to be done for 'check-am'. gmake[2]: Leaving directory '/usr<https://ci.centos.org/job/libosinfo-master-check/systems=libvirt-freebsd-11…'> gmake[1]: Leaving directory '/usr<https://ci.centos.org/job/libosinfo-master-check/systems=libvirt-freebsd-11…'> Making check in po gmake[1]: Entering directory '/usr<https://ci.centos.org/job/libosinfo-master-check/systems=libvirt-freebsd-11…'> INTLTOOL_EXTRACT="/usr/local/bin/intltool-extract" XGETTEXT="/usr/local/bin/xgettext" srcdir=../../po /usr/local/bin/intltool-update --gettext-package libosinfo --pot rm -f missing notexist srcdir=../../po /usr/local/bin/intltool-update -m if [ -r missing -o -r notexist ]; then \ exit 1; \ fi gmake[1]: Leaving directory '/usr<https://ci.centos.org/job/libosinfo-master-check/systems=libvirt-freebsd-11…'> Making check in examples gmake[1]: Entering directory '/usr<https://ci.centos.org/job/libosinfo-master-check/systems=libvirt-freebsd-11…'> gmake[1]: Nothing to be done for 'check'. gmake[1]: Leaving directory '/usr<https://ci.centos.org/job/libosinfo-master-check/systems=libvirt-freebsd-11…'> Making check in tests gmake[1]: Entering directory '/usr<https://ci.centos.org/job/libosinfo-master-check/systems=libvirt-freebsd-11…'> /usr/local/bin/gmake test-entity test-device test-list test-devicelist test-filter test-product test-os test-oslist test-productfilter test-platform test-platformlist test-db test-loader test-isodetect test-install-script test-os-resources test-mediauris test-treeuris gmake[2]: Entering directory '/usr<https://ci.centos.org/job/libosinfo-master-check/systems=libvirt-freebsd-11…'> CC test_entity-test-entity.o CC test_device-test-device.o CC test_list-test-list.o CC test_devicelist-test-devicelist.o CC test_filter-test-filter.o CC test_product-test-product.o CC test_os-test-os.o CC test_oslist-test-oslist.o CC test_productfilter-test-productfilter.o CC test_platform-test-platform.o CC test_platformlist-test-platformlist.o CC test_db-test-db.o CC test_loader-test-loader.o CC test_isodetect-test-isodetect.o CC test_install_script-test-install-script.o CC test_os_resources-test-os-resources.o CC test_mediauris-test-mediauris.o CC test_treeuris-test-treeuris.o CCLD test-entity CCLD test-list CCLD test-device CCLD test-devicelist CCLD test-filter CCLD test-product CCLD test-os CCLD test-oslist CCLD test-productfilter CCLD test-platform CCLD test-platformlist CCLD test-db CCLD test-loader CCLD test-isodetect CCLD test-install-script CCLD test-os-resources CCLD test-mediauris CCLD test-treeuris gmake[2]: Leaving directory '/usr<https://ci.centos.org/job/libosinfo-master-check/systems=libvirt-freebsd-11…'> /usr/local/bin/gmake check-TESTS gmake[2]: Entering directory '/usr<https://ci.centos.org/job/libosinfo-master-check/systems=libvirt-freebsd-11…'> gmake[3]: Entering directory '/usr<https://ci.centos.org/job/libosinfo-master-check/systems=libvirt-freebsd-11…'> PASS: test-device PASS: test-entity PASS: test-list PASS: test-devicelist PASS: test-filter PASS: test-product PASS: test-oslist PASS: test-os PASS: test-productfilter PASS: test-platform PASS: test-db PASS: test-platformlist PASS: test-install-script PASS: test-os-resources PASS: test-loader SKIP: test-treeuris SKIP: test-mediauris Trace/BPT trap (core dumped) FAIL: test-isodetect ============================================================================ Testsuite summary for libosinfo 1.3.0 ============================================================================ # TOTAL: 18 # PASS: 15 # SKIP: 2 # XFAIL: 0 # FAIL: 1 # XPASS: 0 # ERROR: 0 ============================================================================ See tests/test-suite.log Please report to libosinfo(a)redhat.com ============================================================================ gmake[3]: *** [Makefile:1313: test-suite.log] Error 1 gmake[3]: Leaving directory '/usr<https://ci.centos.org/job/libosinfo-master-check/systems=libvirt-freebsd-11…'> gmake[2]: *** [Makefile:1421: check-TESTS] Error 2 gmake[2]: Leaving directory '/usr<https://ci.centos.org/job/libosinfo-master-check/systems=libvirt-freebsd-11…'> gmake[1]: *** [Makefile:1614: check-am] Error 2 gmake[1]: Leaving directory '/usr<https://ci.centos.org/job/libosinfo-master-check/systems=libvirt-freebsd-11…'> gmake: *** [Makefile:594: check-recursive] Error 1 + cat tests/test-suite.log =========================================== libosinfo 1.3.0: tests/test-suite.log =========================================== # TOTAL: 18 # PASS: 15 # SKIP: 2 # XFAIL: 0 # FAIL: 1 # XPASS: 0 # ERROR: 0 .. contents:: :depth: 2 FAIL: test-isodetect ==================== /isodetect/windows: OK /isodetect/ubuntu: OK /isodetect/sles: OK /isodetect/sled: OK /isodetect/rhel: OK /isodetect/popos: OK /isodetect/opensuse: OK /isodetect/openbsd: OK /isodetect/netbsd: OK /isodetect/mageia: OK /isodetect/gnome: OK /isodetect/freedos: OK /isodetect/freebsd: OK /isodetect/fedora: OK /isodetect/debian: OK /isodetect/centos: OK /isodetect/asianux: OK /isodetect/altlinux: OK /isodetect/alpinelinux: ** (/usr<https://ci.centos.org/job/libosinfo-master-check/systems=libvirt-freebsd-11…>:80092): ERROR **: ISO alpine-standard-3.8.0-ppc64le.iso.txt was not matched by OS alpinelinux3.8 FAIL test-isodetect (exit status: 133) SKIP: test-mediauris ==================== SKIP test-mediauris (exit status: 77) SKIP: test-treeuris =================== SKIP test-treeuris (exit status: 77) + exit 1 Build step 'Execute shell' marked build as failure
1 1
0 0
  • ← Newer
  • 1
  • ...
  • 865
  • 866
  • 867
  • 868
  • 869
  • 870
  • 871
  • ...
  • 1022
  • Older →

HyperKitty Powered by HyperKitty version 1.3.12.