libvirt List Archives
Sign In Sign Up
Manage this list Sign In Sign Up

Keyboard Shortcuts

Thread View

  • j: Next unread message
  • k: Previous unread message
  • j a: Jump to all threads
  • j l: Jump to MailingList overview

CI

Thread Start a new thread
Download
Threads by month
  • ----- 2026 -----
  • September
  • August
  • July
  • June
  • May
  • April
  • March
  • February
  • January
  • ----- 2025 -----
  • December
  • November
  • October
  • September
  • August
  • July
  • June
  • May
  • April
  • March
  • February
  • January
  • ----- 2024 -----
  • December
  • November
  • October
  • September
  • August
  • July
  • June
  • May
  • April
  • March
  • February
  • January
  • ----- 2023 -----
  • December
  • November
  • October
  • September
  • August
  • July
  • June
  • May
  • April
  • March
  • February
  • January
  • ----- 2022 -----
  • December
  • November
  • October
  • September
  • August
  • July
  • June
  • May
  • April
  • March
  • February
  • January
  • ----- 2021 -----
  • December
  • November
  • October
  • September
  • August
  • July
  • June
  • May
  • April
  • March
  • February
  • January
  • ----- 2020 -----
  • December
  • November
  • October
  • September
  • August
  • July
  • June
  • May
  • April
  • March
  • February
  • January
  • ----- 2019 -----
  • December
  • November
  • October
  • September
  • August
  • July
  • June
  • May
  • April
  • March
  • February
  • January
  • ----- 2018 -----
  • December
  • November
  • October
  • September
  • August
  • July
  • June
  • May
  • April
  • March
  • February
  • January
  • ----- 2017 -----
  • December
  • November
  • October
  • September
  • August
  • July
  • June
  • May
  • April
  • March
  • February
  • January
  • ----- 2016 -----
  • December
  • November
  • October
  • September
  • August
  • July
ci@lists.libvirt.org

  • 2 participants
  • 10211 discussions
[Libvirt-ci] Build failed in Jenkins: libvirt-go-xml-master-check » libvirt-fedora-27 #550
by ci@centos.org 18 Jul '18

18 Jul '18
See <https://ci.centos.org/job/libvirt-go-xml-master-check/systems=libvirt-fedor…> ------------------------------------------ Started by upstream project "libvirt-go-xml-master-check" build number 550 originally caused by: Started by upstream project "libvirt-go-xml-master-build" build number 559 originally caused by: Started by upstream project "libvirt-master-build" build number 1609 originally caused by: Started by an SCM change Started by an SCM change [EnvInject] - Loading node environment variables. Building remotely on libvirt-fedora-27 (libvirt) in workspace <https://ci.centos.org/job/libvirt-go-xml-master-check/systems=libvirt-fedor…> [libvirt-go-xml-master] $ /bin/sh -xe /tmp/jenkins2392555238106461182.sh + export 'TEST_ARGS=-tags xmlroundtrip' + TEST_ARGS='-tags xmlroundtrip' + go test -tags xmlroundtrip --- FAIL: TestRoundTrip (19.46s) xml_test.go:374: Cannot parse file testdata/libvirt/tests/qemuxml2argvdata/graphics-egl-headless.xml: xml: (*libvirtxml.DomainGraphic).UnmarshalXML did not consume entire <graphics> element FAIL exit status 1 FAIL _<https://ci.centos.org/job/libvirt-go-xml-master-check/systems=libvirt-fedor…> 19.646s Build step 'Execute shell' marked build as failure
1 1
0 0
[Libvirt-ci] Build failed in Jenkins: libvirt-go-xml-master-check » libvirt-fedora-rawhide #550
by ci@centos.org 18 Jul '18

18 Jul '18
See <https://ci.centos.org/job/libvirt-go-xml-master-check/systems=libvirt-fedor…> ------------------------------------------ Started by upstream project "libvirt-go-xml-master-check" build number 550 originally caused by: Started by upstream project "libvirt-go-xml-master-build" build number 559 originally caused by: Started by upstream project "libvirt-master-build" build number 1609 originally caused by: Started by an SCM change Started by an SCM change [EnvInject] - Loading node environment variables. Building remotely on libvirt-fedora-rawhide (libvirt) in workspace <https://ci.centos.org/job/libvirt-go-xml-master-check/systems=libvirt-fedor…> [libvirt-go-xml-master] $ /bin/sh -xe /tmp/jenkins4070903283142112389.sh + export 'TEST_ARGS=-tags xmlroundtrip' + TEST_ARGS='-tags xmlroundtrip' + go test -tags xmlroundtrip --- FAIL: TestRoundTrip (26.22s) xml_test.go:374: Cannot parse file testdata/libvirt/tests/qemuxml2argvdata/graphics-egl-headless.xml: xml: (*libvirtxml.DomainGraphic).UnmarshalXML did not consume entire <graphics> element FAIL exit status 1 FAIL _<https://ci.centos.org/job/libvirt-go-xml-master-check/systems=libvirt-fedor…> 26.442s Build step 'Execute shell' marked build as failure
1 1
0 0
[Libvirt-ci] Build failed in Jenkins: libvirt-go-xml-master-check » libvirt-fedora-28 #550
by ci@centos.org 18 Jul '18

18 Jul '18
See <https://ci.centos.org/job/libvirt-go-xml-master-check/systems=libvirt-fedor…> ------------------------------------------ Started by upstream project "libvirt-go-xml-master-check" build number 550 originally caused by: Started by upstream project "libvirt-go-xml-master-build" build number 559 originally caused by: Started by upstream project "libvirt-master-build" build number 1609 originally caused by: Started by an SCM change Started by an SCM change [EnvInject] - Loading node environment variables. Building remotely on libvirt-fedora-28 (libvirt) in workspace <https://ci.centos.org/job/libvirt-go-xml-master-check/systems=libvirt-fedor…> [libvirt-go-xml-master] $ /bin/sh -xe /tmp/jenkins3983752247762160114.sh + export 'TEST_ARGS=-tags xmlroundtrip' + TEST_ARGS='-tags xmlroundtrip' + go test -tags xmlroundtrip --- FAIL: TestRoundTrip (24.09s) xml_test.go:374: Cannot parse file testdata/libvirt/tests/qemuxml2argvdata/graphics-egl-headless.xml: xml: (*libvirtxml.DomainGraphic).UnmarshalXML did not consume entire <graphics> element FAIL exit status 1 FAIL _<https://ci.centos.org/job/libvirt-go-xml-master-check/systems=libvirt-fedor…> 24.323s Build step 'Execute shell' marked build as failure
1 1
0 0
[Libvirt-ci] Build failed in Jenkins: libvirt-go-xml-master-check » libvirt-debian-9 #550
by ci@centos.org 18 Jul '18

18 Jul '18
See <https://ci.centos.org/job/libvirt-go-xml-master-check/systems=libvirt-debia…> ------------------------------------------ Started by upstream project "libvirt-go-xml-master-check" build number 550 originally caused by: Started by upstream project "libvirt-go-xml-master-build" build number 559 originally caused by: Started by upstream project "libvirt-master-build" build number 1609 originally caused by: Started by an SCM change Started by an SCM change [EnvInject] - Loading node environment variables. Building remotely on libvirt-debian-9 (libvirt) in workspace <https://ci.centos.org/job/libvirt-go-xml-master-check/systems=libvirt-debia…> [libvirt-go-xml-master] $ /bin/sh -xe /tmp/jenkins4427174418497125052.sh + export TEST_ARGS=-tags xmlroundtrip + go test -tags xmlroundtrip --- FAIL: TestRoundTrip (22.41s) xml_test.go:374: Cannot parse file testdata/libvirt/tests/qemuxml2argvdata/graphics-egl-headless.xml: xml: (*libvirtxml.DomainGraphic).UnmarshalXML did not consume entire <graphics> element FAIL exit status 1 FAIL _<https://ci.centos.org/job/libvirt-go-xml-master-check/systems=libvirt-debia…> 22.608s Build step 'Execute shell' marked build as failure
1 1
0 0
[Libvirt-ci] Build failed in Jenkins: libvirt-go-xml-master-check » libvirt-freebsd-11 #550
by ci@centos.org 18 Jul '18

18 Jul '18
See <https://ci.centos.org/job/libvirt-go-xml-master-check/systems=libvirt-freeb…> ------------------------------------------ Started by upstream project "libvirt-go-xml-master-check" build number 550 originally caused by: Started by upstream project "libvirt-go-xml-master-build" build number 559 originally caused by: Started by upstream project "libvirt-master-build" build number 1609 originally caused by: Started by an SCM change Started by an SCM change [EnvInject] - Loading node environment variables. Building remotely on libvirt-freebsd-11 (libvirt) in workspace <https://ci.centos.org/job/libvirt-go-xml-master-check/systems=libvirt-freeb…> [libvirt-go-xml-master] $ /bin/sh -xe /tmp/jenkins1244225620431457938.sh + export 'TEST_ARGS=-tags xmlroundtrip' + go test -tags xmlroundtrip --- FAIL: TestRoundTrip (9.61s) xml_test.go:374: Cannot parse file testdata/libvirt/tests/qemuxml2argvdata/graphics-egl-headless.xml: xml: (*libvirtxml.DomainGraphic).UnmarshalXML did not consume entire <graphics> element FAIL exit status 1 FAIL _/usr<https://ci.centos.org/job/libvirt-go-xml-master-check/systems=libvirt-freeb…> 9.810s Build step 'Execute shell' marked build as failure
1 1
0 0
[Libvirt-ci] Build failed in Jenkins: libvirt-go-xml-master-check » libvirt-centos-7 #550
by ci@centos.org 18 Jul '18

18 Jul '18
See <https://ci.centos.org/job/libvirt-go-xml-master-check/systems=libvirt-cento…> ------------------------------------------ Started by upstream project "libvirt-go-xml-master-check" build number 550 originally caused by: Started by upstream project "libvirt-go-xml-master-build" build number 559 originally caused by: Started by upstream project "libvirt-master-build" build number 1609 originally caused by: Started by an SCM change Started by an SCM change [EnvInject] - Loading node environment variables. Building remotely on libvirt-centos-7 (libvirt) in workspace <https://ci.centos.org/job/libvirt-go-xml-master-check/systems=libvirt-cento…> [libvirt-go-xml-master] $ /bin/sh -xe /tmp/jenkins7032194964473799454.sh + export 'TEST_ARGS=-tags xmlroundtrip' + TEST_ARGS='-tags xmlroundtrip' + go test -tags xmlroundtrip --- FAIL: TestRoundTrip (32.57s) xml_test.go:374: Cannot parse file testdata/libvirt/tests/qemuxml2argvdata/graphics-egl-headless.xml: xml: (*libvirtxml.DomainGraphic).UnmarshalXML did not consume entire <graphics> element FAIL exit status 1 FAIL _<https://ci.centos.org/job/libvirt-go-xml-master-check/systems=libvirt-cento…> 32.808s Build step 'Execute shell' marked build as failure
1 1
0 0
[Libvirt-ci] Build failed in Jenkins: libvirt-go-xml-master-check » libvirt-debian-8 #550
by ci@centos.org 18 Jul '18

18 Jul '18
See <https://ci.centos.org/job/libvirt-go-xml-master-check/systems=libvirt-debia…> ------------------------------------------ Started by upstream project "libvirt-go-xml-master-check" build number 550 originally caused by: Started by upstream project "libvirt-go-xml-master-build" build number 559 originally caused by: Started by upstream project "libvirt-master-build" build number 1609 originally caused by: Started by an SCM change Started by an SCM change [EnvInject] - Loading node environment variables. Building remotely on libvirt-debian-8 (libvirt) in workspace <https://ci.centos.org/job/libvirt-go-xml-master-check/systems=libvirt-debia…> [libvirt-go-xml-master] $ /bin/sh -xe /tmp/jenkins8224596908515034643.sh + export TEST_ARGS=-tags xmlroundtrip + go test -tags xmlroundtrip --- FAIL: TestRoundTrip (10.99 seconds) xml_test.go:374: Cannot parse file testdata/libvirt/tests/qemuxml2argvdata/graphics-egl-headless.xml: xml: (*libvirtxml.DomainGraphic).UnmarshalXML did not consume entire <graphics> element FAIL exit status 1 FAIL _<https://ci.centos.org/job/libvirt-go-xml-master-check/systems=libvirt-debia…> 11.126s Build step 'Execute shell' marked build as failure
1 1
0 0
[Libvirt-ci] Broken: libvirt/libvirt#1484 (master - 2e79657)
by Travis CI 18 Jul '18

18 Jul '18
Build Update for libvirt/libvirt ------------------------------------- Build: #1484 Status: Broken Duration: 21 mins and 8 secs Commit: 2e79657 (master) Author: Erik Skultety Message: docs: news: Provide an update about the video type 'none' Reviewed-by: Ján Tomko <jtomko(a)redhat.com> Signed-off-by: Erik Skultety <eskultet(a)redhat.com> View the changeset: https://github.com/libvirt/libvirt/compare/4dd605400070...2e7965735a11 View the full build log and details: https://travis-ci.org/libvirt/libvirt/builds/405437198?utm_source=email&utm… -- You can configure recipients for build notifications in your .travis.yml file. See https://docs.travis-ci.com/user/notifications This email was sent to libvirt-ci(a)redhat.com (mailto:libvirt-ci@redhat.com) unsubscribe from this list (http://clicks.travis-ci.com/track/unsub.php?u=14313403&id=ff70550bd1cb433bb…)
1 0
0 0
[Libvirt-ci] Broken: libvirt/libvirt#1483 (master - 4dd6054)
by Travis CI 18 Jul '18

18 Jul '18
Build Update for libvirt/libvirt ------------------------------------- Build: #1483 Status: Broken Duration: 18 mins and 46 secs Commit: 4dd6054 (master) Author: Ján Tomko Message: m4: Introduce STABLE_ORDERING_JANSSON Add a second check for Jansson >= 2.8, which includes fixes to preserve ordering of object keys. Use this constant to guard tests that depend on stable ordering. Signed-off-by: Ján Tomko <jtomko(a)redhat.com> View the changeset: https://github.com/libvirt/libvirt/compare/17f50c82600c...4dd605400070 View the full build log and details: https://travis-ci.org/libvirt/libvirt/builds/405430654?utm_source=email&utm… -- You can configure recipients for build notifications in your .travis.yml file. See https://docs.travis-ci.com/user/notifications This email was sent to libvirt-ci(a)redhat.com (mailto:libvirt-ci@redhat.com) unsubscribe from this list (http://clicks.travis-ci.com/track/unsub.php?u=14313403&id=f0a57fba48604a5da…)
1 0
0 0
[Libvirt-ci] Build failed in Jenkins: libvirt-master-check » libvirt-freebsd-11 #1249
by ci@centos.org 18 Jul '18

18 Jul '18
See <https://ci.centos.org/job/libvirt-master-check/systems=libvirt-freebsd-11/1…> ------------------------------------------ [...truncated 23.96 KB...] PASS: sockettest SKIP: virhostcputest PASS: virbuftest PASS: seclabeltest PASS: virhashtest PASS: virconftest PASS: commandtest PASS: utiltest SKIP: shunloadtest PASS: virtimetest PASS: viruritest PASS: virkeyfiletest PASS: viralloctest PASS: virauthconfigtest PASS: virbitmaptest SKIP: vircgrouptest PASS: vircryptotest SKIP: virpcitest PASS: virendiantest PASS: viratomictest PASS: virfiletest PASS: virfilecachetest SKIP: virfirewalltest PASS: viriscsitest PASS: virkeycodetest PASS: virlockspacetest PASS: virlogtest PASS: virrotatingfiletest PASS: virstringtest SKIP: virportallocatortest PASS: sysinfotest SKIP: virkmodtest PASS: vircapstest PASS: domaincapstest PASS: domainconftest SKIP: virhostdevtest SKIP: virnetdevtest PASS: virtypedparamtest PASS: virnetmessagetest PASS: virschematest FAIL: virnetsockettest PASS: virnetdaemontest PASS: virnetserverclienttest SKIP: virnettlscontexttest SKIP: virnettlssessiontest PASS: fdstreamtest PASS: virdbustest SKIP: virsystemdtest PASS: virpolkittest PASS: qemuxml2argvtest PASS: qemuxml2xmltest PASS: qemuargv2xmltest PASS: domainsnapshotxml2xmltest PASS: qemumonitorjsontest PASS: qemuagenttest PASS: qemuhotplugtest PASS: qemucaps2xmltest PASS: qemumemlocktest PASS: qemucommandutiltest PASS: qemublocktest PASS: qemumigparamstest PASS: esxutilstest PASS: vboxsnapshotxmltest PASS: vmx2xmltest PASS: xml2vmxtest PASS: vmwarevertest PASS: qemucapabilitiestest PASS: bhyvexml2argvtest PASS: bhyvexml2xmltest PASS: bhyveargv2xmltest PASS: virjsontest PASS: networkxml2xmltest PASS: networkxml2conftest PASS: networkxml2xmlupdatetest SKIP: networkxml2firewalltest PASS: nwfilterxml2xmltest PASS: virnwfilterbindingxml2xmltest PASS: storagevolxml2argvtest PASS: virstorageutiltest PASS: nsstest PASS: nssguesttest PASS: storagevolxml2xmltest PASS: storagepoolxml2xmltest PASS: nodedevxml2xmltest PASS: interfacexml2xmltest PASS: metadatatest PASS: secretxml2xmltest PASS: genericxml2xmltest PASS: eventtest PASS: virdrivermoduletest PASS: objecteventtest PASS: virmacmaptest PASS: libvirtd-fail PASS: cputest PASS: libvirtd-pool PASS: virsh-cpuset PASS: virsh-define-dev-segfault PASS: virsh-int-overflow SKIP: virsh-optparse PASS: virsh-read-bufsiz PASS: virsh-read-non-seekable PASS: virsh-self-test PASS: virsh-schedinfo PASS: virt-admin-self-test PASS: virsh-start PASS: virsh-undefine PASS: virsh-uriprecedence PASS: virsh-vcpupin PASS: virshtest ============================================================================ Testsuite summary for libvirt 4.6.0 ============================================================================ # TOTAL: 109 # PASS: 94 # SKIP: 14 # XFAIL: 0 # FAIL: 1 # XPASS: 0 # ERROR: 0 ============================================================================ See tests/test-suite.log Please report to libvir-list(a)redhat.com ============================================================================ gmake[3]: *** [Makefile:5817: test-suite.log] Error 1 gmake[3]: Leaving directory '/usr<https://ci.centos.org/job/libvirt-master-check/systems=libvirt-freebsd-11/w…'> gmake[2]: *** [Makefile:5925: check-TESTS] Error 2 gmake[2]: Leaving directory '/usr<https://ci.centos.org/job/libvirt-master-check/systems=libvirt-freebsd-11/w…'> gmake[1]: *** [Makefile:6923: check-am] Error 2 gmake[1]: Leaving directory '/usr<https://ci.centos.org/job/libvirt-master-check/systems=libvirt-freebsd-11/w…'> gmake: *** [Makefile:2105: check-recursive] Error 1 + cat tests/test-suite.log ========================================= libvirt 4.6.0: tests/test-suite.log ========================================= # TOTAL: 109 # PASS: 94 # SKIP: 14 # XFAIL: 0 # FAIL: 1 # XPASS: 0 # ERROR: 0 .. contents:: :depth: 2 SKIP: virhostcputest ==================== SKIP virhostcputest (exit status: 77) SKIP: shunloadtest ================== SKIP shunloadtest (exit status: 77) SKIP: vircgrouptest =================== SKIP vircgrouptest (exit status: 77) SKIP: virpcitest ================ SKIP virpcitest (exit status: 77) SKIP: virfirewalltest ===================== SKIP virfirewalltest (exit status: 77) SKIP: virportallocatortest ========================== SKIP virportallocatortest (exit status: 77) SKIP: virkmodtest ================= SKIP virkmodtest (exit status: 77) SKIP: virhostdevtest ==================== SKIP virhostdevtest (exit status: 77) SKIP: virnetdevtest =================== SKIP virnetdevtest (exit status: 77) FAIL: virnetsockettest ====================== TEST: virnetsockettest 1) Socket TCP/IPv4 Accept ... libvirt: XML-RPC error : End of file while reading data: Input/output error OK 2) Socket TCP/IPv6 Accept ... libvirt: XML-RPC error : End of file while reading data: Input/output error OK 3) Socket TCP/IPv4+IPv6 Accept ... FAILED 4) Socket TCP/IPv4+IPv6 Accept ... libvirt: XML-RPC error : End of file while reading data: Input/output error OK 5) Socket UNIX Accept ... libvirt: XML-RPC error : Cannot write data: Broken pipe OK 6) Socket UNIX Addrs ... OK 7) Socket External Command /dev/zero ... OK 8) Socket External Command /dev/does-not-exist ... libvirt: XML-RPC error : End of file while reading data: cat: /dev/does-not-exist: No such file or directory: Input/output error OK 9) SSH test 1 ... OK 10) SSH test 2 ... OK 11) SSH test 3 ... OK 12) SSH test 4 ... libvirt: XML-RPC error : End of file while reading data: Cannot connect to host nosuchhost: Input/output error OK 13) SSH test 5 ... libvirt: XML-RPC error : End of file while reading data: : Input/output error OK 14) SSH test 6 ... OK 15) SSH test 7 ... OK FAIL virnetsockettest (exit status: 1) SKIP: virnettlscontexttest ========================== SKIP virnettlscontexttest (exit status: 77) SKIP: virnettlssessiontest ========================== SKIP virnettlssessiontest (exit status: 77) SKIP: virsystemdtest ==================== SKIP virsystemdtest (exit status: 77) SKIP: networkxml2firewalltest ============================= SKIP networkxml2firewalltest (exit status: 77) SKIP: virsh-optparse ==================== ../../tests/virsh-optparse: skipping test: This test is very expensive, so it is disabled by default. To run it anyway, rerun: make check VIR_TEST_EXPENSIVE=1 SKIP virsh-optparse (exit status: 77) + exit 1 Build step 'Execute shell' marked build as failure
1 1
0 0
  • ← Newer
  • 1
  • ...
  • 863
  • 864
  • 865
  • 866
  • 867
  • 868
  • 869
  • ...
  • 1022
  • Older →

HyperKitty Powered by HyperKitty version 1.3.12.