libvirt List Archives
Sign In Sign Up
Manage this list Sign In Sign Up

Keyboard Shortcuts

Thread View

  • j: Next unread message
  • k: Previous unread message
  • j a: Jump to all threads
  • j l: Jump to MailingList overview

CI

Thread Start a new thread
Download
Threads by month
  • ----- 2026 -----
  • September
  • August
  • July
  • June
  • May
  • April
  • March
  • February
  • January
  • ----- 2025 -----
  • December
  • November
  • October
  • September
  • August
  • July
  • June
  • May
  • April
  • March
  • February
  • January
  • ----- 2024 -----
  • December
  • November
  • October
  • September
  • August
  • July
  • June
  • May
  • April
  • March
  • February
  • January
  • ----- 2023 -----
  • December
  • November
  • October
  • September
  • August
  • July
  • June
  • May
  • April
  • March
  • February
  • January
  • ----- 2022 -----
  • December
  • November
  • October
  • September
  • August
  • July
  • June
  • May
  • April
  • March
  • February
  • January
  • ----- 2021 -----
  • December
  • November
  • October
  • September
  • August
  • July
  • June
  • May
  • April
  • March
  • February
  • January
  • ----- 2020 -----
  • December
  • November
  • October
  • September
  • August
  • July
  • June
  • May
  • April
  • March
  • February
  • January
  • ----- 2019 -----
  • December
  • November
  • October
  • September
  • August
  • July
  • June
  • May
  • April
  • March
  • February
  • January
  • ----- 2018 -----
  • December
  • November
  • October
  • September
  • August
  • July
  • June
  • May
  • April
  • March
  • February
  • January
  • ----- 2017 -----
  • December
  • November
  • October
  • September
  • August
  • July
  • June
  • May
  • April
  • March
  • February
  • January
  • ----- 2016 -----
  • December
  • November
  • October
  • September
  • August
  • July
ci@lists.libvirt.org

  • 2 participants
  • 10211 discussions
[Libvirt-ci] Build failed in Jenkins: libvirt-go-xml-master-check » libvirt-centos-7 #569
by ci@centos.org 25 Jul '18

25 Jul '18
See <https://ci.centos.org/job/libvirt-go-xml-master-check/systems=libvirt-cento…> ------------------------------------------ Started by upstream project "libvirt-go-xml-master-check" build number 569 originally caused by: Started by upstream project "libvirt-go-xml-master-build" build number 578 originally caused by: Started by upstream project "libvirt-master-build" build number 1628 originally caused by: Started by an SCM change [EnvInject] - Loading node environment variables. Building remotely on libvirt-centos-7 (libvirt) in workspace <https://ci.centos.org/job/libvirt-go-xml-master-check/systems=libvirt-cento…> [libvirt-go-xml-master] $ /bin/sh -xe /tmp/jenkins7360882528480645586.sh + export 'TEST_ARGS=-tags xmlroundtrip' + TEST_ARGS='-tags xmlroundtrip' + go test -tags xmlroundtrip *** Test killed: ran too long (10m0s). FAIL _<https://ci.centos.org/job/libvirt-go-xml-master-check/systems=libvirt-cento…> 605.057s Build step 'Execute shell' marked build as failure
1 1
0 0
[Libvirt-ci] Build failed in Jenkins: libvirt-master-check » libvirt-freebsd-10 #1266
by ci@centos.org 25 Jul '18

25 Jul '18
See <https://ci.centos.org/job/libvirt-master-check/systems=libvirt-freebsd-10/1…> ------------------------------------------ [...truncated 47.00 KB...] gmake[3]: Leaving directory '/usr<https://ci.centos.org/job/libvirt-master-check/systems=libvirt-freebsd-10/w…'> gmake[2]: Leaving directory '/usr<https://ci.centos.org/job/libvirt-master-check/systems=libvirt-freebsd-10/w…'> gmake[1]: Leaving directory '/usr<https://ci.centos.org/job/libvirt-master-check/systems=libvirt-freebsd-10/w…'> Making check in tests gmake[1]: Entering directory '/usr<https://ci.centos.org/job/libvirt-master-check/systems=libvirt-freebsd-10/w…'> /usr/local/bin/gmake gmake[2]: Entering directory '/usr<https://ci.centos.org/job/libvirt-master-check/systems=libvirt-freebsd-10/w…'> gmake[2]: Nothing to be done for 'all'. gmake[2]: Leaving directory '/usr<https://ci.centos.org/job/libvirt-master-check/systems=libvirt-freebsd-10/w…'> /usr/local/bin/gmake check-TESTS gmake[2]: Entering directory '/usr<https://ci.centos.org/job/libvirt-master-check/systems=libvirt-freebsd-10/w…'> gmake[3]: Entering directory '/usr<https://ci.centos.org/job/libvirt-master-check/systems=libvirt-freebsd-10/w…'> PASS: sockettest SKIP: virhostcputest PASS: virbuftest PASS: seclabeltest PASS: virhashtest PASS: virconftest PASS: commandtest PASS: utiltest SKIP: shunloadtest PASS: virtimetest PASS: viruritest PASS: virkeyfiletest PASS: viralloctest PASS: virauthconfigtest PASS: virbitmaptest PASS: viratomictest SKIP: vircgrouptest SKIP: virpcitest PASS: vircryptotest PASS: virendiantest PASS: virfiletest SKIP: virfirewalltest PASS: virfilecachetest FAIL: viriscsitest PASS: virkeycodetest PASS: virlockspacetest PASS: virlogtest PASS: virrotatingfiletest PASS: virstringtest SKIP: virportallocatortest PASS: sysinfotest SKIP: virkmodtest PASS: vircapstest PASS: domaincapstest PASS: domainconftest SKIP: virhostdevtest SKIP: virnetdevtest PASS: virtypedparamtest PASS: virnetmessagetest PASS: virnetsockettest PASS: virnetdaemontest PASS: virnetserverclienttest SKIP: virnettlscontexttest SKIP: virnettlssessiontest PASS: fdstreamtest PASS: virdbustest SKIP: virsystemdtest PASS: virpolkittest PASS: qemuxml2argvtest PASS: qemuxml2xmltest PASS: qemuargv2xmltest PASS: domainsnapshotxml2xmltest PASS: qemumonitorjsontest PASS: virschematest PASS: qemuagenttest PASS: qemuhotplugtest PASS: qemucaps2xmltest PASS: qemumemlocktest PASS: qemucommandutiltest PASS: qemucapabilitiestest PASS: qemublocktest PASS: esxutilstest PASS: vboxsnapshotxmltest PASS: qemumigparamstest PASS: vmx2xmltest PASS: xml2vmxtest PASS: vmwarevertest PASS: bhyvexml2xmltest PASS: bhyvexml2argvtest PASS: bhyveargv2xmltest PASS: networkxml2xmltest PASS: virjsontest PASS: networkxml2xmlupdatetest PASS: networkxml2conftest SKIP: networkxml2firewalltest PASS: virnwfilterbindingxml2xmltest PASS: nwfilterxml2xmltest PASS: storagevolxml2argvtest PASS: virstorageutiltest PASS: nsstest PASS: nssguesttest PASS: storagevolxml2xmltest PASS: storagepoolxml2xmltest PASS: nodedevxml2xmltest PASS: interfacexml2xmltest PASS: metadatatest PASS: secretxml2xmltest PASS: genericxml2xmltest PASS: eventtest PASS: virdrivermoduletest PASS: objecteventtest PASS: virmacmaptest PASS: libvirtd-fail PASS: libvirtd-pool PASS: virsh-cpuset PASS: virsh-define-dev-segfault PASS: virsh-int-overflow SKIP: virsh-optparse PASS: virsh-read-bufsiz PASS: virsh-read-non-seekable PASS: virsh-schedinfo PASS: cputest PASS: virsh-self-test PASS: virt-admin-self-test PASS: virsh-start PASS: virsh-undefine PASS: virsh-uriprecedence PASS: virsh-vcpupin PASS: virshtest ============================================================================ Testsuite summary for libvirt 4.6.0 ============================================================================ # TOTAL: 109 # PASS: 94 # SKIP: 14 # XFAIL: 0 # FAIL: 1 # XPASS: 0 # ERROR: 0 ============================================================================ See tests/test-suite.log Please report to libvir-list(a)redhat.com ============================================================================ gmake[3]: *** [Makefile:5818: test-suite.log] Error 1 gmake[3]: Leaving directory '/usr<https://ci.centos.org/job/libvirt-master-check/systems=libvirt-freebsd-10/w…'> gmake[2]: *** [Makefile:5926: check-TESTS] Error 2 gmake[2]: Leaving directory '/usr<https://ci.centos.org/job/libvirt-master-check/systems=libvirt-freebsd-10/w…'> gmake[1]: *** [Makefile:6924: check-am] Error 2 gmake[1]: Leaving directory '/usr<https://ci.centos.org/job/libvirt-master-check/systems=libvirt-freebsd-10/w…'> gmake: *** [Makefile:2106: check-recursive] Error 1 + cat tests/test-suite.log ========================================= libvirt 4.6.0: tests/test-suite.log ========================================= # TOTAL: 109 # PASS: 94 # SKIP: 14 # XFAIL: 0 # FAIL: 1 # XPASS: 0 # ERROR: 0 .. contents:: :depth: 2 SKIP: virhostcputest ==================== SKIP virhostcputest (exit status: 77) SKIP: shunloadtest ================== SKIP shunloadtest (exit status: 77) SKIP: vircgrouptest =================== SKIP vircgrouptest (exit status: 77) SKIP: virpcitest ================ SKIP virpcitest (exit status: 77) SKIP: virfirewalltest ===================== SKIP virfirewalltest (exit status: 77) FAIL: viriscsitest ================== TEST: viriscsitest 1) ISCSI get session testiqn.2004-06.example:example1:iscsi.test ... OK 2) ISCSI get (non-flash) session testiqn.2004-06.example:example1:iscsi.test ... OK 3) ISCSI get session testiqn.2009-04.example:example1:iscsi.seven ... OK 4) ISCSI get (non-flash) session testiqn.2009-04.example:example1:iscsi.seven ... OK 5) ISCSI get session testiqn.2009-04.example:example1:iscsi.eight ... OK 6) ISCSI get (non-flash) session testiqn.2009-04.example:example1:iscsi.eight ... OK 7) ISCSI scan targets ... OK 8) ISCSI login 10.20.30.40:3260,1 ... OK 9) ISCSI login 10.20.30.40:3260,1 ... libvirt: error : internal error: malformed output of iscsiadm: default tcp,<empty>,<empty>,<empty>,<empty> FAILED FAIL viriscsitest (exit status: 1) SKIP: virportallocatortest ========================== SKIP virportallocatortest (exit status: 77) SKIP: virkmodtest ================= SKIP virkmodtest (exit status: 77) SKIP: virhostdevtest ==================== SKIP virhostdevtest (exit status: 77) SKIP: virnetdevtest =================== SKIP virnetdevtest (exit status: 77) SKIP: virnettlscontexttest ========================== SKIP virnettlscontexttest (exit status: 77) SKIP: virnettlssessiontest ========================== SKIP virnettlssessiontest (exit status: 77) SKIP: virsystemdtest ==================== SKIP virsystemdtest (exit status: 77) SKIP: networkxml2firewalltest ============================= SKIP networkxml2firewalltest (exit status: 77) SKIP: virsh-optparse ==================== ../../tests/virsh-optparse: skipping test: This test is very expensive, so it is disabled by default. To run it anyway, rerun: make check VIR_TEST_EXPENSIVE=1 SKIP virsh-optparse (exit status: 77) + exit 1 Build step 'Execute shell' marked build as failure
1 2
0 0
[Libvirt-ci] Build failed in Jenkins: libvirt-master-check » libvirt-freebsd-11 #1266
by ci@centos.org 25 Jul '18

25 Jul '18
See <https://ci.centos.org/job/libvirt-master-check/systems=libvirt-freebsd-11/1…> ------------------------------------------ [...truncated 23.17 KB...] gmake[3]: Leaving directory '/usr<https://ci.centos.org/job/libvirt-master-check/systems=libvirt-freebsd-11/w…'> gmake[2]: Leaving directory '/usr<https://ci.centos.org/job/libvirt-master-check/systems=libvirt-freebsd-11/w…'> gmake[1]: Leaving directory '/usr<https://ci.centos.org/job/libvirt-master-check/systems=libvirt-freebsd-11/w…'> Making check in tests gmake[1]: Entering directory '/usr<https://ci.centos.org/job/libvirt-master-check/systems=libvirt-freebsd-11/w…'> /usr/local/bin/gmake gmake[2]: Entering directory '/usr<https://ci.centos.org/job/libvirt-master-check/systems=libvirt-freebsd-11/w…'> gmake[2]: Nothing to be done for 'all'. gmake[2]: Leaving directory '/usr<https://ci.centos.org/job/libvirt-master-check/systems=libvirt-freebsd-11/w…'> /usr/local/bin/gmake check-TESTS gmake[2]: Entering directory '/usr<https://ci.centos.org/job/libvirt-master-check/systems=libvirt-freebsd-11/w…'> gmake[3]: Entering directory '/usr<https://ci.centos.org/job/libvirt-master-check/systems=libvirt-freebsd-11/w…'> PASS: sockettest PASS: virbuftest SKIP: virhostcputest PASS: seclabeltest PASS: virhashtest PASS: virconftest PASS: commandtest PASS: utiltest SKIP: shunloadtest PASS: virtimetest PASS: viruritest PASS: virkeyfiletest PASS: viralloctest PASS: virauthconfigtest PASS: virbitmaptest SKIP: vircgrouptest PASS: vircryptotest SKIP: virpcitest PASS: virendiantest PASS: virfiletest PASS: virfilecachetest SKIP: virfirewalltest FAIL: viriscsitest PASS: virkeycodetest PASS: virlockspacetest PASS: viratomictest PASS: virlogtest PASS: virrotatingfiletest PASS: virstringtest SKIP: virportallocatortest PASS: sysinfotest SKIP: virkmodtest PASS: vircapstest PASS: domaincapstest PASS: domainconftest SKIP: virhostdevtest SKIP: virnetdevtest PASS: virtypedparamtest PASS: virnetmessagetest PASS: virnetsockettest PASS: virnetdaemontest PASS: virnetserverclienttest SKIP: virnettlscontexttest SKIP: virnettlssessiontest PASS: fdstreamtest PASS: virdbustest SKIP: virsystemdtest PASS: virpolkittest PASS: qemuxml2argvtest PASS: qemuxml2xmltest PASS: qemuargv2xmltest PASS: domainsnapshotxml2xmltest PASS: qemumonitorjsontest PASS: virschematest PASS: qemuagenttest PASS: qemuhotplugtest PASS: qemucaps2xmltest PASS: qemumemlocktest PASS: qemucommandutiltest PASS: qemublocktest PASS: qemumigparamstest PASS: esxutilstest PASS: qemucapabilitiestest PASS: vboxsnapshotxmltest PASS: vmx2xmltest PASS: vmwarevertest PASS: xml2vmxtest PASS: bhyvexml2xmltest PASS: bhyvexml2argvtest PASS: virjsontest PASS: networkxml2xmltest PASS: bhyveargv2xmltest PASS: networkxml2conftest PASS: networkxml2xmlupdatetest SKIP: networkxml2firewalltest PASS: virnwfilterbindingxml2xmltest PASS: storagevolxml2argvtest PASS: nwfilterxml2xmltest PASS: virstorageutiltest PASS: nsstest PASS: nssguesttest PASS: storagevolxml2xmltest PASS: storagepoolxml2xmltest PASS: nodedevxml2xmltest PASS: interfacexml2xmltest PASS: metadatatest PASS: secretxml2xmltest PASS: genericxml2xmltest PASS: eventtest PASS: virdrivermoduletest PASS: objecteventtest PASS: virmacmaptest PASS: libvirtd-fail PASS: libvirtd-pool PASS: virsh-cpuset PASS: virsh-define-dev-segfault PASS: virsh-int-overflow SKIP: virsh-optparse PASS: virsh-read-bufsiz PASS: virsh-read-non-seekable PASS: virsh-schedinfo PASS: virsh-self-test PASS: cputest PASS: virsh-start PASS: virt-admin-self-test PASS: virsh-undefine PASS: virsh-uriprecedence PASS: virsh-vcpupin PASS: virshtest ============================================================================ Testsuite summary for libvirt 4.6.0 ============================================================================ # TOTAL: 109 # PASS: 94 # SKIP: 14 # XFAIL: 0 # FAIL: 1 # XPASS: 0 # ERROR: 0 ============================================================================ See tests/test-suite.log Please report to libvir-list(a)redhat.com ============================================================================ gmake[3]: *** [Makefile:5818: test-suite.log] Error 1 gmake[3]: Leaving directory '/usr<https://ci.centos.org/job/libvirt-master-check/systems=libvirt-freebsd-11/w…'> gmake[2]: *** [Makefile:5926: check-TESTS] Error 2 gmake[2]: Leaving directory '/usr<https://ci.centos.org/job/libvirt-master-check/systems=libvirt-freebsd-11/w…'> gmake[1]: *** [Makefile:6924: check-am] Error 2 gmake[1]: Leaving directory '/usr<https://ci.centos.org/job/libvirt-master-check/systems=libvirt-freebsd-11/w…'> gmake: *** [Makefile:2106: check-recursive] Error 1 + cat tests/test-suite.log ========================================= libvirt 4.6.0: tests/test-suite.log ========================================= # TOTAL: 109 # PASS: 94 # SKIP: 14 # XFAIL: 0 # FAIL: 1 # XPASS: 0 # ERROR: 0 .. contents:: :depth: 2 SKIP: virhostcputest ==================== SKIP virhostcputest (exit status: 77) SKIP: shunloadtest ================== SKIP shunloadtest (exit status: 77) SKIP: vircgrouptest =================== SKIP vircgrouptest (exit status: 77) SKIP: virpcitest ================ SKIP virpcitest (exit status: 77) SKIP: virfirewalltest ===================== SKIP virfirewalltest (exit status: 77) FAIL: viriscsitest ================== TEST: viriscsitest 1) ISCSI get session testiqn.2004-06.example:example1:iscsi.test ... OK 2) ISCSI get (non-flash) session testiqn.2004-06.example:example1:iscsi.test ... OK 3) ISCSI get session testiqn.2009-04.example:example1:iscsi.seven ... OK 4) ISCSI get (non-flash) session testiqn.2009-04.example:example1:iscsi.seven ... OK 5) ISCSI get session testiqn.2009-04.example:example1:iscsi.eight ... OK 6) ISCSI get (non-flash) session testiqn.2009-04.example:example1:iscsi.eight ... OK 7) ISCSI scan targets ... OK 8) ISCSI login 10.20.30.40:3260,1 ... OK 9) ISCSI login 10.20.30.40:3260,1 ... libvirt: error : internal error: malformed output of iscsiadm: default tcp,<empty>,<empty>,<empty>,<empty> FAILED FAIL viriscsitest (exit status: 1) SKIP: virportallocatortest ========================== SKIP virportallocatortest (exit status: 77) SKIP: virkmodtest ================= SKIP virkmodtest (exit status: 77) SKIP: virhostdevtest ==================== SKIP virhostdevtest (exit status: 77) SKIP: virnetdevtest =================== SKIP virnetdevtest (exit status: 77) SKIP: virnettlscontexttest ========================== SKIP virnettlscontexttest (exit status: 77) SKIP: virnettlssessiontest ========================== SKIP virnettlssessiontest (exit status: 77) SKIP: virsystemdtest ==================== SKIP virsystemdtest (exit status: 77) SKIP: networkxml2firewalltest ============================= SKIP networkxml2firewalltest (exit status: 77) SKIP: virsh-optparse ==================== ../../tests/virsh-optparse: skipping test: This test is very expensive, so it is disabled by default. To run it anyway, rerun: make check VIR_TEST_EXPENSIVE=1 SKIP virsh-optparse (exit status: 77) + exit 1 Build step 'Execute shell' marked build as failure
1 2
0 0
[Libvirt-ci] Build failed in Jenkins: libvirt-dbus-master-check » libvirt-freebsd-11 #298
by ci@centos.org 25 Jul '18

25 Jul '18
See <https://ci.centos.org/job/libvirt-dbus-master-check/systems=libvirt-freebsd…> ------------------------------------------ Started by upstream project "libvirt-dbus-master-check" build number 298 originally caused by: Started by upstream project "libvirt-dbus-master-build" build number 332 originally caused by: Started by an SCM change [EnvInject] - Loading node environment variables. Building remotely on libvirt-freebsd-11 (libvirt) in workspace <https://ci.centos.org/job/libvirt-dbus-master-check/systems=libvirt-freebsd…> [libvirt-dbus-master] $ /bin/sh -xe /tmp/jenkins5566093784804289703.sh + cd build + /usr/local/bin/gmake check Making check in data gmake[1]: Entering directory '/usr<https://ci.centos.org/job/libvirt-dbus-master-check/systems=libvirt-freebsd…'> gmake[1]: Nothing to be done for 'check'. gmake[1]: Leaving directory '/usr<https://ci.centos.org/job/libvirt-dbus-master-check/systems=libvirt-freebsd…'> Making check in docs gmake[1]: Entering directory '/usr<https://ci.centos.org/job/libvirt-dbus-master-check/systems=libvirt-freebsd…'> gmake[1]: Nothing to be done for 'check'. gmake[1]: Leaving directory '/usr<https://ci.centos.org/job/libvirt-dbus-master-check/systems=libvirt-freebsd…'> Making check in src gmake[1]: Entering directory '/usr<https://ci.centos.org/job/libvirt-dbus-master-check/systems=libvirt-freebsd…'> gmake[1]: Nothing to be done for 'check'. gmake[1]: Leaving directory '/usr<https://ci.centos.org/job/libvirt-dbus-master-check/systems=libvirt-freebsd…'> Making check in tests gmake[1]: Entering directory '/usr<https://ci.centos.org/job/libvirt-dbus-master-check/systems=libvirt-freebsd…'> /usr/local/bin/gmake test_util gmake[2]: Entering directory '/usr<https://ci.centos.org/job/libvirt-dbus-master-check/systems=libvirt-freebsd…'> CC test_util-test_util.o CCLD test_util gmake[2]: Leaving directory '/usr<https://ci.centos.org/job/libvirt-dbus-master-check/systems=libvirt-freebsd…'> /usr/local/bin/gmake check-TESTS gmake[2]: Entering directory '/usr<https://ci.centos.org/job/libvirt-dbus-master-check/systems=libvirt-freebsd…'> gmake[3]: Entering directory '/usr<https://ci.centos.org/job/libvirt-dbus-master-check/systems=libvirt-freebsd…'> PASS: test_util FAIL: test_interface.py PASS: test_network.py PASS: test_domain.py PASS: test_nodedev.py PASS: test_storage.py PASS: test_connect.py ============================================================================ Testsuite summary for libvirt-dbus 1.3.0 ============================================================================ # TOTAL: 7 # PASS: 6 # SKIP: 0 # XFAIL: 0 # FAIL: 1 # XPASS: 0 # ERROR: 0 ============================================================================ See tests/test-suite.log Please report to libvir-list(a)redhat.com ============================================================================ gmake[3]: *** [Makefile:765: test-suite.log] Error 1 gmake[3]: Leaving directory '/usr<https://ci.centos.org/job/libvirt-dbus-master-check/systems=libvirt-freebsd…'> gmake[2]: *** [Makefile:873: check-TESTS] Error 2 gmake[2]: Leaving directory '/usr<https://ci.centos.org/job/libvirt-dbus-master-check/systems=libvirt-freebsd…'> gmake[1]: *** [Makefile:989: check-am] Error 2 gmake[1]: Leaving directory '/usr<https://ci.centos.org/job/libvirt-dbus-master-check/systems=libvirt-freebsd…'> gmake: *** [Makefile:459: check-recursive] Error 1 + cat tests/test-suite.log ============================================== libvirt-dbus 1.3.0: tests/test-suite.log ============================================== # TOTAL: 7 # PASS: 6 # SKIP: 0 # XFAIL: 0 # FAIL: 1 # XPASS: 0 # ERROR: 0 .. contents:: :depth: 2 FAIL: test_interface.py ======================= ../../build-aux/test-driver: ../../tests/test_interface.py: not found FAIL test_interface.py (exit status: 127) + exit 1 Build step 'Execute shell' marked build as failure
1 6
0 0
[Libvirt-ci] Build failed in Jenkins: libvirt-dbus-master-check » libvirt-freebsd-10 #298
by ci@centos.org 25 Jul '18

25 Jul '18
See <https://ci.centos.org/job/libvirt-dbus-master-check/systems=libvirt-freebsd…> ------------------------------------------ Started by upstream project "libvirt-dbus-master-check" build number 298 originally caused by: Started by upstream project "libvirt-dbus-master-build" build number 332 originally caused by: Started by an SCM change [EnvInject] - Loading node environment variables. Building remotely on libvirt-freebsd-10 (libvirt) in workspace <https://ci.centos.org/job/libvirt-dbus-master-check/systems=libvirt-freebsd…> [libvirt-dbus-master] $ /bin/sh -xe /tmp/jenkins6898538986976118086.sh + cd build + /usr/local/bin/gmake check Making check in data gmake[1]: Entering directory '/usr<https://ci.centos.org/job/libvirt-dbus-master-check/systems=libvirt-freebsd…'> gmake[1]: Nothing to be done for 'check'. gmake[1]: Leaving directory '/usr<https://ci.centos.org/job/libvirt-dbus-master-check/systems=libvirt-freebsd…'> Making check in docs gmake[1]: Entering directory '/usr<https://ci.centos.org/job/libvirt-dbus-master-check/systems=libvirt-freebsd…'> gmake[1]: Nothing to be done for 'check'. gmake[1]: Leaving directory '/usr<https://ci.centos.org/job/libvirt-dbus-master-check/systems=libvirt-freebsd…'> Making check in src gmake[1]: Entering directory '/usr<https://ci.centos.org/job/libvirt-dbus-master-check/systems=libvirt-freebsd…'> gmake[1]: Nothing to be done for 'check'. gmake[1]: Leaving directory '/usr<https://ci.centos.org/job/libvirt-dbus-master-check/systems=libvirt-freebsd…'> Making check in tests gmake[1]: Entering directory '/usr<https://ci.centos.org/job/libvirt-dbus-master-check/systems=libvirt-freebsd…'> /usr/local/bin/gmake test_util gmake[2]: Entering directory '/usr<https://ci.centos.org/job/libvirt-dbus-master-check/systems=libvirt-freebsd…'> CC test_util-test_util.o CCLD test_util gmake[2]: Leaving directory '/usr<https://ci.centos.org/job/libvirt-dbus-master-check/systems=libvirt-freebsd…'> /usr/local/bin/gmake check-TESTS gmake[2]: Entering directory '/usr<https://ci.centos.org/job/libvirt-dbus-master-check/systems=libvirt-freebsd…'> gmake[3]: Entering directory '/usr<https://ci.centos.org/job/libvirt-dbus-master-check/systems=libvirt-freebsd…'> PASS: test_util FAIL: test_interface.py PASS: test_network.py PASS: test_domain.py PASS: test_nodedev.py PASS: test_storage.py PASS: test_connect.py ============================================================================ Testsuite summary for libvirt-dbus 1.3.0 ============================================================================ # TOTAL: 7 # PASS: 6 # SKIP: 0 # XFAIL: 0 # FAIL: 1 # XPASS: 0 # ERROR: 0 ============================================================================ See tests/test-suite.log Please report to libvir-list(a)redhat.com ============================================================================ gmake[3]: *** [Makefile:765: test-suite.log] Error 1 gmake[3]: Leaving directory '/usr<https://ci.centos.org/job/libvirt-dbus-master-check/systems=libvirt-freebsd…'> gmake[2]: *** [Makefile:873: check-TESTS] Error 2 gmake[2]: Leaving directory '/usr<https://ci.centos.org/job/libvirt-dbus-master-check/systems=libvirt-freebsd…'> gmake[1]: *** [Makefile:989: check-am] Error 2 gmake[1]: Leaving directory '/usr<https://ci.centos.org/job/libvirt-dbus-master-check/systems=libvirt-freebsd…'> gmake: *** [Makefile:459: check-recursive] Error 1 + cat tests/test-suite.log ============================================== libvirt-dbus 1.3.0: tests/test-suite.log ============================================== # TOTAL: 7 # PASS: 6 # SKIP: 0 # XFAIL: 0 # FAIL: 1 # XPASS: 0 # ERROR: 0 .. contents:: :depth: 2 FAIL: test_interface.py ======================= ../../build-aux/test-driver: ../../tests/test_interface.py: not found FAIL test_interface.py (exit status: 127) + exit 1 Build step 'Execute shell' marked build as failure
1 6
0 0
[Libvirt-ci] Build failed in Jenkins: libvirt-go-xml-master-check » libvirt-fedora-rawhide #563
by ci@centos.org 24 Jul '18

24 Jul '18
See <https://ci.centos.org/job/libvirt-go-xml-master-check/systems=libvirt-fedor…> ------------------------------------------ Started by upstream project "libvirt-go-xml-master-check" build number 563 originally caused by: Started by upstream project "libvirt-go-xml-master-build" build number 572 originally caused by: Started by upstream project "libvirt-master-build" build number 1623 originally caused by: Started by an SCM change [EnvInject] - Loading node environment variables. Building remotely on libvirt-fedora-rawhide (libvirt) in workspace <https://ci.centos.org/job/libvirt-go-xml-master-check/systems=libvirt-fedor…> [libvirt-go-xml-master] $ /bin/sh -xe /tmp/jenkins956432146474332790.sh + export 'TEST_ARGS=-tags xmlroundtrip' + TEST_ARGS='-tags xmlroundtrip' + go test -tags xmlroundtrip --- FAIL: TestRoundTrip (18.67s) xml_test.go:386: testdata/libvirt/tests/qemuxml2argvdata/disk-discard.xml: /domain[0]/devices[0]/disk[0]/@type: attribute in actual XML missing in expected XML FAIL exit status 1 FAIL _<https://ci.centos.org/job/libvirt-go-xml-master-check/systems=libvirt-fedor…> 18.992s Build step 'Execute shell' marked build as failure
1 1
0 0
[Libvirt-ci] Build failed in Jenkins: libvirt-go-xml-master-check » libvirt-fedora-28 #563
by ci@centos.org 24 Jul '18

24 Jul '18
See <https://ci.centos.org/job/libvirt-go-xml-master-check/systems=libvirt-fedor…> ------------------------------------------ Started by upstream project "libvirt-go-xml-master-check" build number 563 originally caused by: Started by upstream project "libvirt-go-xml-master-build" build number 572 originally caused by: Started by upstream project "libvirt-master-build" build number 1623 originally caused by: Started by an SCM change [EnvInject] - Loading node environment variables. Building remotely on libvirt-fedora-28 (libvirt) in workspace <https://ci.centos.org/job/libvirt-go-xml-master-check/systems=libvirt-fedor…> [libvirt-go-xml-master] $ /bin/sh -xe /tmp/jenkins5746976841836395583.sh + export 'TEST_ARGS=-tags xmlroundtrip' + TEST_ARGS='-tags xmlroundtrip' + go test -tags xmlroundtrip --- FAIL: TestRoundTrip (15.90s) xml_test.go:386: testdata/libvirt/tests/qemuxml2argvdata/disk-discard.xml: /domain[0]/devices[0]/disk[0]/@type: attribute in actual XML missing in expected XML FAIL exit status 1 FAIL _<https://ci.centos.org/job/libvirt-go-xml-master-check/systems=libvirt-fedor…> 16.047s Build step 'Execute shell' marked build as failure
1 1
0 0
[Libvirt-ci] Build failed in Jenkins: libvirt-go-xml-master-check » libvirt-fedora-27 #563
by ci@centos.org 24 Jul '18

24 Jul '18
See <https://ci.centos.org/job/libvirt-go-xml-master-check/systems=libvirt-fedor…> ------------------------------------------ Started by upstream project "libvirt-go-xml-master-check" build number 563 originally caused by: Started by upstream project "libvirt-go-xml-master-build" build number 572 originally caused by: Started by upstream project "libvirt-master-build" build number 1623 originally caused by: Started by an SCM change [EnvInject] - Loading node environment variables. Building remotely on libvirt-fedora-27 (libvirt) in workspace <https://ci.centos.org/job/libvirt-go-xml-master-check/systems=libvirt-fedor…> [libvirt-go-xml-master] $ /bin/sh -xe /tmp/jenkins8320505048879628822.sh + export 'TEST_ARGS=-tags xmlroundtrip' + TEST_ARGS='-tags xmlroundtrip' + go test -tags xmlroundtrip --- FAIL: TestRoundTrip (17.98s) xml_test.go:386: testdata/libvirt/tests/qemuxml2argvdata/disk-discard.xml: /domain[0]/devices[0]/disk[0]/@type: attribute in actual XML missing in expected XML FAIL exit status 1 FAIL _<https://ci.centos.org/job/libvirt-go-xml-master-check/systems=libvirt-fedor…> 18.108s Build step 'Execute shell' marked build as failure
1 1
0 0
[Libvirt-ci] Build failed in Jenkins: libvirt-go-xml-master-check » libvirt-freebsd-10 #563
by ci@centos.org 24 Jul '18

24 Jul '18
See <https://ci.centos.org/job/libvirt-go-xml-master-check/systems=libvirt-freeb…> ------------------------------------------ Started by upstream project "libvirt-go-xml-master-check" build number 563 originally caused by: Started by upstream project "libvirt-go-xml-master-build" build number 572 originally caused by: Started by upstream project "libvirt-master-build" build number 1623 originally caused by: Started by an SCM change [EnvInject] - Loading node environment variables. Building remotely on libvirt-freebsd-10 (libvirt) in workspace <https://ci.centos.org/job/libvirt-go-xml-master-check/systems=libvirt-freeb…> [libvirt-go-xml-master] $ /bin/sh -xe /tmp/jenkins7789404638227264184.sh + export 'TEST_ARGS=-tags xmlroundtrip' + go test -tags xmlroundtrip --- FAIL: TestRoundTrip (18.87s) xml_test.go:386: testdata/libvirt/tests/qemuxml2argvdata/disk-discard.xml: /domain[0]/devices[0]/disk[0]/@type: attribute in actual XML missing in expected XML FAIL exit status 1 FAIL _/usr<https://ci.centos.org/job/libvirt-go-xml-master-check/systems=libvirt-freeb…> 18.935s Build step 'Execute shell' marked build as failure
1 1
0 0
[Libvirt-ci] Build failed in Jenkins: libvirt-go-xml-master-check » libvirt-freebsd-11 #563
by ci@centos.org 24 Jul '18

24 Jul '18
See <https://ci.centos.org/job/libvirt-go-xml-master-check/systems=libvirt-freeb…> ------------------------------------------ Started by upstream project "libvirt-go-xml-master-check" build number 563 originally caused by: Started by upstream project "libvirt-go-xml-master-build" build number 572 originally caused by: Started by upstream project "libvirt-master-build" build number 1623 originally caused by: Started by an SCM change [EnvInject] - Loading node environment variables. Building remotely on libvirt-freebsd-11 (libvirt) in workspace <https://ci.centos.org/job/libvirt-go-xml-master-check/systems=libvirt-freeb…> [libvirt-go-xml-master] $ /bin/sh -xe /tmp/jenkins2916427017211863412.sh + export 'TEST_ARGS=-tags xmlroundtrip' + go test -tags xmlroundtrip --- FAIL: TestRoundTrip (19.24s) xml_test.go:386: testdata/libvirt/tests/qemuxml2argvdata/disk-discard.xml: /domain[0]/devices[0]/disk[0]/@type: attribute in actual XML missing in expected XML FAIL exit status 1 FAIL _/usr<https://ci.centos.org/job/libvirt-go-xml-master-check/systems=libvirt-freeb…> 19.355s Build step 'Execute shell' marked build as failure
1 1
0 0
  • ← Newer
  • 1
  • ...
  • 858
  • 859
  • 860
  • 861
  • 862
  • 863
  • 864
  • ...
  • 1022
  • Older →

HyperKitty Powered by HyperKitty version 1.3.12.