libvirt List Archives
Sign In Sign Up
Manage this list Sign In Sign Up

Keyboard Shortcuts

Thread View

  • j: Next unread message
  • k: Previous unread message
  • j a: Jump to all threads
  • j l: Jump to MailingList overview

CI

Thread Start a new thread
Download
Threads by month
  • ----- 2026 -----
  • September
  • August
  • July
  • June
  • May
  • April
  • March
  • February
  • January
  • ----- 2025 -----
  • December
  • November
  • October
  • September
  • August
  • July
  • June
  • May
  • April
  • March
  • February
  • January
  • ----- 2024 -----
  • December
  • November
  • October
  • September
  • August
  • July
  • June
  • May
  • April
  • March
  • February
  • January
  • ----- 2023 -----
  • December
  • November
  • October
  • September
  • August
  • July
  • June
  • May
  • April
  • March
  • February
  • January
  • ----- 2022 -----
  • December
  • November
  • October
  • September
  • August
  • July
  • June
  • May
  • April
  • March
  • February
  • January
  • ----- 2021 -----
  • December
  • November
  • October
  • September
  • August
  • July
  • June
  • May
  • April
  • March
  • February
  • January
  • ----- 2020 -----
  • December
  • November
  • October
  • September
  • August
  • July
  • June
  • May
  • April
  • March
  • February
  • January
  • ----- 2019 -----
  • December
  • November
  • October
  • September
  • August
  • July
  • June
  • May
  • April
  • March
  • February
  • January
  • ----- 2018 -----
  • December
  • November
  • October
  • September
  • August
  • July
  • June
  • May
  • April
  • March
  • February
  • January
  • ----- 2017 -----
  • December
  • November
  • October
  • September
  • August
  • July
  • June
  • May
  • April
  • March
  • February
  • January
  • ----- 2016 -----
  • December
  • November
  • October
  • September
  • August
  • July
ci@lists.libvirt.org

  • 2 participants
  • 10211 discussions
[Libvirt-ci] Build failed in Jenkins: libvirt-go-xml-master-check » libvirt-freebsd-10 #621
by ci@centos.org 17 Aug '18

17 Aug '18
See <https://ci.centos.org/job/libvirt-go-xml-master-check/systems=libvirt-freeb…> ------------------------------------------ Started by upstream project "libvirt-go-xml-master-check" build number 621 originally caused by: Started by upstream project "libvirt-go-xml-master-build" build number 629 originally caused by: Started by upstream project "libvirt-master-build" build number 1693 originally caused by: Started by an SCM change [EnvInject] - Loading node environment variables. Building remotely on libvirt-freebsd-10 (libvirt) in workspace <https://ci.centos.org/job/libvirt-go-xml-master-check/systems=libvirt-freeb…> [libvirt-go-xml-master] $ /bin/sh -xe /tmp/jenkins2518713023854194857.sh + export 'TEST_ARGS=-tags xmlroundtrip' + go test -tags xmlroundtrip --- FAIL: TestRoundTrip (10.21s) xml_test.go:388: testdata/libvirt/tests/qemuxml2argvdata/hyperv-off.xml: /domain[0]/features[0]/hyperv[0]/frequencies[0]: element in expected XML missing in actual XML FAIL exit status 1 FAIL _/usr<https://ci.centos.org/job/libvirt-go-xml-master-check/systems=libvirt-freeb…> 10.331s Build step 'Execute shell' marked build as failure
1 2
0 0
[Libvirt-ci] Build failed in Jenkins: libvirt-go-xml-master-check » libvirt-freebsd-11 #621
by ci@centos.org 17 Aug '18

17 Aug '18
See <https://ci.centos.org/job/libvirt-go-xml-master-check/systems=libvirt-freeb…> ------------------------------------------ Started by upstream project "libvirt-go-xml-master-check" build number 621 originally caused by: Started by upstream project "libvirt-go-xml-master-build" build number 629 originally caused by: Started by upstream project "libvirt-master-build" build number 1693 originally caused by: Started by an SCM change [EnvInject] - Loading node environment variables. Building remotely on libvirt-freebsd-11 (libvirt) in workspace <https://ci.centos.org/job/libvirt-go-xml-master-check/systems=libvirt-freeb…> [libvirt-go-xml-master] $ /bin/sh -xe /tmp/jenkins2956778233415383607.sh + export 'TEST_ARGS=-tags xmlroundtrip' + go test -tags xmlroundtrip --- FAIL: TestRoundTrip (11.69s) xml_test.go:388: testdata/libvirt/tests/qemuxml2argvdata/hyperv-off.xml: /domain[0]/features[0]/hyperv[0]/frequencies[0]: element in expected XML missing in actual XML FAIL exit status 1 FAIL _/usr<https://ci.centos.org/job/libvirt-go-xml-master-check/systems=libvirt-freeb…> 11.787s Build step 'Execute shell' marked build as failure
1 2
0 0
[Libvirt-ci] Build failed in Jenkins: libvirt-go-xml-master-check » libvirt-fedora-28 #621
by ci@centos.org 17 Aug '18

17 Aug '18
See <https://ci.centos.org/job/libvirt-go-xml-master-check/systems=libvirt-fedor…> ------------------------------------------ Started by upstream project "libvirt-go-xml-master-check" build number 621 originally caused by: Started by upstream project "libvirt-go-xml-master-build" build number 629 originally caused by: Started by upstream project "libvirt-master-build" build number 1693 originally caused by: Started by an SCM change [EnvInject] - Loading node environment variables. Building remotely on libvirt-fedora-28 (libvirt) in workspace <https://ci.centos.org/job/libvirt-go-xml-master-check/systems=libvirt-fedor…> [libvirt-go-xml-master] $ /bin/sh -xe /tmp/jenkins1555422579227878471.sh + export 'TEST_ARGS=-tags xmlroundtrip' + TEST_ARGS='-tags xmlroundtrip' + go test -tags xmlroundtrip --- FAIL: TestRoundTrip (29.59s) xml_test.go:388: testdata/libvirt/tests/qemuxml2argvdata/hyperv-off.xml: /domain[0]/features[0]/hyperv[0]/frequencies[0]: element in expected XML missing in actual XML FAIL exit status 1 FAIL _<https://ci.centos.org/job/libvirt-go-xml-master-check/systems=libvirt-fedor…> 30.014s Build step 'Execute shell' marked build as failure
1 2
0 0
[Libvirt-ci] Build failed in Jenkins: libvirt-go-xml-master-check » libvirt-fedora-rawhide #621
by ci@centos.org 17 Aug '18

17 Aug '18
See <https://ci.centos.org/job/libvirt-go-xml-master-check/systems=libvirt-fedor…> ------------------------------------------ Started by upstream project "libvirt-go-xml-master-check" build number 621 originally caused by: Started by upstream project "libvirt-go-xml-master-build" build number 629 originally caused by: Started by upstream project "libvirt-master-build" build number 1693 originally caused by: Started by an SCM change [EnvInject] - Loading node environment variables. Building remotely on libvirt-fedora-rawhide (libvirt) in workspace <https://ci.centos.org/job/libvirt-go-xml-master-check/systems=libvirt-fedor…> [libvirt-go-xml-master] $ /bin/sh -xe /tmp/jenkins7962838285215604986.sh + export 'TEST_ARGS=-tags xmlroundtrip' + TEST_ARGS='-tags xmlroundtrip' + go test -tags xmlroundtrip --- FAIL: TestRoundTrip (19.69s) xml_test.go:388: testdata/libvirt/tests/qemuxml2argvdata/hyperv-off.xml: /domain[0]/features[0]/hyperv[0]/frequencies[0]: element in expected XML missing in actual XML FAIL exit status 1 FAIL _<https://ci.centos.org/job/libvirt-go-xml-master-check/systems=libvirt-fedor…> 19.784s Build step 'Execute shell' marked build as failure
1 2
0 0
[Libvirt-ci] Build failed in Jenkins: libvirt-go-xml-master-check » libvirt-centos-7 #621
by ci@centos.org 17 Aug '18

17 Aug '18
See <https://ci.centos.org/job/libvirt-go-xml-master-check/systems=libvirt-cento…> ------------------------------------------ Started by upstream project "libvirt-go-xml-master-check" build number 621 originally caused by: Started by upstream project "libvirt-go-xml-master-build" build number 629 originally caused by: Started by upstream project "libvirt-master-build" build number 1693 originally caused by: Started by an SCM change [EnvInject] - Loading node environment variables. Building remotely on libvirt-centos-7 (libvirt) in workspace <https://ci.centos.org/job/libvirt-go-xml-master-check/systems=libvirt-cento…> [libvirt-go-xml-master] $ /bin/sh -xe /tmp/jenkins6649522199625754302.sh + export 'TEST_ARGS=-tags xmlroundtrip' + TEST_ARGS='-tags xmlroundtrip' + go test -tags xmlroundtrip --- FAIL: TestRoundTrip (30.30s) xml_test.go:388: testdata/libvirt/tests/qemuxml2argvdata/hyperv-off.xml: /domain[0]/features[0]/hyperv[0]/frequencies[0]: element in expected XML missing in actual XML FAIL exit status 1 FAIL _<https://ci.centos.org/job/libvirt-go-xml-master-check/systems=libvirt-cento…> 30.636s Build step 'Execute shell' marked build as failure
1 2
0 0
[Libvirt-ci] Build failed in Jenkins: libvirt-go-xml-master-check » libvirt-debian-9 #621
by ci@centos.org 17 Aug '18

17 Aug '18
See <https://ci.centos.org/job/libvirt-go-xml-master-check/systems=libvirt-debia…> ------------------------------------------ Started by upstream project "libvirt-go-xml-master-check" build number 621 originally caused by: Started by upstream project "libvirt-go-xml-master-build" build number 629 originally caused by: Started by upstream project "libvirt-master-build" build number 1693 originally caused by: Started by an SCM change [EnvInject] - Loading node environment variables. Building remotely on libvirt-debian-9 (libvirt) in workspace <https://ci.centos.org/job/libvirt-go-xml-master-check/systems=libvirt-debia…> [libvirt-go-xml-master] $ /bin/sh -xe /tmp/jenkins3241804275099980402.sh + export TEST_ARGS=-tags xmlroundtrip + go test -tags xmlroundtrip --- FAIL: TestRoundTrip (15.87s) xml_test.go:388: testdata/libvirt/tests/qemuxml2argvdata/hyperv-off.xml: /domain[0]/features[0]/hyperv[0]/frequencies[0]: element in expected XML missing in actual XML FAIL exit status 1 FAIL _<https://ci.centos.org/job/libvirt-go-xml-master-check/systems=libvirt-debia…> 16.071s Build step 'Execute shell' marked build as failure
1 2
0 0
[Libvirt-ci] Build failed in Jenkins: libvirt-go-xml-master-check » libvirt-debian-8 #621
by ci@centos.org 17 Aug '18

17 Aug '18
See <https://ci.centos.org/job/libvirt-go-xml-master-check/systems=libvirt-debia…> ------------------------------------------ Started by upstream project "libvirt-go-xml-master-check" build number 621 originally caused by: Started by upstream project "libvirt-go-xml-master-build" build number 629 originally caused by: Started by upstream project "libvirt-master-build" build number 1693 originally caused by: Started by an SCM change [EnvInject] - Loading node environment variables. Building remotely on libvirt-debian-8 (libvirt) in workspace <https://ci.centos.org/job/libvirt-go-xml-master-check/systems=libvirt-debia…> [libvirt-go-xml-master] $ /bin/sh -xe /tmp/jenkins9118827026410347771.sh + export TEST_ARGS=-tags xmlroundtrip + go test -tags xmlroundtrip --- FAIL: TestRoundTrip (9.43 seconds) xml_test.go:388: testdata/libvirt/tests/qemuxml2argvdata/hyperv-off.xml: /domain[0]/features[0]/hyperv[0]/frequencies[0]: element in expected XML missing in actual XML FAIL exit status 1 FAIL _<https://ci.centos.org/job/libvirt-go-xml-master-check/systems=libvirt-debia…> 9.554s Build step 'Execute shell' marked build as failure
1 2
0 0
[Libvirt-ci] Errored: libvirt/libvirt#1597 (master - 69c20e1)
by Travis CI 17 Aug '18

17 Aug '18
Build Update for libvirt/libvirt ------------------------------------- Build: #1597 Status: Errored Duration: 19 mins and 12 secs Commit: 69c20e1 (master) Author: Peter Krempa Message: qemu: hotplug: Fix asynchronous unplug of 'shmem' commit 5c81c342a7 forgot to skip the detaching of the shmem backend when async unplug is requested which meant that we've tried to unplug the backend prior to delivery of the DEVICE_DELETED event. Resolves: https://bugzilla.redhat.com/show_bug.cgi?id=1618622 Signed-off-by: Peter Krempa <pkrempa(a)redhat.com> View the changeset: https://github.com/libvirt/libvirt/compare/f4c39db73663...69c20e109005 View the full build log and details: https://travis-ci.org/libvirt/libvirt/builds/417195819?utm_source=email&utm… -- You can configure recipients for build notifications in your .travis.yml file. See https://docs.travis-ci.com/user/notifications This email was sent to libvirt-ci(a)redhat.com (mailto:libvirt-ci@redhat.com) unsubscribe from this list (http://clicks.travis-ci.com/track/unsub.php?u=14313403&id=f90416480b2e4305a…)
1 0
0 0
[Libvirt-ci] Errored: libvirt/libvirt#1596 (master - f4c39db)
by Travis CI 16 Aug '18

16 Aug '18
Build Update for libvirt/libvirt ------------------------------------- Build: #1596 Status: Errored Duration: 19 mins and 34 secs Commit: f4c39db (master) Author: Vitaly Kuznetsov Message: conf: qemu: add support for Hyper-V PV TLB flush Qemu-3.0 supports Hyper-V-style PV TLB flush, Windows guests can benefit from this feature as KVM knows which vCPUs are not currently scheduled (and thus don't require any immediate action). Signed-off-by: Vitaly Kuznetsov <vkuznets(a)redhat.com> Reviewed-by: John Ferlan <jferlan(a)redhat.com> View the changeset: https://github.com/libvirt/libvirt/compare/a408a6dae80c...f4c39db73663 View the full build log and details: https://travis-ci.org/libvirt/libvirt/builds/416920864?utm_source=email&utm… -- You can configure recipients for build notifications in your .travis.yml file. See https://docs.travis-ci.com/user/notifications This email was sent to libvirt-ci(a)redhat.com (mailto:libvirt-ci@redhat.com) unsubscribe from this list (http://clicks.travis-ci.com/track/unsub.php?u=14313403&id=7d6dfdbfcc204b17a…)
1 0
0 0
[Libvirt-ci] Build failed in Jenkins: virt-viewer-master-build » libvirt-freebsd-11 #1338
by ci@centos.org 16 Aug '18

16 Aug '18
See <https://ci.centos.org/job/virt-viewer-master-build/systems=libvirt-freebsd-…> ------------------------------------------ Started by upstream project "virt-viewer-master-build" build number 1338 originally caused by: Started by upstream project "libvirt-glib-master-build" build number 1347 originally caused by: Started by an SCM change [EnvInject] - Loading node environment variables. Building remotely on libvirt-freebsd-11 (libvirt) in workspace <https://ci.centos.org/job/virt-viewer-master-build/systems=libvirt-freebsd-…> > git rev-parse --is-inside-work-tree # timeout=10 Fetching changes from the remote Git repository > git config remote.origin.url https://pagure.io/virt-viewer.git # timeout=10 Fetching upstream changes from https://pagure.io/virt-viewer.git > git --version # timeout=10 > git fetch --tags --progress https://pagure.io/virt-viewer.git +refs/heads/*:refs/remotes/origin/* Checking out Revision 1b45241a66183eeb566680deeec73ae59968c18f (refs/remotes/origin/master) > git config core.sparsecheckout # timeout=10 > git checkout -f 1b45241a66183eeb566680deeec73ae59968c18f Commit message: "ovirt: Improve handling of g_strv_contains()" > git rev-list --no-walk 1b45241a66183eeb566680deeec73ae59968c18f # timeout=10 FATAL: Invalid id: Process leaked file descriptors. See https://jenkins.io/redirect/troubleshooting/process-leaked-file-descriptors for more information Also: hudson.remoting.Channel$CallSiteStackTrace: Remote call to JNLP4-connect connection from n64.gusty.ci.centos.org/172.19.2.192:10002 at hudson.remoting.Channel.attachCallSiteStackTrace(Channel.java:1741) at hudson.remoting.UserRequest$ExceptionResponse.retrieve(UserRequest.java:357) at hudson.remoting.Channel.call(Channel.java:955) at hudson.remoting.RemoteInvocationHandler.invoke(RemoteInvocationHandler.java:283) at com.sun.proxy.$Proxy91.isCommitInRepo(Unknown Source) at org.jenkinsci.plugins.gitclient.RemoteGitImpl.isCommitInRepo(RemoteGitImpl.java:285) at hudson.plugins.git.GitSCM.computeChangeLog(GitSCM.java:1334) at hudson.plugins.git.GitSCM.checkout(GitSCM.java:1258) at hudson.scm.SCM.checkout(SCM.java:504) at hudson.model.AbstractProject.checkout(AbstractProject.java:1208) at hudson.model.AbstractBuild$AbstractBuildExecution.defaultCheckout(AbstractBuild.java:574) at jenkins.scm.SCMCheckoutStrategy.checkout(SCMCheckoutStrategy.java:86) at hudson.model.AbstractBuild$AbstractBuildExecution.run(AbstractBuild.java:499) at hudson.model.Run.execute(Run.java:1798) at hudson.matrix.MatrixRun.run(MatrixRun.java:153) at hudson.model.ResourceController.execute(ResourceController.java:97) at hudson.model.Executor.run(Executor.java:429) org.eclipse.jgit.errors.InvalidObjectIdException: Invalid id: Process leaked file descriptors. See https://jenkins.io/redirect/troubleshooting/process-leaked-file-descriptors for more information at org.eclipse.jgit.lib.ObjectId.fromString(ObjectId.java:232) at org.jenkinsci.plugins.gitclient.CliGitAPIImpl$10.execute(CliGitAPIImpl.java:2533) at org.jenkinsci.plugins.gitclient.CliGitAPIImpl.isCommitInRepo(CliGitAPIImpl.java:2584) at hudson.plugins.git.GitAPI.isCommitInRepo(GitAPI.java:237) at sun.reflect.NativeMethodAccessorImpl.invoke0(Native Method) at sun.reflect.NativeMethodAccessorImpl.invoke(NativeMethodAccessorImpl.java:62) at sun.reflect.DelegatingMethodAccessorImpl.invoke(DelegatingMethodAccessorImpl.java:43) at java.lang.reflect.Method.invoke(Method.java:498) at hudson.remoting.RemoteInvocationHandler$RPCRequest.perform(RemoteInvocationHandler.java:929) at hudson.remoting.RemoteInvocationHandler$RPCRequest.call(RemoteInvocationHandler.java:903) at hudson.remoting.RemoteInvocationHandler$RPCRequest.call(RemoteInvocationHandler.java:855) at hudson.remoting.UserRequest.perform(UserRequest.java:212) at hudson.remoting.UserRequest.perform(UserRequest.java:54) at hudson.remoting.Request$2.run(Request.java:369) at hudson.remoting.InterceptingExecutorService$1.call(InterceptingExecutorService.java:72) at java.util.concurrent.FutureTask.run(FutureTask.java:266) at java.util.concurrent.ThreadPoolExecutor.runWorker(ThreadPoolExecutor.java:1149) at java.util.concurrent.ThreadPoolExecutor$Worker.run(ThreadPoolExecutor.java:624) at hudson.remoting.Engine$1.lambda$newThread$0(Engine.java:93) at java.lang.Thread.run(Thread.java:748)
1 1
0 0
  • ← Newer
  • 1
  • ...
  • 848
  • 849
  • 850
  • 851
  • 852
  • 853
  • 854
  • ...
  • 1022
  • Older →

HyperKitty Powered by HyperKitty version 1.3.12.