libvirt List Archives
Sign In Sign Up
Manage this list Sign In Sign Up

Keyboard Shortcuts

Thread View

  • j: Next unread message
  • k: Previous unread message
  • j a: Jump to all threads
  • j l: Jump to MailingList overview

CI

Thread Start a new thread
Download
Threads by month
  • ----- 2026 -----
  • September
  • August
  • July
  • June
  • May
  • April
  • March
  • February
  • January
  • ----- 2025 -----
  • December
  • November
  • October
  • September
  • August
  • July
  • June
  • May
  • April
  • March
  • February
  • January
  • ----- 2024 -----
  • December
  • November
  • October
  • September
  • August
  • July
  • June
  • May
  • April
  • March
  • February
  • January
  • ----- 2023 -----
  • December
  • November
  • October
  • September
  • August
  • July
  • June
  • May
  • April
  • March
  • February
  • January
  • ----- 2022 -----
  • December
  • November
  • October
  • September
  • August
  • July
  • June
  • May
  • April
  • March
  • February
  • January
  • ----- 2021 -----
  • December
  • November
  • October
  • September
  • August
  • July
  • June
  • May
  • April
  • March
  • February
  • January
  • ----- 2020 -----
  • December
  • November
  • October
  • September
  • August
  • July
  • June
  • May
  • April
  • March
  • February
  • January
  • ----- 2019 -----
  • December
  • November
  • October
  • September
  • August
  • July
  • June
  • May
  • April
  • March
  • February
  • January
  • ----- 2018 -----
  • December
  • November
  • October
  • September
  • August
  • July
  • June
  • May
  • April
  • March
  • February
  • January
  • ----- 2017 -----
  • December
  • November
  • October
  • September
  • August
  • July
  • June
  • May
  • April
  • March
  • February
  • January
  • ----- 2016 -----
  • December
  • November
  • October
  • September
  • August
  • July
ci@lists.libvirt.org

  • 2 participants
  • 10211 discussions
[Libvirt-ci] Build failed in Jenkins: libvirt-dbus-master-check » libvirt-fedora-28 #359
by ci@centos.org 27 Aug '18

27 Aug '18
See <https://ci.centos.org/job/libvirt-dbus-master-check/systems=libvirt-fedora-…> ------------------------------------------ [...truncated 3.46 KB...] [libvirt-dbus-master] $ /bin/sh -xe /tmp/jenkins3139719042421123597.sh + cd build + /usr/bin/gmake check Making check in data gmake[1]: Entering directory '<https://ci.centos.org/job/libvirt-dbus-master-check/systems=libvirt-fedora-…'> gmake[1]: Nothing to be done for 'check'. gmake[1]: Leaving directory '<https://ci.centos.org/job/libvirt-dbus-master-check/systems=libvirt-fedora-…'> Making check in docs gmake[1]: Entering directory '<https://ci.centos.org/job/libvirt-dbus-master-check/systems=libvirt-fedora-…'> gmake[1]: Nothing to be done for 'check'. gmake[1]: Leaving directory '<https://ci.centos.org/job/libvirt-dbus-master-check/systems=libvirt-fedora-…'> Making check in src gmake[1]: Entering directory '<https://ci.centos.org/job/libvirt-dbus-master-check/systems=libvirt-fedora-…'> gmake[1]: Nothing to be done for 'check'. gmake[1]: Leaving directory '<https://ci.centos.org/job/libvirt-dbus-master-check/systems=libvirt-fedora-…'> Making check in tests gmake[1]: Entering directory '<https://ci.centos.org/job/libvirt-dbus-master-check/systems=libvirt-fedora-…'> /usr/bin/gmake test_util gmake[2]: Entering directory '<https://ci.centos.org/job/libvirt-dbus-master-check/systems=libvirt-fedora-…'> CC test_util-test_util.o CCLD test_util gmake[2]: Leaving directory '<https://ci.centos.org/job/libvirt-dbus-master-check/systems=libvirt-fedora-…'> /usr/bin/gmake check-TESTS gmake[2]: Entering directory '<https://ci.centos.org/job/libvirt-dbus-master-check/systems=libvirt-fedora-…'> gmake[3]: Entering directory '<https://ci.centos.org/job/libvirt-dbus-master-check/systems=libvirt-fedora-…'> PASS: test_util PASS: test_interface.py PASS: test_domain.py FAIL: test_network.py FAIL: test_connect.py PASS: test_nodedev.py PASS: test_storage.py ============================================================================ Testsuite summary for libvirt-dbus 1.3.0 ============================================================================ # TOTAL: 7 # PASS: 5 # SKIP: 0 # XFAIL: 0 # FAIL: 2 # XPASS: 0 # ERROR: 0 ============================================================================ See tests/test-suite.log Please report to libvir-list(a)redhat.com ============================================================================ gmake[3]: *** [Makefile:759: test-suite.log] Error 1 gmake[3]: Leaving directory '<https://ci.centos.org/job/libvirt-dbus-master-check/systems=libvirt-fedora-…'> gmake[2]: *** [Makefile:867: check-TESTS] Error 2 gmake[2]: Leaving directory '<https://ci.centos.org/job/libvirt-dbus-master-check/systems=libvirt-fedora-…'> gmake[1]: *** [Makefile:980: check-am] Error 2 gmake[1]: Leaving directory '<https://ci.centos.org/job/libvirt-dbus-master-check/systems=libvirt-fedora-…'> gmake: *** [Makefile:460: check-recursive] Error 1 + cat tests/test-suite.log ============================================== libvirt-dbus 1.3.0: tests/test-suite.log ============================================== # TOTAL: 7 # PASS: 5 # SKIP: 0 # XFAIL: 0 # FAIL: 2 # XPASS: 0 # ERROR: 0 .. contents:: :depth: 2 FAIL: test_connect.py ===================== ============================= test session starts ============================== platform linux -- Python 3.6.6, pytest-3.4.2, py-1.5.4, pluggy-0.6.0 rootdir: <https://ci.centos.org/job/libvirt-dbus-master-check/systems=libvirt-fedora-…,> inifile: collected 35 items ../../tests/test_connect.py ................E.................E [100%] ==================================== ERRORS ==================================== ___________ ERROR at setup of TestConnect.test_connect_list_networks ___________ self = <test_connect.TestConnect object at 0x7f70dac224a8> request = <SubRequest 'libvirt_dbus_setup' for <Function 'test_connect_list_networks'>> @pytest.fixture(autouse=True) def libvirt_dbus_setup(self, request): """Start libvirt-dbus for each test function """ os.environ['LIBVIRT_DEBUG'] = '3' self.libvirt_dbus = subprocess.Popen([exe, '--session']) self.bus = dbus.SessionBus() for i in range(10): if self.bus.name_has_owner('org.libvirt'): break time.sleep(0.1) else: > raise TimeoutError('error starting libvirt-dbus') E TimeoutError: error starting libvirt-dbus ../../tests/libvirttest.py:44: TimeoutError ERROR at setup of TestConnect.test_connect_storage_vol_lookup_by_property[StorageVolLookupByPath-Path] self = <test_connect.TestConnect object at 0x7f70dab6fe48> @pytest.fixture def storage_volume_create(self): """ Fixture to create dummy storage volume on the test driver This fixture should be used in the setup of every test manipulating with test volume. """ _, test_storage_pool = self.get_test_storage_pool() interface_obj = dbus.Interface(test_storage_pool, 'org.libvirt.StoragePool') > path = interface_obj.StorageVolCreateXML(xmldata.minimal_storage_vol_xml, 0) ../../tests/libvirttest.py:122: _ _ _ _ _ _ _ _ _ _ _ _ _ _ _ _ _ _ _ _ _ _ _ _ _ _ _ _ _ _ _ _ _ _ _ _ _ _ _ _ /usr/lib64/python3.6/site-packages/dbus/proxies.py:70: in __call__ return self._proxy_method(*args, **keywords) /usr/lib64/python3.6/site-packages/dbus/proxies.py:145: in __call__ **keywords) _ _ _ _ _ _ _ _ _ _ _ _ _ _ _ _ _ _ _ _ _ _ _ _ _ _ _ _ _ _ _ _ _ _ _ _ _ _ _ _ self = <dbus._dbus.SessionBus (session) at 0x7f70dac78258> bus_name = dbus.String(':1.17') object_path = dbus.ObjectPath('/org/libvirt/Test/storagepool/_35bb2ad9_388a_cdfe_461a_b8907f6e53fe') dbus_interface = 'org.libvirt.StoragePool', method = 'StorageVolCreateXML' signature = 'su' args = ('\n<volume>\n <name>sparse.img</name>\n <capacity unit="G">2</capacity>\n <target>\n <path>/var/lib/virt/images/sparse.img</path>\n </target>\n</volume>\n', 0) timeout = -1.0, byte_arrays = False, kwargs = {} get_args_opts = {'byte_arrays': False} message = <dbus.lowlevel.MethodCallMessage path: /org/libvirt/Test/storagepool/_35bb2ad9_388a_cdfe_461a_b8907f6e53fe, iface: org.libvirt.StoragePool, member: StorageVolCreateXML dest: :1.17> def call_blocking(self, bus_name, object_path, dbus_interface, method, signature, args, timeout=-1.0, byte_arrays=False, **kwargs): """Call the given method, synchronously. :Since: 0.81.0 """ if object_path == LOCAL_PATH: raise DBusException('Methods may not be called on the reserved ' 'path %s' % LOCAL_PATH) if dbus_interface == LOCAL_IFACE: raise DBusException('Methods may not be called on the reserved ' 'interface %s' % LOCAL_IFACE) # no need to validate other args - MethodCallMessage ctor will do get_args_opts = dict(byte_arrays=byte_arrays) if is_py2: get_args_opts['utf8_strings'] = kwargs.get('utf8_strings', False) elif 'utf8_strings' in kwargs: raise TypeError("unexpected keyword argument 'utf8_strings'") message = MethodCallMessage(destination=bus_name, path=object_path, interface=dbus_interface, method=method) # Add the arguments to the function try: message.append(signature=signature, *args) except Exception as e: logging.basicConfig() _logger.error('Unable to set arguments %r according to ' 'signature %r: %s: %s', args, signature, e.__class__, e) raise # make a blocking call reply_message = self.send_message_with_reply_and_block( > message, timeout) E dbus.exceptions.DBusException: org.libvirt.Error: operation failed: storage vol already exists /usr/lib64/python3.6/site-packages/dbus/connection.py:651: DBusException ===================== 33 passed, 2 error in 19.56 seconds ====================== FAIL test_connect.py (exit status: 1) FAIL: test_network.py ===================== ============================= test session starts ============================== platform linux -- Python 3.6.6, pytest-3.4.2, py-1.5.4, pluggy-0.6.0 rootdir: <https://ci.centos.org/job/libvirt-dbus-master-check/systems=libvirt-fedora-…,> inifile: collected 7 items ../../tests/test_network.py ..E...F [100%] ==================================== ERRORS ==================================== ______________ ERROR at setup of TestNetwork.test_network_create _______________ self = <test_network.TestNetwork object at 0x7f3a613c1908> request = <SubRequest 'libvirt_dbus_setup' for <Function 'test_network_create'>> @pytest.fixture(autouse=True) def libvirt_dbus_setup(self, request): """Start libvirt-dbus for each test function """ os.environ['LIBVIRT_DEBUG'] = '3' self.libvirt_dbus = subprocess.Popen([exe, '--session']) self.bus = dbus.SessionBus() for i in range(10): if self.bus.name_has_owner('org.libvirt'): break time.sleep(0.1) else: > raise TimeoutError('error starting libvirt-dbus') E TimeoutError: error starting libvirt-dbus ../../tests/libvirttest.py:44: TimeoutError =================================== FAILURES =================================== TestNetwork.test_network_update[4-4-0-\n <host mac='00:16:3e:77:e2:ed' name='foo.example.com' ip='192.168.122.10'/>\n -0] self = <test_network.TestNetwork object at 0x7f3a6142e5f8>, command = '4' section = '4', parentIndex = 0 xml_str = "\n <host mac='00:16:3e:77:e2:ed' name='foo.example.com' ip='192.168.122.10'/>\n " flags = 0 @pytest.mark.parametrize("command, section, parentIndex, xml_str, flags", [ ('4', '4', 0, ip_dhcp_host_xml, 0), # add-first, ip-dhcp-host ]) def test_network_update(self, command, section, parentIndex, xml_str, flags): > _, test_network = self.get_test_network() ../../tests/test_network.py:91: _ _ _ _ _ _ _ _ _ _ _ _ _ _ _ _ _ _ _ _ _ _ _ _ _ _ _ _ _ _ _ _ _ _ _ _ _ _ _ _ self = <test_network.TestNetwork object at 0x7f3a6142e5f8> def get_test_network(self): """Fetch information for the test network from test driver Returns: (dbus.proxies.ProxyObject, dbus.proxies.ProxyObject): Test Network Object, Local proxy for the test Network Object. """ > path = self.connect.ListNetworks(0)[0] E IndexError: list index out of range ../../tests/libvirttest.py:138: IndexError --------------------------- Captured stderr teardown --------------------------- Disconnected from D-Bus. ================= 1 failed, 5 passed, 1 error in 8.61 seconds ================== FAIL test_network.py (exit status: 1) + exit 1 Build step 'Execute shell' marked build as failure
1 1
0 0
[Libvirt-ci] Build failed in Jenkins: libvirt-dbus-master-check » libvirt-freebsd-10 #359
by ci@centos.org 27 Aug '18

27 Aug '18
See <https://ci.centos.org/job/libvirt-dbus-master-check/systems=libvirt-freebsd…> ------------------------------------------ Started by upstream project "libvirt-dbus-master-check" build number 359 originally caused by: Started by upstream project "libvirt-dbus-master-syntax-check" build number 22 originally caused by: Started by upstream project "libvirt-dbus-master-build" build number 394 originally caused by: Started by upstream project "libvirt-glib-master-build" build number 1366 originally caused by: Started by upstream project "libvirt-master-build" build number 1710 originally caused by: Started by an SCM change [EnvInject] - Loading node environment variables. Building remotely on libvirt-freebsd-10 (libvirt) in workspace <https://ci.centos.org/job/libvirt-dbus-master-check/systems=libvirt-freebsd…> [libvirt-dbus-master] $ /bin/sh -xe /tmp/jenkins7459245581264373786.sh + cd build + /usr/local/bin/gmake check Making check in data gmake[1]: Entering directory '/usr<https://ci.centos.org/job/libvirt-dbus-master-check/systems=libvirt-freebsd…'> gmake[1]: Nothing to be done for 'check'. gmake[1]: Leaving directory '/usr<https://ci.centos.org/job/libvirt-dbus-master-check/systems=libvirt-freebsd…'> Making check in docs gmake[1]: Entering directory '/usr<https://ci.centos.org/job/libvirt-dbus-master-check/systems=libvirt-freebsd…'> gmake[1]: Nothing to be done for 'check'. gmake[1]: Leaving directory '/usr<https://ci.centos.org/job/libvirt-dbus-master-check/systems=libvirt-freebsd…'> Making check in src gmake[1]: Entering directory '/usr<https://ci.centos.org/job/libvirt-dbus-master-check/systems=libvirt-freebsd…'> gmake[1]: Nothing to be done for 'check'. gmake[1]: Leaving directory '/usr<https://ci.centos.org/job/libvirt-dbus-master-check/systems=libvirt-freebsd…'> Making check in tests gmake[1]: Entering directory '/usr<https://ci.centos.org/job/libvirt-dbus-master-check/systems=libvirt-freebsd…'> /usr/local/bin/gmake test_util gmake[2]: Entering directory '/usr<https://ci.centos.org/job/libvirt-dbus-master-check/systems=libvirt-freebsd…'> CC test_util-test_util.o CCLD test_util gmake[2]: Leaving directory '/usr<https://ci.centos.org/job/libvirt-dbus-master-check/systems=libvirt-freebsd…'> /usr/local/bin/gmake check-TESTS gmake[2]: Entering directory '/usr<https://ci.centos.org/job/libvirt-dbus-master-check/systems=libvirt-freebsd…'> gmake[3]: Entering directory '/usr<https://ci.centos.org/job/libvirt-dbus-master-check/systems=libvirt-freebsd…'> PASS: test_util PASS: test_interface.py PASS: test_domain.py PASS: test_network.py FAIL: test_connect.py PASS: test_nodedev.py PASS: test_storage.py ============================================================================ Testsuite summary for libvirt-dbus 1.3.0 ============================================================================ # TOTAL: 7 # PASS: 6 # SKIP: 0 # XFAIL: 0 # FAIL: 1 # XPASS: 0 # ERROR: 0 ============================================================================ See tests/test-suite.log Please report to libvir-list(a)redhat.com ============================================================================ gmake[3]: *** [Makefile:766: test-suite.log] Error 1 gmake[3]: Leaving directory '/usr<https://ci.centos.org/job/libvirt-dbus-master-check/systems=libvirt-freebsd…'> gmake[2]: *** [Makefile:874: check-TESTS] Error 2 gmake[2]: Leaving directory '/usr<https://ci.centos.org/job/libvirt-dbus-master-check/systems=libvirt-freebsd…'> gmake[1]: *** [Makefile:990: check-am] Error 2 gmake[1]: Leaving directory '/usr<https://ci.centos.org/job/libvirt-dbus-master-check/systems=libvirt-freebsd…'> gmake: *** [Makefile:460: check-recursive] Error 1 + cat tests/test-suite.log ============================================== libvirt-dbus 1.3.0: tests/test-suite.log ============================================== # TOTAL: 7 # PASS: 6 # SKIP: 0 # XFAIL: 0 # FAIL: 1 # XPASS: 0 # ERROR: 0 .. contents:: :depth: 2 FAIL: test_connect.py ===================== ============================= test session starts ============================== platform freebsd10 -- Python 3.6.5, pytest-3.4.2, py-1.5.3, pluggy-0.6.0 rootdir: /usr<https://ci.centos.org/job/libvirt-dbus-master-check/systems=libvirt-freebsd…,> inifile: collected 35 items ../../tests/test_connect.py ..............E...................E [100%] ==================================== ERRORS ==================================== ERROR at setup of TestConnect.test_connect_interface_lookup_by_property[InterfaceLookupByName-Name] self = <test_connect.TestConnect object at 0x80950a5f8> request = <SubRequest 'libvirt_dbus_setup' for <Function 'test_connect_interface_lookup_by_property[InterfaceLookupByName-Name]'>> @pytest.fixture(autouse=True) def libvirt_dbus_setup(self, request): """Start libvirt-dbus for each test function """ os.environ['LIBVIRT_DEBUG'] = '3' self.libvirt_dbus = subprocess.Popen([exe, '--session']) self.bus = dbus.SessionBus() for i in range(10): if self.bus.name_has_owner('org.libvirt'): break time.sleep(0.1) else: > raise TimeoutError('error starting libvirt-dbus') E TimeoutError: error starting libvirt-dbus ../../tests/libvirttest.py:44: TimeoutError ERROR at setup of TestConnect.test_connect_storage_vol_lookup_by_property[StorageVolLookupByPath-Path] self = <test_connect.TestConnect object at 0x8094c8ef0> @pytest.fixture def storage_volume_create(self): """ Fixture to create dummy storage volume on the test driver This fixture should be used in the setup of every test manipulating with test volume. """ _, test_storage_pool = self.get_test_storage_pool() interface_obj = dbus.Interface(test_storage_pool, 'org.libvirt.StoragePool') > path = interface_obj.StorageVolCreateXML(xmldata.minimal_storage_vol_xml, 0) ../../tests/libvirttest.py:122: _ _ _ _ _ _ _ _ _ _ _ _ _ _ _ _ _ _ _ _ _ _ _ _ _ _ _ _ _ _ _ _ _ _ _ _ _ _ _ _ /usr/local/lib/python3.6/site-packages/dbus/proxies.py:70: in __call__ return self._proxy_method(*args, **keywords) /usr/local/lib/python3.6/site-packages/dbus/proxies.py:145: in __call__ **keywords) _ _ _ _ _ _ _ _ _ _ _ _ _ _ _ _ _ _ _ _ _ _ _ _ _ _ _ _ _ _ _ _ _ _ _ _ _ _ _ _ self = <dbus._dbus.SessionBus (session) at 0x8090b06d0> bus_name = dbus.String(':1.15') object_path = dbus.ObjectPath('/org/libvirt/Test/storagepool/_dfe224cb_28fb_8dd0_c4b2_64eb3f0f4566') dbus_interface = 'org.libvirt.StoragePool', method = 'StorageVolCreateXML' signature = 'su' args = ('\n<volume>\n <name>sparse.img</name>\n <capacity unit="G">2</capacity>\n <target>\n <path>/var/lib/virt/images/sparse.img</path>\n </target>\n</volume>\n', 0) timeout = -1.0, byte_arrays = False, kwargs = {} get_args_opts = {'byte_arrays': False} message = <dbus.lowlevel.MethodCallMessage path: /org/libvirt/Test/storagepool/_dfe224cb_28fb_8dd0_c4b2_64eb3f0f4566, iface: org.libvirt.StoragePool, member: StorageVolCreateXML dest: :1.15> def call_blocking(self, bus_name, object_path, dbus_interface, method, signature, args, timeout=-1.0, byte_arrays=False, **kwargs): """Call the given method, synchronously. :Since: 0.81.0 """ if object_path == LOCAL_PATH: raise DBusException('Methods may not be called on the reserved ' 'path %s' % LOCAL_PATH) if dbus_interface == LOCAL_IFACE: raise DBusException('Methods may not be called on the reserved ' 'interface %s' % LOCAL_IFACE) # no need to validate other args - MethodCallMessage ctor will do get_args_opts = dict(byte_arrays=byte_arrays) if is_py2: get_args_opts['utf8_strings'] = kwargs.get('utf8_strings', False) elif 'utf8_strings' in kwargs: raise TypeError("unexpected keyword argument 'utf8_strings'") message = MethodCallMessage(destination=bus_name, path=object_path, interface=dbus_interface, method=method) # Add the arguments to the function try: message.append(signature=signature, *args) except Exception as e: logging.basicConfig() _logger.error('Unable to set arguments %r according to ' 'signature %r: %s: %s', args, signature, e.__class__, e) raise # make a blocking call reply_message = self.send_message_with_reply_and_block( > message, timeout) E dbus.exceptions.DBusException: org.libvirt.Error: operation failed: storage vol already exists /usr/local/lib/python3.6/site-packages/dbus/connection.py:651: DBusException ===================== 33 passed, 2 error in 15.36 seconds ====================== FAIL test_connect.py (exit status: 1) + exit 1 Build step 'Execute shell' marked build as failure
1 1
0 0
[Libvirt-ci] Still Failing: libvirt/libvirt#1619 (master - b14b88b)
by Travis CI 27 Aug '18

27 Aug '18
Build Update for libvirt/libvirt ------------------------------------- Build: #1619 Status: Still Failing Duration: 22 mins and 2 secs Commit: b14b88b (master) Author: Pavel Hrdina Message: vircgroup: Remove obsolete sa_assert Reviewed-by: Ján Tomko <jtomko(a)redhat.com> Signed-off-by: Pavel Hrdina <phrdina(a)redhat.com> View the changeset: https://github.com/libvirt/libvirt/compare/0fa11dc0c9ca...b14b88b74c10 View the full build log and details: https://travis-ci.org/libvirt/libvirt/builds/421163461?utm_source=email&utm… -- You can configure recipients for build notifications in your .travis.yml file. See https://docs.travis-ci.com/user/notifications This email was sent to libvirt-ci(a)redhat.com (mailto:libvirt-ci@redhat.com) unsubscribe from this list (http://clicks.travis-ci.com/track/unsub.php?u=14313403&id=df27b8823dbf49cda…)
1 0
0 0
[Libvirt-ci] Still Failing: libvirt/libvirt#1618 (master - 0fa11dc)
by Travis CI 27 Aug '18

27 Aug '18
Build Update for libvirt/libvirt ------------------------------------- Build: #1618 Status: Still Failing Duration: 29 mins and 8 secs Commit: 0fa11dc (master) Author: Peter Krempa Message: tests: qemuxml2argv: Drop some unused args files aarch64-acpi-nouefi and hostdev-scsi-boot are unused. Noticed when checking whether '-nodefconfig' is still used by libvirt. Unused since their introduction in commit deb38c4 and bab6ee6 respectively. Signed-off-by: Peter Krempa <pkrempa(a)redhat.com> Reviewed-by: Ján Tomko <jtomko(a)redhat.com> View the changeset: https://github.com/libvirt/libvirt/compare/aa3e07caec61...0fa11dc0c9ca View the full build log and details: https://travis-ci.org/libvirt/libvirt/builds/421150716?utm_source=email&utm… -- You can configure recipients for build notifications in your .travis.yml file. See https://docs.travis-ci.com/user/notifications This email was sent to libvirt-ci(a)redhat.com (mailto:libvirt-ci@redhat.com) unsubscribe from this list (http://clicks.travis-ci.com/track/unsub.php?u=14313403&id=364489a8126843899…)
1 0
0 0
[Libvirt-ci] Still Failing: libvirt/libvirt#1617 (master - aa3e07c)
by Travis CI 27 Aug '18

27 Aug '18
Build Update for libvirt/libvirt ------------------------------------- Build: #1617 Status: Still Failing Duration: 22 mins and 12 secs Commit: aa3e07c (master) Author: Katerina Koukiou Message: qemu: qemuDomainChangeNet: validity checks should be done before XML autocompletion This patch ensures that changes in attributes of interfaces will emit errors except if they are missing from the XML. Previously we were falsely reporting successful updates, because some changed attributes got overwritten before the validity checks. https://bugzilla.redhat.com/show_bug.cgi?id=1599513 Signed-off-by: Katerina Koukiou <kkoukiou(a)redhat.com> Reviewed-by: Ján Tomko <jtomko(a)redhat.com> View the changeset: https://github.com/libvirt/libvirt/compare/8741b9435108...aa3e07caec61 View the full build log and details: https://travis-ci.org/libvirt/libvirt/builds/421144340?utm_source=email&utm… -- You can configure recipients for build notifications in your .travis.yml file. See https://docs.travis-ci.com/user/notifications This email was sent to libvirt-ci(a)redhat.com (mailto:libvirt-ci@redhat.com) unsubscribe from this list (http://clicks.travis-ci.com/track/unsub.php?u=14313403&id=293a1f1a25584d5da…)
1 0
0 0
[Libvirt-ci] Still Failing: libvirt/libvirt#1616 (master - 8741b94)
by Travis CI 27 Aug '18

27 Aug '18
Build Update for libvirt/libvirt ------------------------------------- Build: #1616 Status: Still Failing Duration: 27 mins and 8 secs Commit: 8741b94 (master) Author: Christian Ehrhardt Message: apparmor: fix ptrace rules with kernel 4.18 Due to kernel upstream change 338d0be4 ("apparmor: fix ptrace read check") libvirt now hits apparmor denies like: apparmor="DENIED" operation="ptrace" profile="/usr/sbin/libvirtd" pid=4409 comm="libvirtd" requested_mask="read" denied_mask="read" peer="libvirt-14e92a75-7668-4b97-8f92-322fc1b9c78a" Extend the ptrace rule to also allow 'ptrace (read)' for libvirtd to work with these newer kernels. Fixes: https://bugs.launchpad.net/bugs/1788603 Reported-by: Thadeu Lima de Souza Cascardo <thadeu.cascardo(a)canonical.com> Reviewed-by: Erik Skultety <eskultet(a)redhat.com> Acked-by: Jamie Strandboge <jamie(a)canonical.com> Signed-off-by: Christian Ehrhardt <christian.ehrhardt(a)canonical.com> View the changeset: https://github.com/libvirt/libvirt/compare/171aa72baaee...8741b9435108 View the full build log and details: https://travis-ci.org/libvirt/libvirt/builds/421005577?utm_source=email&utm… -- You can configure recipients for build notifications in your .travis.yml file. See https://docs.travis-ci.com/user/notifications This email was sent to libvirt-ci(a)redhat.com (mailto:libvirt-ci@redhat.com) unsubscribe from this list (http://clicks.travis-ci.com/track/unsub.php?u=14313403&id=a63b104e6b654ae9a…)
1 0
0 0
[Libvirt-ci] Errored: libvirt/libvirt#1615 (master - 171aa72)
by Travis CI 27 Aug '18

27 Aug '18
Build Update for libvirt/libvirt ------------------------------------- Build: #1615 Status: Errored Duration: 19 mins and 15 secs Commit: 171aa72 (master) Author: Roman Bolshakov Message: qemu: Start domain on a node without cpu affinity qemuProcessInitCpuAffinity prevents a VM from getting started on a platform that uses cpu affinity wrapper stubs e.g. macOS. The patch adds qemuProcessInitCpuAffinity stub on all platforms without HAVE_SCHED_GETAFFINITY or HAVE_BSD_CPU_AFFINITY. Signed-off-by: Roman Bolshakov <r.bolshakov(a)yadro.com> Signed-off-by: Michal Privoznik <mprivozn(a)redhat.com> View the changeset: https://github.com/libvirt/libvirt/compare/3b89e1f96218...171aa72baaee View the full build log and details: https://travis-ci.org/libvirt/libvirt/builds/421001880?utm_source=email&utm… -- You can configure recipients for build notifications in your .travis.yml file. See https://docs.travis-ci.com/user/notifications This email was sent to libvirt-ci(a)redhat.com (mailto:libvirt-ci@redhat.com) unsubscribe from this list (http://clicks.travis-ci.com/track/unsub.php?u=14313403&id=4342ab52049148f69…)
1 0
0 0
[Libvirt-ci] Still Failing: libvirt/libvirt#1614 (master - 3b89e1f)
by Travis CI 24 Aug '18

24 Aug '18
Build Update for libvirt/libvirt ------------------------------------- Build: #1614 Status: Still Failing Duration: 20 mins and 58 secs Commit: 3b89e1f (master) Author: Peter Krempa Message: docs: api_extension: Don't encourage other tools than git Save us hassle in the list if anybody would read this. Signed-off-by: Peter Krempa <pkrempa(a)redhat.com> Reviewed-by: Erik Skultety <eskultet(a)redhat.com> View the changeset: https://github.com/libvirt/libvirt/compare/f2019083de34...3b89e1f96218 View the full build log and details: https://travis-ci.org/libvirt/libvirt/builds/420153438?utm_source=email&utm… -- You can configure recipients for build notifications in your .travis.yml file. See https://docs.travis-ci.com/user/notifications This email was sent to libvirt-ci(a)redhat.com (mailto:libvirt-ci@redhat.com) unsubscribe from this list (http://clicks.travis-ci.com/track/unsub.php?u=14313403&id=ae4975ff7a3345989…)
1 0
0 0
[Libvirt-ci] Still Failing: libvirt/libvirt#1613 (master - f201908)
by Travis CI 24 Aug '18

24 Aug '18
Build Update for libvirt/libvirt ------------------------------------- Build: #1613 Status: Still Failing Duration: 19 mins and 57 secs Commit: f201908 (master) Author: Peter Krempa Message: qemu: capabilities: Always assume QEMU_CAPS_ADD_FD The capability was usable since qemu 1.3 so we can remove all the detection code. Signed-off-by: Peter Krempa <pkrempa(a)redhat.com> Reviewed-by: John Ferlan <jferlan(a)redhat.com> View the changeset: https://github.com/libvirt/libvirt/compare/b04d1b6a35f9...f2019083de34 View the full build log and details: https://travis-ci.org/libvirt/libvirt/builds/420139864?utm_source=email&utm… -- You can configure recipients for build notifications in your .travis.yml file. See https://docs.travis-ci.com/user/notifications This email was sent to libvirt-ci(a)redhat.com (mailto:libvirt-ci@redhat.com) unsubscribe from this list (http://clicks.travis-ci.com/track/unsub.php?u=14313403&id=4ad29234a18a494a8…)
1 0
0 0
[Libvirt-ci] Still Failing: libvirt/libvirt#1612 (master - b04d1b6)
by Travis CI 24 Aug '18

24 Aug '18
Build Update for libvirt/libvirt ------------------------------------- Build: #1612 Status: Still Failing Duration: 28 mins and 35 secs Commit: b04d1b6 (master) Author: John Ferlan Message: storage: Add --shrink to qemu-img command when shrinking vol https://bugzilla.redhat.com/show_bug.cgi?id=1613746 When shrinking the capacity of a qcow2 or luks volume using the qemu-img program, the --shrink qualifier must be added. Signed-off-by: John Ferlan <jferlan(a)redhat.com> Reviewed-by: Daniel P. Berrangé <berrange(a)redhat.com> View the changeset: https://github.com/libvirt/libvirt/compare/b4833917f12a...b04d1b6a35f9 View the full build log and details: https://travis-ci.org/libvirt/libvirt/builds/420113524?utm_source=email&utm… -- You can configure recipients for build notifications in your .travis.yml file. See https://docs.travis-ci.com/user/notifications This email was sent to libvirt-ci(a)redhat.com (mailto:libvirt-ci@redhat.com) unsubscribe from this list (http://clicks.travis-ci.com/track/unsub.php?u=14313403&id=6018b4c49af04b0db…)
1 0
0 0
  • ← Newer
  • 1
  • ...
  • 845
  • 846
  • 847
  • 848
  • 849
  • 850
  • 851
  • ...
  • 1022
  • Older →

HyperKitty Powered by HyperKitty version 1.3.12.