libvirt List Archives
Sign In Sign Up
Manage this list Sign In Sign Up

Keyboard Shortcuts

Thread View

  • j: Next unread message
  • k: Previous unread message
  • j a: Jump to all threads
  • j l: Jump to MailingList overview

CI

Thread Start a new thread
Download
Threads by month
  • ----- 2026 -----
  • September
  • August
  • July
  • June
  • May
  • April
  • March
  • February
  • January
  • ----- 2025 -----
  • December
  • November
  • October
  • September
  • August
  • July
  • June
  • May
  • April
  • March
  • February
  • January
  • ----- 2024 -----
  • December
  • November
  • October
  • September
  • August
  • July
  • June
  • May
  • April
  • March
  • February
  • January
  • ----- 2023 -----
  • December
  • November
  • October
  • September
  • August
  • July
  • June
  • May
  • April
  • March
  • February
  • January
  • ----- 2022 -----
  • December
  • November
  • October
  • September
  • August
  • July
  • June
  • May
  • April
  • March
  • February
  • January
  • ----- 2021 -----
  • December
  • November
  • October
  • September
  • August
  • July
  • June
  • May
  • April
  • March
  • February
  • January
  • ----- 2020 -----
  • December
  • November
  • October
  • September
  • August
  • July
  • June
  • May
  • April
  • March
  • February
  • January
  • ----- 2019 -----
  • December
  • November
  • October
  • September
  • August
  • July
  • June
  • May
  • April
  • March
  • February
  • January
  • ----- 2018 -----
  • December
  • November
  • October
  • September
  • August
  • July
  • June
  • May
  • April
  • March
  • February
  • January
  • ----- 2017 -----
  • December
  • November
  • October
  • September
  • August
  • July
  • June
  • May
  • April
  • March
  • February
  • January
  • ----- 2016 -----
  • December
  • November
  • October
  • September
  • August
  • July
ci@lists.libvirt.org

  • 2 participants
  • 10211 discussions
[Libvirt-ci] Build failed in Jenkins: libvirt+mingw64-build » libvirt-fedora-rawhide #29
by ci@centos.org 14 Sep '18

14 Sep '18
See <https://ci.centos.org/job/libvirt+mingw64-build/systems=libvirt-fedora-rawh…> Changes: [mkletzan] Add functions for checking if user or group exists [mkletzan] qemu: Report less errors on driver startup ------------------------------------------ [...truncated 136.74 KB...] GEN util/virkeyname-linux.pod GEN util/virkeyname-osx.pod GEN util/virkeyname-win32.pod CC util/libvirt_util_la-viralloc.lo CC util/libvirt_util_la-virarch.lo CC util/libvirt_util_la-virarptable.lo CC util/libvirt_util_la-viratomic.lo CC util/libvirt_util_la-viraudit.lo CC util/libvirt_util_la-virauth.lo CC util/libvirt_util_la-virauthconfig.lo CC util/libvirt_util_la-virbitmap.lo CC util/libvirt_util_la-virbuffer.lo CC util/libvirt_util_la-virperf.lo CC util/libvirt_util_la-vircgroup.lo CC util/libvirt_util_la-virclosecallbacks.lo CC util/libvirt_util_la-vircommand.lo CC util/libvirt_util_la-virconf.lo CC util/libvirt_util_la-vircrypto.lo CC util/libvirt_util_la-virdbus.lo CC util/libvirt_util_la-virdevmapper.lo CC util/libvirt_util_la-virdnsmasq.lo CC util/libvirt_util_la-virebtables.lo CC util/libvirt_util_la-virerror.lo CC util/libvirt_util_la-virevent.lo CC util/libvirt_util_la-vireventpoll.lo CC util/libvirt_util_la-virfcp.lo CC util/libvirt_util_la-virfdstream.lo CC util/libvirt_util_la-virfile.lo CC util/libvirt_util_la-virfirewall.lo CC util/libvirt_util_la-virfirmware.lo CC util/libvirt_util_la-virgettext.lo CC util/libvirt_util_la-virgic.lo CC util/libvirt_util_la-virhash.lo CC util/libvirt_util_la-virhashcode.lo CC util/libvirt_util_la-virhook.lo CC util/libvirt_util_la-virhostcpu.lo CC util/libvirt_util_la-virhostdev.lo CC util/libvirt_util_la-virhostmem.lo CC util/libvirt_util_la-viridentity.lo CC util/libvirt_util_la-virinitctl.lo CC util/libvirt_util_la-viriptables.lo CC util/libvirt_util_la-viriscsi.lo CC util/libvirt_util_la-virjson.lo CC util/libvirt_util_la-virkeycode.lo CC util/libvirt_util_la-virkeyfile.lo CC util/libvirt_util_la-virlease.lo CC util/libvirt_util_la-virlockspace.lo CC util/libvirt_util_la-virlog.lo CC util/libvirt_util_la-virmacaddr.lo CC util/libvirt_util_la-virmacmap.lo CC util/libvirt_util_la-virmodule.lo CC util/libvirt_util_la-virnetdev.lo CC util/libvirt_util_la-virnetdevbandwidth.lo CC util/libvirt_util_la-virnetdevbridge.lo CC util/libvirt_util_la-virnetdevip.lo CC util/libvirt_util_la-virnetdevmacvlan.lo CC util/libvirt_util_la-virnetdevmidonet.lo CC util/libvirt_util_la-virnetdevopenvswitch.lo CC util/libvirt_util_la-virnetdevtap.lo CC util/libvirt_util_la-virnetdevveth.lo CC util/libvirt_util_la-virnetdevvlan.lo CC util/libvirt_util_la-virnetdevvportprofile.lo CC util/libvirt_util_la-virnetlink.lo CC util/libvirt_util_la-virnodesuspend.lo CC util/libvirt_util_la-virkmod.lo CC util/libvirt_util_la-virnuma.lo CC util/libvirt_util_la-virobject.lo CC util/libvirt_util_la-virpci.lo CC util/libvirt_util_la-virpidfile.lo CC util/libvirt_util_la-virpolkit.lo CC util/libvirt_util_la-virportallocator.lo CC util/libvirt_util_la-virprocess.lo CC util/libvirt_util_la-virqemu.lo CC util/libvirt_util_la-virrandom.lo CC util/libvirt_util_la-virresctrl.lo CC util/libvirt_util_la-virrotatingfile.lo CC util/libvirt_util_la-virscsi.lo CC util/libvirt_util_la-virscsihost.lo CC util/libvirt_util_la-virscsivhost.lo CC util/libvirt_util_la-virseclabel.lo CC util/libvirt_util_la-virsecret.lo CC util/libvirt_util_la-virsexpr.lo CC util/libvirt_util_la-virsocketaddr.lo CC util/libvirt_util_la-virstorageencryption.lo CC util/libvirt_util_la-virstoragefile.lo CC util/libvirt_util_la-virstoragefilebackend.lo CC util/libvirt_util_la-virstring.lo CC util/libvirt_util_la-virsysinfo.lo CC util/libvirt_util_la-virsystemd.lo CC util/libvirt_util_la-virthread.lo CC util/libvirt_util_la-virthreadjob.lo CC util/libvirt_util_la-virthreadpool.lo CC util/libvirt_util_la-virtime.lo CC util/libvirt_util_la-virtpm.lo CC util/libvirt_util_la-virtypedparam.lo CC util/libvirt_util_la-virusb.lo CC util/libvirt_util_la-viruri.lo CC util/libvirt_util_la-virutil.lo CC util/libvirt_util_la-viruuid.lo CC util/libvirt_util_la-virvhba.lo CC util/libvirt_util_la-virvsock.lo CC util/libvirt_util_la-virxml.lo CC util/libvirt_util_la-virmdev.lo CC util/libvirt_util_la-virfilecache.lo CC conf/libvirt_conf_la-netdev_bandwidth_conf.lo CC conf/libvirt_conf_la-netdev_vport_profile_conf.lo CC conf/libvirt_conf_la-netdev_vlan_conf.lo CC conf/libvirt_conf_la-capabilities.lo CC conf/libvirt_conf_la-domain_addr.lo CC conf/libvirt_conf_la-domain_capabilities.lo CC conf/libvirt_conf_la-domain_conf.lo CC conf/libvirt_conf_la-domain_audit.lo CC conf/libvirt_conf_la-domain_nwfilter.lo CC conf/libvirt_conf_la-virsavecookie.lo CC conf/libvirt_conf_la-snapshot_conf.lo CC conf/libvirt_conf_la-numa_conf.lo CC conf/libvirt_conf_la-virdomainobjlist.lo CC conf/libvirt_conf_la-object_event.lo CC conf/libvirt_conf_la-domain_event.lo CC conf/libvirt_conf_la-network_event.lo CC conf/libvirt_conf_la-storage_event.lo CC conf/libvirt_conf_la-node_device_event.lo CC conf/libvirt_conf_la-secret_event.lo CC conf/libvirt_conf_la-network_conf.lo CC conf/libvirt_conf_la-virnetworkobj.lo CC conf/libvirt_conf_la-networkcommon_conf.lo CC conf/libvirt_conf_la-nwfilter_params.lo CC conf/libvirt_conf_la-nwfilter_ipaddrmap.lo CC conf/libvirt_conf_la-nwfilter_conf.lo CC conf/libvirt_conf_la-virnwfilterobj.lo CC conf/libvirt_conf_la-virnwfilterbindingdef.lo CC conf/libvirt_conf_la-virnwfilterbindingobj.lo CC conf/libvirt_conf_la-virnwfilterbindingobjlist.lo CC conf/libvirt_conf_la-node_device_conf.lo CC conf/libvirt_conf_la-virnodedeviceobj.lo CC conf/libvirt_conf_la-storage_adapter_conf.lo CC conf/libvirt_conf_la-storage_conf.lo CC conf/libvirt_conf_la-virstorageobj.lo CC conf/libvirt_conf_la-interface_conf.lo CC conf/libvirt_conf_la-virinterfaceobj.lo CC conf/libvirt_conf_la-secret_conf.lo CC conf/libvirt_conf_la-virsecretobj.lo CC conf/libvirt_conf_la-cpu_conf.lo CC conf/libvirt_conf_la-virchrdev.lo CC conf/libvirt_conf_la-device_conf.lo CC cpu/libvirt_cpu_la-cpu.lo CC cpu/libvirt_cpu_la-cpu_x86.lo CC cpu/libvirt_cpu_la-cpu_s390.lo CC cpu/libvirt_cpu_la-cpu_arm.lo CC cpu/libvirt_cpu_la-cpu_ppc64.lo CC cpu/libvirt_cpu_la-cpu_map.lo CC security/libvirt_security_manager_la-security_driver.lo CC security/libvirt_security_manager_la-security_nop.lo CC security/libvirt_security_manager_la-security_stack.lo CC security/libvirt_security_manager_la-security_dac.lo CC security/libvirt_security_manager_la-security_manager.lo CC access/libvirt_driver_access_la-viraccessperm.lo CC access/libvirt_driver_access_la-viraccessmanager.lo CC access/libvirt_driver_access_la-viraccessdrivernop.lo CC access/libvirt_driver_access_la-viraccessdriverstack.lo CC access/libvirt_driver_access_la-viraccessapicheck.lo CC access/libvirt_driver_access_la-viraccessapicheckqemu.lo CC access/libvirt_driver_access_la-viraccessapichecklxc.lo CC access/libvirt_driver_access_la-viraccessdriverpolkit.lo CC rpc/libvirt_net_rpc_la-virnetmessage.lo CC rpc/libvirt_net_rpc_la-virnettlscontext.lo CC rpc/libvirt_net_rpc_la-virnetsocket.lo CC rpc/libvirt_net_rpc_la-virkeepalive.lo CC rpc/libvirt_net_rpc_la-virnetprotocol.lo CC rpc/libvirt_net_rpc_la-virkeepaliveprotocol.lo CC rpc/libvirt_net_rpc_la-virnetsshsession.lo CC rpc/libvirt_net_rpc_server_la-virnetserverprogram.lo CC rpc/libvirt_net_rpc_server_la-virnetserverservice.lo CC rpc/libvirt_net_rpc_server_la-virnetserverclient.lo CC rpc/libvirt_net_rpc_server_la-virnetservermdns.lo CC rpc/libvirt_net_rpc_server_la-virnetdaemon.lo CC rpc/libvirt_net_rpc_server_la-virnetserver.lo CC rpc/libvirt_net_rpc_client_la-virnetclientprogram.lo CC rpc/libvirt_net_rpc_client_la-virnetclientstream.lo CC rpc/libvirt_net_rpc_client_la-virnetclient.lo CC phyp/libvirt_driver_phyp_la-phyp_driver.lo CC test/libvirt_driver_test_la-test_driver.lo CC esx/libvirt_driver_esx_la-esx_driver.lo CC esx/libvirt_driver_esx_la-esx_interface_driver.lo CC esx/libvirt_driver_esx_la-esx_network_driver.lo CC esx/libvirt_driver_esx_la-esx_storage_driver.lo CC esx/libvirt_driver_esx_la-esx_storage_backend_vmfs.lo CC esx/libvirt_driver_esx_la-esx_storage_backend_iscsi.lo CC esx/libvirt_driver_esx_la-esx_stream.lo CC esx/libvirt_driver_esx_la-esx_util.lo CC esx/libvirt_driver_esx_la-esx_vi.lo CC esx/libvirt_driver_esx_la-esx_vi_methods.lo CC esx/libvirt_driver_esx_la-esx_vi_types.lo CC vmx/libvirt_vmx_la-vmx.lo CC vmware/libvirt_driver_vmware_la-vmware_driver.lo CC vmware/libvirt_driver_vmware_la-vmware_conf.lo CC secret/libvirt_secret_la-secret_util.lo CC remote/libvirt_driver_remote_la-remote_driver.lo CC remote/libvirt_driver_remote_la-remote_protocol.lo CC remote/libvirt_driver_remote_la-lxc_protocol.lo CC remote/libvirt_driver_remote_la-qemu_protocol.lo CC logging/libvirt_driver_la-log_protocol.lo CC logging/libvirt_driver_la-log_manager.lo CC locking/libvirt_driver_la-lock_manager.lo CC locking/libvirt_driver_la-lock_driver_nop.lo CC locking/libvirt_driver_la-domain_lock.lo CC admin/libvirt_admin_la-admin_protocol.lo CCLD libvirt_driver_admin.la GEN util/virkeycode-linux.7 GEN util/virkeycode-osx.7 GEN util/virkeycode-atset1.7 GEN util/virkeycode-atset2.7 GEN util/virkeycode-atset3.7 GEN util/virkeycode-xtkbd.7 GEN util/virkeycode-usb.7 GEN util/virkeycode-win32.7 GEN util/virkeycode-qnum.7 GEN util/virkeyname-linux.7 GEN util/virkeyname-osx.7 GEN util/virkeyname-win32.7 CCLD libvirt_util.la CCLD libvirt_conf.la CCLD libvirt_cpu.la CCLD libvirt_security_manager.la CCLD libvirt_driver_access.la CCLD libvirt-net-rpc.la CCLD libvirt-net-rpc-server.la CCLD libvirt-net-rpc-client.la CCLD libvirt_driver_phyp.la CCLD libvirt_driver_test.la CCLD libvirt_driver_esx.la CCLD libvirt_vmx.la CCLD libvirt_driver_vmware.la CCLD libvirt_secret.la CCLD libvirt_driver_remote.la CCLD libvirt_driver.la CCLD libvirt.la /usr/lib/gcc/x86_64-w64-mingw32/8.2.0/../../../../x86_64-w64-mingw32/bin/ld: Cannot export virDoesGroupExist: symbol not defined /usr/lib/gcc/x86_64-w64-mingw32/8.2.0/../../../../x86_64-w64-mingw32/bin/ld: Cannot export virDoesUserExist: symbol not defined collect2: error: ld returned 1 exit status gmake[3]: *** [Makefile:7567: libvirt.la] Error 1 rm util/virkeyname-osx.pod util/virkeycode-xtkbd.pod util/virkeycode-atset3.pod util/virkeycode-usb.pod util/virkeycode-qnum.pod util/virkeycode-win32.pod util/virkeyname-linux.pod util/virkeycode-osx.pod util/virkeycode-linux.pod util/virkeycode-atset1.pod util/virkeyname-win32.pod util/virkeycode-atset2.pod gmake[3]: Leaving directory '<https://ci.centos.org/job/libvirt+mingw64-build/systems=libvirt-fedora-rawh…'> gmake[2]: *** [Makefile:7001: all] Error 2 gmake[2]: Leaving directory '<https://ci.centos.org/job/libvirt+mingw64-build/systems=libvirt-fedora-rawh…'> gmake[1]: *** [Makefile:2111: all-recursive] Error 1 gmake[1]: Leaving directory '<https://ci.centos.org/job/libvirt+mingw64-build/systems=libvirt-fedora-rawh…'> gmake: *** [Makefile:2004: all] Error 2 Build step 'Execute shell' marked build as failure
1 1
0 0
[Libvirt-ci] Build failed in Jenkins: libvirt+mingw32-build » libvirt-fedora-rawhide #29
by ci@centos.org 14 Sep '18

14 Sep '18
See <https://ci.centos.org/job/libvirt+mingw32-build/systems=libvirt-fedora-rawh…> Changes: [mkletzan] Add functions for checking if user or group exists [mkletzan] qemu: Report less errors on driver startup ------------------------------------------ [...truncated 135.12 KB...] GEN util/virkeyname-linux.pod GEN util/virkeyname-osx.pod GEN util/virkeyname-win32.pod CC util/libvirt_util_la-viralloc.lo CC util/libvirt_util_la-virarch.lo CC util/libvirt_util_la-virarptable.lo CC util/libvirt_util_la-viratomic.lo CC util/libvirt_util_la-viraudit.lo CC util/libvirt_util_la-virauth.lo CC util/libvirt_util_la-virauthconfig.lo CC util/libvirt_util_la-virbitmap.lo CC util/libvirt_util_la-virbuffer.lo CC util/libvirt_util_la-virperf.lo CC util/libvirt_util_la-vircgroup.lo CC util/libvirt_util_la-virclosecallbacks.lo CC util/libvirt_util_la-vircommand.lo CC util/libvirt_util_la-virconf.lo CC util/libvirt_util_la-vircrypto.lo CC util/libvirt_util_la-virdbus.lo CC util/libvirt_util_la-virdevmapper.lo CC util/libvirt_util_la-virdnsmasq.lo CC util/libvirt_util_la-virebtables.lo CC util/libvirt_util_la-virerror.lo CC util/libvirt_util_la-virevent.lo CC util/libvirt_util_la-vireventpoll.lo CC util/libvirt_util_la-virfcp.lo CC util/libvirt_util_la-virfdstream.lo CC util/libvirt_util_la-virfile.lo CC util/libvirt_util_la-virfirewall.lo CC util/libvirt_util_la-virfirmware.lo CC util/libvirt_util_la-virgettext.lo CC util/libvirt_util_la-virgic.lo CC util/libvirt_util_la-virhash.lo CC util/libvirt_util_la-virhashcode.lo CC util/libvirt_util_la-virhook.lo CC util/libvirt_util_la-virhostcpu.lo CC util/libvirt_util_la-virhostdev.lo CC util/libvirt_util_la-virhostmem.lo CC util/libvirt_util_la-viridentity.lo CC util/libvirt_util_la-virinitctl.lo CC util/libvirt_util_la-viriptables.lo CC util/libvirt_util_la-viriscsi.lo CC util/libvirt_util_la-virjson.lo CC util/libvirt_util_la-virkeycode.lo CC util/libvirt_util_la-virkeyfile.lo CC util/libvirt_util_la-virlease.lo CC util/libvirt_util_la-virlockspace.lo CC util/libvirt_util_la-virlog.lo CC util/libvirt_util_la-virmacaddr.lo CC util/libvirt_util_la-virmacmap.lo CC util/libvirt_util_la-virmodule.lo CC util/libvirt_util_la-virnetdev.lo CC util/libvirt_util_la-virnetdevbandwidth.lo CC util/libvirt_util_la-virnetdevbridge.lo CC util/libvirt_util_la-virnetdevip.lo CC util/libvirt_util_la-virnetdevmacvlan.lo CC util/libvirt_util_la-virnetdevmidonet.lo CC util/libvirt_util_la-virnetdevopenvswitch.lo CC util/libvirt_util_la-virnetdevtap.lo CC util/libvirt_util_la-virnetdevveth.lo CC util/libvirt_util_la-virnetdevvlan.lo CC util/libvirt_util_la-virnetdevvportprofile.lo CC util/libvirt_util_la-virnetlink.lo CC util/libvirt_util_la-virnodesuspend.lo CC util/libvirt_util_la-virkmod.lo CC util/libvirt_util_la-virnuma.lo CC util/libvirt_util_la-virobject.lo CC util/libvirt_util_la-virpci.lo CC util/libvirt_util_la-virpidfile.lo CC util/libvirt_util_la-virpolkit.lo CC util/libvirt_util_la-virportallocator.lo CC util/libvirt_util_la-virprocess.lo CC util/libvirt_util_la-virqemu.lo CC util/libvirt_util_la-virrandom.lo CC util/libvirt_util_la-virresctrl.lo CC util/libvirt_util_la-virrotatingfile.lo CC util/libvirt_util_la-virscsi.lo CC util/libvirt_util_la-virscsihost.lo CC util/libvirt_util_la-virscsivhost.lo CC util/libvirt_util_la-virseclabel.lo CC util/libvirt_util_la-virsecret.lo CC util/libvirt_util_la-virsexpr.lo CC util/libvirt_util_la-virsocketaddr.lo CC util/libvirt_util_la-virstorageencryption.lo CC util/libvirt_util_la-virstoragefile.lo CC util/libvirt_util_la-virstoragefilebackend.lo CC util/libvirt_util_la-virstring.lo CC util/libvirt_util_la-virsysinfo.lo CC util/libvirt_util_la-virsystemd.lo CC util/libvirt_util_la-virthread.lo CC util/libvirt_util_la-virthreadjob.lo CC util/libvirt_util_la-virthreadpool.lo CC util/libvirt_util_la-virtime.lo CC util/libvirt_util_la-virtpm.lo CC util/libvirt_util_la-virtypedparam.lo CC util/libvirt_util_la-virusb.lo CC util/libvirt_util_la-viruri.lo CC util/libvirt_util_la-virutil.lo CC util/libvirt_util_la-viruuid.lo CC util/libvirt_util_la-virvhba.lo CC util/libvirt_util_la-virvsock.lo CC util/libvirt_util_la-virxml.lo CC util/libvirt_util_la-virmdev.lo CC util/libvirt_util_la-virfilecache.lo CC conf/libvirt_conf_la-netdev_bandwidth_conf.lo CC conf/libvirt_conf_la-netdev_vport_profile_conf.lo CC conf/libvirt_conf_la-netdev_vlan_conf.lo CC conf/libvirt_conf_la-capabilities.lo CC conf/libvirt_conf_la-domain_addr.lo CC conf/libvirt_conf_la-domain_capabilities.lo CC conf/libvirt_conf_la-domain_conf.lo CC conf/libvirt_conf_la-domain_audit.lo CC conf/libvirt_conf_la-domain_nwfilter.lo CC conf/libvirt_conf_la-virsavecookie.lo CC conf/libvirt_conf_la-snapshot_conf.lo CC conf/libvirt_conf_la-numa_conf.lo CC conf/libvirt_conf_la-virdomainobjlist.lo CC conf/libvirt_conf_la-object_event.lo CC conf/libvirt_conf_la-domain_event.lo CC conf/libvirt_conf_la-network_event.lo CC conf/libvirt_conf_la-storage_event.lo CC conf/libvirt_conf_la-node_device_event.lo CC conf/libvirt_conf_la-secret_event.lo CC conf/libvirt_conf_la-network_conf.lo CC conf/libvirt_conf_la-virnetworkobj.lo CC conf/libvirt_conf_la-networkcommon_conf.lo CC conf/libvirt_conf_la-nwfilter_params.lo CC conf/libvirt_conf_la-nwfilter_ipaddrmap.lo CC conf/libvirt_conf_la-nwfilter_conf.lo CC conf/libvirt_conf_la-virnwfilterobj.lo CC conf/libvirt_conf_la-virnwfilterbindingdef.lo CC conf/libvirt_conf_la-virnwfilterbindingobj.lo CC conf/libvirt_conf_la-virnwfilterbindingobjlist.lo CC conf/libvirt_conf_la-node_device_conf.lo CC conf/libvirt_conf_la-virnodedeviceobj.lo CC conf/libvirt_conf_la-storage_adapter_conf.lo CC conf/libvirt_conf_la-storage_conf.lo CC conf/libvirt_conf_la-virstorageobj.lo CC conf/libvirt_conf_la-interface_conf.lo CC conf/libvirt_conf_la-virinterfaceobj.lo CC conf/libvirt_conf_la-secret_conf.lo CC conf/libvirt_conf_la-virsecretobj.lo CC conf/libvirt_conf_la-cpu_conf.lo CC conf/libvirt_conf_la-virchrdev.lo CC conf/libvirt_conf_la-device_conf.lo CC cpu/libvirt_cpu_la-cpu.lo CC cpu/libvirt_cpu_la-cpu_x86.lo CC cpu/libvirt_cpu_la-cpu_s390.lo CC cpu/libvirt_cpu_la-cpu_arm.lo CC cpu/libvirt_cpu_la-cpu_ppc64.lo CC cpu/libvirt_cpu_la-cpu_map.lo CC security/libvirt_security_manager_la-security_driver.lo CC security/libvirt_security_manager_la-security_nop.lo CC security/libvirt_security_manager_la-security_stack.lo CC security/libvirt_security_manager_la-security_dac.lo CC security/libvirt_security_manager_la-security_manager.lo CC access/libvirt_driver_access_la-viraccessperm.lo CC access/libvirt_driver_access_la-viraccessmanager.lo CC access/libvirt_driver_access_la-viraccessdrivernop.lo CC access/libvirt_driver_access_la-viraccessdriverstack.lo CC access/libvirt_driver_access_la-viraccessapicheck.lo CC access/libvirt_driver_access_la-viraccessapicheckqemu.lo CC access/libvirt_driver_access_la-viraccessapichecklxc.lo CC access/libvirt_driver_access_la-viraccessdriverpolkit.lo CC rpc/libvirt_net_rpc_la-virnetmessage.lo CC rpc/libvirt_net_rpc_la-virnettlscontext.lo CC rpc/libvirt_net_rpc_la-virnetsocket.lo CC rpc/libvirt_net_rpc_la-virkeepalive.lo CC rpc/libvirt_net_rpc_la-virnetprotocol.lo CC rpc/libvirt_net_rpc_la-virkeepaliveprotocol.lo CC rpc/libvirt_net_rpc_la-virnetsshsession.lo CC rpc/libvirt_net_rpc_server_la-virnetserverprogram.lo CC rpc/libvirt_net_rpc_server_la-virnetserverservice.lo CC rpc/libvirt_net_rpc_server_la-virnetserverclient.lo CC rpc/libvirt_net_rpc_server_la-virnetservermdns.lo CC rpc/libvirt_net_rpc_server_la-virnetdaemon.lo CC rpc/libvirt_net_rpc_server_la-virnetserver.lo CC rpc/libvirt_net_rpc_client_la-virnetclientprogram.lo CC rpc/libvirt_net_rpc_client_la-virnetclientstream.lo CC rpc/libvirt_net_rpc_client_la-virnetclient.lo CC phyp/libvirt_driver_phyp_la-phyp_driver.lo CC test/libvirt_driver_test_la-test_driver.lo CC esx/libvirt_driver_esx_la-esx_driver.lo CC esx/libvirt_driver_esx_la-esx_interface_driver.lo CC esx/libvirt_driver_esx_la-esx_network_driver.lo CC esx/libvirt_driver_esx_la-esx_storage_driver.lo CC esx/libvirt_driver_esx_la-esx_storage_backend_vmfs.lo CC esx/libvirt_driver_esx_la-esx_storage_backend_iscsi.lo CC esx/libvirt_driver_esx_la-esx_stream.lo CC esx/libvirt_driver_esx_la-esx_util.lo CC esx/libvirt_driver_esx_la-esx_vi.lo CC esx/libvirt_driver_esx_la-esx_vi_methods.lo CC esx/libvirt_driver_esx_la-esx_vi_types.lo CC vmx/libvirt_vmx_la-vmx.lo CC vmware/libvirt_driver_vmware_la-vmware_driver.lo CC vmware/libvirt_driver_vmware_la-vmware_conf.lo CC secret/libvirt_secret_la-secret_util.lo CC remote/libvirt_driver_remote_la-remote_driver.lo CC remote/libvirt_driver_remote_la-remote_protocol.lo CC remote/libvirt_driver_remote_la-lxc_protocol.lo CC remote/libvirt_driver_remote_la-qemu_protocol.lo CC logging/libvirt_driver_la-log_protocol.lo CC logging/libvirt_driver_la-log_manager.lo CC locking/libvirt_driver_la-lock_manager.lo CC locking/libvirt_driver_la-lock_driver_nop.lo CC locking/libvirt_driver_la-domain_lock.lo CC admin/libvirt_admin_la-admin_protocol.lo CCLD libvirt_driver_admin.la GEN util/virkeycode-linux.7 GEN util/virkeycode-osx.7 GEN util/virkeycode-atset1.7 GEN util/virkeycode-atset2.7 GEN util/virkeycode-atset3.7 GEN util/virkeycode-xtkbd.7 GEN util/virkeycode-usb.7 GEN util/virkeycode-win32.7 GEN util/virkeycode-qnum.7 GEN util/virkeyname-linux.7 GEN util/virkeyname-osx.7 GEN util/virkeyname-win32.7 CCLD libvirt_util.la CCLD libvirt_conf.la CCLD libvirt_cpu.la CCLD libvirt_security_manager.la CCLD libvirt_driver_access.la CCLD libvirt-net-rpc.la CCLD libvirt-net-rpc-server.la CCLD libvirt-net-rpc-client.la CCLD libvirt_driver_phyp.la CCLD libvirt_driver_test.la CCLD libvirt_driver_esx.la CCLD libvirt_vmx.la CCLD libvirt_driver_vmware.la CCLD libvirt_secret.la CCLD libvirt_driver_remote.la CCLD libvirt_driver.la CCLD libvirt.la /usr/lib/gcc/i686-w64-mingw32/8.2.0/../../../../i686-w64-mingw32/bin/ld: Cannot export virDoesGroupExist: symbol not defined /usr/lib/gcc/i686-w64-mingw32/8.2.0/../../../../i686-w64-mingw32/bin/ld: Cannot export virDoesUserExist: symbol not defined collect2: error: ld returned 1 exit status gmake[3]: *** [Makefile:7567: libvirt.la] Error 1 rm util/virkeyname-osx.pod util/virkeycode-xtkbd.pod util/virkeycode-atset3.pod util/virkeycode-usb.pod util/virkeycode-qnum.pod util/virkeycode-win32.pod util/virkeyname-linux.pod util/virkeycode-osx.pod util/virkeycode-linux.pod util/virkeycode-atset1.pod util/virkeyname-win32.pod util/virkeycode-atset2.pod gmake[3]: Leaving directory '<https://ci.centos.org/job/libvirt+mingw32-build/systems=libvirt-fedora-rawh…'> gmake[2]: *** [Makefile:7001: all] Error 2 gmake[2]: Leaving directory '<https://ci.centos.org/job/libvirt+mingw32-build/systems=libvirt-fedora-rawh…'> gmake[1]: *** [Makefile:2111: all-recursive] Error 1 gmake[1]: Leaving directory '<https://ci.centos.org/job/libvirt+mingw32-build/systems=libvirt-fedora-rawh…'> gmake: *** [Makefile:2004: all] Error 2 Build step 'Execute shell' marked build as failure
1 1
0 0
[Libvirt-ci] Fixed: libvirt/libvirt#1683 (master - b49a3ad)
by Travis CI 14 Sep '18

14 Sep '18
Build Update for libvirt/libvirt ------------------------------------- Build: #1683 Status: Fixed Duration: 20 mins and 56 secs Commit: b49a3ad (master) Author: Martin Kletzander Message: util: Add stubs for virDoes{User,Group}Exist() without getpwuid_r Signed-off-by: Martin Kletzander <mkletzan(a)redhat.com> View the changeset: https://github.com/libvirt/libvirt/compare/b907fd75fa82...b49a3ad799c1 View the full build log and details: https://travis-ci.org/libvirt/libvirt/builds/428501905?utm_source=email&utm… -- You can configure recipients for build notifications in your .travis.yml file. See https://docs.travis-ci.com/user/notifications This email was sent to libvirt-ci(a)redhat.com (mailto:libvirt-ci@redhat.com) unsubscribe from this list (http://clicks.travis-ci.com/track/unsub.php?u=14313403&id=242b42cb4c5b40f19…)
1 0
0 0
[Libvirt-ci] Broken: libvirt/libvirt#1682 (master - b907fd7)
by Travis CI 13 Sep '18

13 Sep '18
Build Update for libvirt/libvirt ------------------------------------- Build: #1682 Status: Broken Duration: 21 mins and 4 secs Commit: b907fd7 (master) Author: Martin Kletzander Message: qemu: Report less errors on driver startup It is not a problem at all if the `tss` user/group does not exist, the code fallbacks to the `root` user/group. However we report a warning for no reason on every start-up. Fix this by checking if the user/group actually exists. Signed-off-by: Martin Kletzander <mkletzan(a)redhat.com> View the changeset: https://github.com/libvirt/libvirt/compare/d7bc6af6487a...b907fd75fa82 View the full build log and details: https://travis-ci.org/libvirt/libvirt/builds/428191459?utm_source=email&utm… -- You can configure recipients for build notifications in your .travis.yml file. See https://docs.travis-ci.com/user/notifications This email was sent to libvirt-ci(a)redhat.com (mailto:libvirt-ci@redhat.com) unsubscribe from this list (http://clicks.travis-ci.com/track/unsub.php?u=14313403&id=8c79dd74778d408db…)
1 0
0 0
[Libvirt-ci] Build failed in Jenkins: libosinfo-check » libvirt-freebsd-10 #5
by ci@centos.org 11 Sep '18

11 Sep '18
See <https://ci.centos.org/job/libosinfo-check/systems=libvirt-freebsd-10/5/disp…> ------------------------------------------ Started by upstream project "libosinfo-check" build number 5 originally caused by: Started by upstream project "libosinfo-syntax-check" build number 5 originally caused by: Started by upstream project "libosinfo-build" build number 5 originally caused by: Started by an SCM change [EnvInject] - Loading node environment variables. Building remotely on libvirt-freebsd-10 (libvirt) in workspace <https://ci.centos.org/job/libosinfo-check/systems=libvirt-freebsd-10/ws/> [libosinfo] $ /bin/sh -xe /tmp/jenkins4309553921622154363.sh + cd build + /usr/local/bin/gmake check Making check in osinfo GEN public-submodule-commit gmake[1]: Entering directory '/usr<https://ci.centos.org/job/libosinfo-check/systems=libvirt-freebsd-10/ws/bui…'> /usr/local/bin/gmake check-am gmake[2]: Entering directory '/usr<https://ci.centos.org/job/libosinfo-check/systems=libvirt-freebsd-10/ws/bui…'> /usr/local/bin/gmake check-local gmake[3]: Entering directory '/usr<https://ci.centos.org/job/libosinfo-check/systems=libvirt-freebsd-10/ws/bui…'> GEN check-symsorting gmake[3]: Leaving directory '/usr<https://ci.centos.org/job/libosinfo-check/systems=libvirt-freebsd-10/ws/bui…'> gmake[2]: Leaving directory '/usr<https://ci.centos.org/job/libosinfo-check/systems=libvirt-freebsd-10/ws/bui…'> gmake[1]: Leaving directory '/usr<https://ci.centos.org/job/libosinfo-check/systems=libvirt-freebsd-10/ws/bui…'> Making check in tools gmake[1]: Entering directory '/usr<https://ci.centos.org/job/libosinfo-check/systems=libvirt-freebsd-10/ws/bui…'> gmake[1]: Nothing to be done for 'check'. gmake[1]: Leaving directory '/usr<https://ci.centos.org/job/libosinfo-check/systems=libvirt-freebsd-10/ws/bui…'> Making check in docs gmake[1]: Entering directory '/usr<https://ci.centos.org/job/libosinfo-check/systems=libvirt-freebsd-10/ws/bui…'> Making check in reference gmake[2]: Entering directory '/usr<https://ci.centos.org/job/libosinfo-check/systems=libvirt-freebsd-10/ws/bui…'> gmake[2]: Nothing to be done for 'check'. gmake[2]: Leaving directory '/usr<https://ci.centos.org/job/libosinfo-check/systems=libvirt-freebsd-10/ws/bui…'> gmake[2]: Entering directory '/usr<https://ci.centos.org/job/libosinfo-check/systems=libvirt-freebsd-10/ws/bui…'> gmake[2]: Nothing to be done for 'check-am'. gmake[2]: Leaving directory '/usr<https://ci.centos.org/job/libosinfo-check/systems=libvirt-freebsd-10/ws/bui…'> gmake[1]: Leaving directory '/usr<https://ci.centos.org/job/libosinfo-check/systems=libvirt-freebsd-10/ws/bui…'> Making check in po gmake[1]: Entering directory '/usr<https://ci.centos.org/job/libosinfo-check/systems=libvirt-freebsd-10/ws/bui…'> INTLTOOL_EXTRACT="/usr/local/bin/intltool-extract" XGETTEXT="/usr/local/bin/xgettext" srcdir=../../po /usr/local/bin/intltool-update --gettext-package libosinfo --pot rm -f missing notexist srcdir=../../po /usr/local/bin/intltool-update -m if [ -r missing -o -r notexist ]; then \ exit 1; \ fi gmake[1]: Leaving directory '/usr<https://ci.centos.org/job/libosinfo-check/systems=libvirt-freebsd-10/ws/bui…'> Making check in examples gmake[1]: Entering directory '/usr<https://ci.centos.org/job/libosinfo-check/systems=libvirt-freebsd-10/ws/bui…'> gmake[1]: Nothing to be done for 'check'. gmake[1]: Leaving directory '/usr<https://ci.centos.org/job/libosinfo-check/systems=libvirt-freebsd-10/ws/bui…'> Making check in tests gmake[1]: Entering directory '/usr<https://ci.centos.org/job/libosinfo-check/systems=libvirt-freebsd-10/ws/bui…'> /usr/local/bin/gmake test-entity test-device test-list test-devicelist test-filter test-product test-os test-oslist test-productfilter test-platform test-platformlist test-db test-loader test-isodetect test-install-script test-os-resources test-mediauris test-treeuris gmake[2]: Entering directory '/usr<https://ci.centos.org/job/libosinfo-check/systems=libvirt-freebsd-10/ws/bui…'> CC test_entity-test-entity.o CC test_device-test-device.o CC test_list-test-list.o CC test_devicelist-test-devicelist.o CC test_filter-test-filter.o CC test_product-test-product.o CC test_os-test-os.o CC test_oslist-test-oslist.o CC test_productfilter-test-productfilter.o CC test_platform-test-platform.o CC test_platformlist-test-platformlist.o CC test_db-test-db.o CC test_loader-test-loader.o CC test_isodetect-test-isodetect.o CC test_install_script-test-install-script.o CC test_os_resources-test-os-resources.o CC test_mediauris-test-mediauris.o CC test_treeuris-test-treeuris.o CCLD test-entity CCLD test-device CCLD test-list CCLD test-devicelist CCLD test-filter CCLD test-product CCLD test-os CCLD test-oslist CCLD test-productfilter CCLD test-platform CCLD test-platformlist CCLD test-db CCLD test-loader CCLD test-isodetect CCLD test-install-script CCLD test-os-resources CCLD test-mediauris CCLD test-treeuris gmake[2]: Leaving directory '/usr<https://ci.centos.org/job/libosinfo-check/systems=libvirt-freebsd-10/ws/bui…'> /usr/local/bin/gmake check-TESTS gmake[2]: Entering directory '/usr<https://ci.centos.org/job/libosinfo-check/systems=libvirt-freebsd-10/ws/bui…'> gmake[3]: Entering directory '/usr<https://ci.centos.org/job/libosinfo-check/systems=libvirt-freebsd-10/ws/bui…'> PASS: test-entity PASS: test-device PASS: test-list PASS: test-devicelist PASS: test-filter PASS: test-product PASS: test-oslist PASS: test-productfilter PASS: test-platform PASS: test-os PASS: test-platformlist PASS: test-db PASS: test-install-script PASS: test-loader PASS: test-os-resources SKIP: test-treeuris SKIP: test-mediauris Trace/BPT trap (core dumped) FAIL: test-isodetect ============================================================================ Testsuite summary for libosinfo 1.3.0 ============================================================================ # TOTAL: 18 # PASS: 15 # SKIP: 2 # XFAIL: 0 # FAIL: 1 # XPASS: 0 # ERROR: 0 ============================================================================ See tests/test-suite.log Please report to libosinfo(a)redhat.com ============================================================================ gmake[3]: *** [Makefile:1313: test-suite.log] Error 1 gmake[3]: Leaving directory '/usr<https://ci.centos.org/job/libosinfo-check/systems=libvirt-freebsd-10/ws/bui…'> gmake[2]: *** [Makefile:1421: check-TESTS] Error 2 gmake[2]: Leaving directory '/usr<https://ci.centos.org/job/libosinfo-check/systems=libvirt-freebsd-10/ws/bui…'> gmake[1]: *** [Makefile:1614: check-am] Error 2 gmake[1]: Leaving directory '/usr<https://ci.centos.org/job/libosinfo-check/systems=libvirt-freebsd-10/ws/bui…'> gmake: *** [Makefile:594: check-recursive] Error 1 + cat tests/test-suite.log =========================================== libosinfo 1.3.0: tests/test-suite.log =========================================== # TOTAL: 18 # PASS: 15 # SKIP: 2 # XFAIL: 0 # FAIL: 1 # XPASS: 0 # ERROR: 0 .. contents:: :depth: 2 FAIL: test-isodetect ==================== /isodetect/windows: ** (/usr<https://ci.centos.org/job/libosinfo-check/systems=libvirt-freebsd-10/ws/bui…>:39189): ERROR **: ISO en_windows_10_multi-edition_version_1709_updated_sept_2017_x64_dvd_100090817.iso.txt was not matched by OS win10 FAIL test-isodetect (exit status: 133) SKIP: test-mediauris ==================== SKIP test-mediauris (exit status: 77) SKIP: test-treeuris =================== SKIP test-treeuris (exit status: 77) + exit 1 Build step 'Execute shell' marked build as failure
1 1
0 0
[Libvirt-ci] Build failed in Jenkins: libosinfo-check » libvirt-freebsd-11 #5
by ci@centos.org 11 Sep '18

11 Sep '18
See <https://ci.centos.org/job/libosinfo-check/systems=libvirt-freebsd-11/5/disp…> ------------------------------------------ Started by upstream project "libosinfo-check" build number 5 originally caused by: Started by upstream project "libosinfo-syntax-check" build number 5 originally caused by: Started by upstream project "libosinfo-build" build number 5 originally caused by: Started by an SCM change [EnvInject] - Loading node environment variables. Building remotely on libvirt-freebsd-11 (libvirt) in workspace <https://ci.centos.org/job/libosinfo-check/systems=libvirt-freebsd-11/ws/> [libosinfo] $ /bin/sh -xe /tmp/jenkins1228952469544614615.sh + cd build + /usr/local/bin/gmake check Making check in osinfo GEN public-submodule-commit gmake[1]: Entering directory '/usr<https://ci.centos.org/job/libosinfo-check/systems=libvirt-freebsd-11/ws/bui…'> /usr/local/bin/gmake check-am gmake[2]: Entering directory '/usr<https://ci.centos.org/job/libosinfo-check/systems=libvirt-freebsd-11/ws/bui…'> /usr/local/bin/gmake check-local gmake[3]: Entering directory '/usr<https://ci.centos.org/job/libosinfo-check/systems=libvirt-freebsd-11/ws/bui…'> GEN check-symsorting gmake[3]: Leaving directory '/usr<https://ci.centos.org/job/libosinfo-check/systems=libvirt-freebsd-11/ws/bui…'> gmake[2]: Leaving directory '/usr<https://ci.centos.org/job/libosinfo-check/systems=libvirt-freebsd-11/ws/bui…'> gmake[1]: Leaving directory '/usr<https://ci.centos.org/job/libosinfo-check/systems=libvirt-freebsd-11/ws/bui…'> Making check in tools gmake[1]: Entering directory '/usr<https://ci.centos.org/job/libosinfo-check/systems=libvirt-freebsd-11/ws/bui…'> gmake[1]: Nothing to be done for 'check'. gmake[1]: Leaving directory '/usr<https://ci.centos.org/job/libosinfo-check/systems=libvirt-freebsd-11/ws/bui…'> Making check in docs gmake[1]: Entering directory '/usr<https://ci.centos.org/job/libosinfo-check/systems=libvirt-freebsd-11/ws/bui…'> Making check in reference gmake[2]: Entering directory '/usr<https://ci.centos.org/job/libosinfo-check/systems=libvirt-freebsd-11/ws/bui…'> gmake[2]: Nothing to be done for 'check'. gmake[2]: Leaving directory '/usr<https://ci.centos.org/job/libosinfo-check/systems=libvirt-freebsd-11/ws/bui…'> gmake[2]: Entering directory '/usr<https://ci.centos.org/job/libosinfo-check/systems=libvirt-freebsd-11/ws/bui…'> gmake[2]: Nothing to be done for 'check-am'. gmake[2]: Leaving directory '/usr<https://ci.centos.org/job/libosinfo-check/systems=libvirt-freebsd-11/ws/bui…'> gmake[1]: Leaving directory '/usr<https://ci.centos.org/job/libosinfo-check/systems=libvirt-freebsd-11/ws/bui…'> Making check in po gmake[1]: Entering directory '/usr<https://ci.centos.org/job/libosinfo-check/systems=libvirt-freebsd-11/ws/bui…'> INTLTOOL_EXTRACT="/usr/local/bin/intltool-extract" XGETTEXT="/usr/local/bin/xgettext" srcdir=../../po /usr/local/bin/intltool-update --gettext-package libosinfo --pot rm -f missing notexist srcdir=../../po /usr/local/bin/intltool-update -m if [ -r missing -o -r notexist ]; then \ exit 1; \ fi gmake[1]: Leaving directory '/usr<https://ci.centos.org/job/libosinfo-check/systems=libvirt-freebsd-11/ws/bui…'> Making check in examples gmake[1]: Entering directory '/usr<https://ci.centos.org/job/libosinfo-check/systems=libvirt-freebsd-11/ws/bui…'> gmake[1]: Nothing to be done for 'check'. gmake[1]: Leaving directory '/usr<https://ci.centos.org/job/libosinfo-check/systems=libvirt-freebsd-11/ws/bui…'> Making check in tests gmake[1]: Entering directory '/usr<https://ci.centos.org/job/libosinfo-check/systems=libvirt-freebsd-11/ws/bui…'> /usr/local/bin/gmake test-entity test-device test-list test-devicelist test-filter test-product test-os test-oslist test-productfilter test-platform test-platformlist test-db test-loader test-isodetect test-install-script test-os-resources test-mediauris test-treeuris gmake[2]: Entering directory '/usr<https://ci.centos.org/job/libosinfo-check/systems=libvirt-freebsd-11/ws/bui…'> CC test_entity-test-entity.o CC test_device-test-device.o CC test_list-test-list.o CC test_devicelist-test-devicelist.o CC test_filter-test-filter.o CC test_product-test-product.o CC test_os-test-os.o CC test_oslist-test-oslist.o CC test_productfilter-test-productfilter.o CC test_platform-test-platform.o CC test_platformlist-test-platformlist.o CC test_db-test-db.o CC test_loader-test-loader.o CC test_isodetect-test-isodetect.o CC test_install_script-test-install-script.o CC test_os_resources-test-os-resources.o CC test_mediauris-test-mediauris.o CC test_treeuris-test-treeuris.o CCLD test-entity CCLD test-device CCLD test-list CCLD test-devicelist CCLD test-filter CCLD test-product CCLD test-os CCLD test-oslist CCLD test-productfilter CCLD test-platform CCLD test-platformlist CCLD test-db CCLD test-loader CCLD test-isodetect CCLD test-install-script CCLD test-os-resources CCLD test-mediauris CCLD test-treeuris gmake[2]: Leaving directory '/usr<https://ci.centos.org/job/libosinfo-check/systems=libvirt-freebsd-11/ws/bui…'> /usr/local/bin/gmake check-TESTS gmake[2]: Entering directory '/usr<https://ci.centos.org/job/libosinfo-check/systems=libvirt-freebsd-11/ws/bui…'> gmake[3]: Entering directory '/usr<https://ci.centos.org/job/libosinfo-check/systems=libvirt-freebsd-11/ws/bui…'> PASS: test-list PASS: test-device PASS: test-entity PASS: test-devicelist PASS: test-product PASS: test-filter PASS: test-oslist PASS: test-productfilter PASS: test-os PASS: test-platform PASS: test-platformlist PASS: test-db PASS: test-install-script PASS: test-os-resources PASS: test-loader SKIP: test-treeuris SKIP: test-mediauris Trace/BPT trap (core dumped) FAIL: test-isodetect ============================================================================ Testsuite summary for libosinfo 1.3.0 ============================================================================ # TOTAL: 18 # PASS: 15 # SKIP: 2 # XFAIL: 0 # FAIL: 1 # XPASS: 0 # ERROR: 0 ============================================================================ See tests/test-suite.log Please report to libosinfo(a)redhat.com ============================================================================ gmake[3]: *** [Makefile:1313: test-suite.log] Error 1 gmake[3]: Leaving directory '/usr<https://ci.centos.org/job/libosinfo-check/systems=libvirt-freebsd-11/ws/bui…'> gmake[2]: *** [Makefile:1421: check-TESTS] Error 2 gmake[2]: Leaving directory '/usr<https://ci.centos.org/job/libosinfo-check/systems=libvirt-freebsd-11/ws/bui…'> gmake[1]: *** [Makefile:1614: check-am] Error 2 gmake[1]: Leaving directory '/usr<https://ci.centos.org/job/libosinfo-check/systems=libvirt-freebsd-11/ws/bui…'> gmake: *** [Makefile:594: check-recursive] Error 1 + cat tests/test-suite.log =========================================== libosinfo 1.3.0: tests/test-suite.log =========================================== # TOTAL: 18 # PASS: 15 # SKIP: 2 # XFAIL: 0 # FAIL: 1 # XPASS: 0 # ERROR: 0 .. contents:: :depth: 2 FAIL: test-isodetect ==================== /isodetect/windows: ** (/usr<https://ci.centos.org/job/libosinfo-check/systems=libvirt-freebsd-11/ws/bui…>:36760): ERROR **: ISO en_windows_10_multi-edition_version_1709_updated_sept_2017_x64_dvd_100090817.iso.txt was not matched by OS win10 FAIL test-isodetect (exit status: 133) SKIP: test-mediauris ==================== SKIP test-mediauris (exit status: 77) SKIP: test-treeuris =================== SKIP test-treeuris (exit status: 77) + exit 1 Build step 'Execute shell' marked build as failure
1 1
0 0
[Libvirt-ci] Build failed in Jenkins: libosinfo-check » libvirt-fedora-28 #5
by ci@centos.org 11 Sep '18

11 Sep '18
See <https://ci.centos.org/job/libosinfo-check/systems=libvirt-fedora-28/5/displ…> ------------------------------------------ Started by upstream project "libosinfo-check" build number 5 originally caused by: Started by upstream project "libosinfo-syntax-check" build number 5 originally caused by: Started by upstream project "libosinfo-build" build number 5 originally caused by: Started by an SCM change [EnvInject] - Loading node environment variables. Building remotely on libvirt-fedora-28 (libvirt) in workspace <https://ci.centos.org/job/libosinfo-check/systems=libvirt-fedora-28/ws/> [libosinfo] $ /bin/sh -xe /tmp/jenkins268519627809509611.sh + cd build + /usr/bin/gmake check Making check in osinfo GEN public-submodule-commit gmake[1]: Entering directory '<https://ci.centos.org/job/libosinfo-check/systems=libvirt-fedora-28/ws/buil…'> /usr/bin/gmake check-am gmake[2]: Entering directory '<https://ci.centos.org/job/libosinfo-check/systems=libvirt-fedora-28/ws/buil…'> /usr/bin/gmake check-local gmake[3]: Entering directory '<https://ci.centos.org/job/libosinfo-check/systems=libvirt-fedora-28/ws/buil…'> GEN check-symfile GEN check-symsorting gmake[3]: Leaving directory '<https://ci.centos.org/job/libosinfo-check/systems=libvirt-fedora-28/ws/buil…'> gmake[2]: Leaving directory '<https://ci.centos.org/job/libosinfo-check/systems=libvirt-fedora-28/ws/buil…'> gmake[1]: Leaving directory '<https://ci.centos.org/job/libosinfo-check/systems=libvirt-fedora-28/ws/buil…'> Making check in tools gmake[1]: Entering directory '<https://ci.centos.org/job/libosinfo-check/systems=libvirt-fedora-28/ws/buil…'> gmake[1]: Nothing to be done for 'check'. gmake[1]: Leaving directory '<https://ci.centos.org/job/libosinfo-check/systems=libvirt-fedora-28/ws/buil…'> Making check in docs gmake[1]: Entering directory '<https://ci.centos.org/job/libosinfo-check/systems=libvirt-fedora-28/ws/buil…'> Making check in reference gmake[2]: Entering directory '<https://ci.centos.org/job/libosinfo-check/systems=libvirt-fedora-28/ws/buil…'> gmake[2]: Nothing to be done for 'check'. gmake[2]: Leaving directory '<https://ci.centos.org/job/libosinfo-check/systems=libvirt-fedora-28/ws/buil…'> gmake[2]: Entering directory '<https://ci.centos.org/job/libosinfo-check/systems=libvirt-fedora-28/ws/buil…'> gmake[2]: Nothing to be done for 'check-am'. gmake[2]: Leaving directory '<https://ci.centos.org/job/libosinfo-check/systems=libvirt-fedora-28/ws/buil…'> gmake[1]: Leaving directory '<https://ci.centos.org/job/libosinfo-check/systems=libvirt-fedora-28/ws/buil…'> Making check in po gmake[1]: Entering directory '<https://ci.centos.org/job/libosinfo-check/systems=libvirt-fedora-28/ws/buil…'> INTLTOOL_EXTRACT="/usr/bin/intltool-extract" XGETTEXT="/usr/bin/xgettext" srcdir=../../po /usr/bin/intltool-update --gettext-package libosinfo --pot rm -f missing notexist srcdir=../../po /usr/bin/intltool-update -m if [ -r missing -o -r notexist ]; then \ exit 1; \ fi gmake[1]: Leaving directory '<https://ci.centos.org/job/libosinfo-check/systems=libvirt-fedora-28/ws/buil…'> Making check in examples gmake[1]: Entering directory '<https://ci.centos.org/job/libosinfo-check/systems=libvirt-fedora-28/ws/buil…'> gmake[1]: Nothing to be done for 'check'. gmake[1]: Leaving directory '<https://ci.centos.org/job/libosinfo-check/systems=libvirt-fedora-28/ws/buil…'> Making check in tests gmake[1]: Entering directory '<https://ci.centos.org/job/libosinfo-check/systems=libvirt-fedora-28/ws/buil…'> /usr/bin/gmake test-entity test-device test-list test-devicelist test-filter test-product test-os test-oslist test-productfilter test-platform test-platformlist test-db test-loader test-isodetect test-install-script test-os-resources test-mediauris test-treeuris gmake[2]: Entering directory '<https://ci.centos.org/job/libosinfo-check/systems=libvirt-fedora-28/ws/buil…'> CC test_entity-test-entity.o CC test_list-test-list.o CC test_device-test-device.o CC test_devicelist-test-devicelist.o CC test_filter-test-filter.o CC test_product-test-product.o CC test_os-test-os.o CC test_oslist-test-oslist.o CC test_productfilter-test-productfilter.o CC test_platform-test-platform.o CC test_platformlist-test-platformlist.o CC test_db-test-db.o CC test_loader-test-loader.o CC test_isodetect-test-isodetect.o CC test_install_script-test-install-script.o CC test_os_resources-test-os-resources.o CC test_mediauris-test-mediauris.o CC test_treeuris-test-treeuris.o CCLD test-entity CCLD test-device CCLD test-list CCLD test-devicelist CCLD test-filter CCLD test-product CCLD test-os CCLD test-oslist CCLD test-productfilter CCLD test-platform CCLD test-platformlist CCLD test-db CCLD test-loader CCLD test-isodetect CCLD test-install-script CCLD test-os-resources CCLD test-mediauris CCLD test-treeuris gmake[2]: Leaving directory '<https://ci.centos.org/job/libosinfo-check/systems=libvirt-fedora-28/ws/buil…'> /usr/bin/gmake check-TESTS gmake[2]: Entering directory '<https://ci.centos.org/job/libosinfo-check/systems=libvirt-fedora-28/ws/buil…'> gmake[3]: Entering directory '<https://ci.centos.org/job/libosinfo-check/systems=libvirt-fedora-28/ws/buil…'> PASS: test-list PASS: test-device PASS: test-entity PASS: test-devicelist PASS: test-filter PASS: test-product PASS: test-os PASS: test-oslist PASS: test-productfilter PASS: test-platform PASS: test-platformlist PASS: test-db PASS: test-install-script PASS: test-loader ../../build-aux/test-driver: line 107: 8914 Trace/breakpoint trap (core dumped) "$@" > $log_file 2>&1 FAIL: test-isodetect PASS: test-os-resources SKIP: test-mediauris SKIP: test-treeuris ============================================================================ Testsuite summary for libosinfo 1.3.0 ============================================================================ # TOTAL: 18 # PASS: 15 # SKIP: 2 # XFAIL: 0 # FAIL: 1 # XPASS: 0 # ERROR: 0 ============================================================================ See tests/test-suite.log Please report to libosinfo(a)redhat.com ============================================================================ gmake[3]: *** [Makefile:1289: test-suite.log] Error 1 gmake[3]: Leaving directory '<https://ci.centos.org/job/libosinfo-check/systems=libvirt-fedora-28/ws/buil…'> gmake[2]: *** [Makefile:1397: check-TESTS] Error 2 gmake[2]: Leaving directory '<https://ci.centos.org/job/libosinfo-check/systems=libvirt-fedora-28/ws/buil…'> gmake[1]: *** [Makefile:1587: check-am] Error 2 gmake[1]: Leaving directory '<https://ci.centos.org/job/libosinfo-check/systems=libvirt-fedora-28/ws/buil…'> gmake: *** [Makefile:594: check-recursive] Error 1 + cat tests/test-suite.log =========================================== libosinfo 1.3.0: tests/test-suite.log =========================================== # TOTAL: 18 # PASS: 15 # SKIP: 2 # XFAIL: 0 # FAIL: 1 # XPASS: 0 # ERROR: 0 .. contents:: :depth: 2 FAIL: test-isodetect ==================== /isodetect/windows: ** (<https://ci.centos.org/job/libosinfo-check/systems=libvirt-fedora-28/ws/buil…>:8914): ERROR **: 20:50:57.340: ISO en_windows_10_multi-edition_version_1709_updated_sept_2017_x64_dvd_100090817.iso.txt was not matched by OS win10 FAIL test-isodetect (exit status: 133) SKIP: test-mediauris ==================== SKIP test-mediauris (exit status: 77) SKIP: test-treeuris =================== SKIP test-treeuris (exit status: 77) + exit 1 Build step 'Execute shell' marked build as failure
1 1
0 0
[Libvirt-ci] Build failed in Jenkins: libosinfo-check » libvirt-fedora-rawhide #5
by ci@centos.org 11 Sep '18

11 Sep '18
See <https://ci.centos.org/job/libosinfo-check/systems=libvirt-fedora-rawhide/5/…> ------------------------------------------ Started by upstream project "libosinfo-check" build number 5 originally caused by: Started by upstream project "libosinfo-syntax-check" build number 5 originally caused by: Started by upstream project "libosinfo-build" build number 5 originally caused by: Started by an SCM change [EnvInject] - Loading node environment variables. Building remotely on libvirt-fedora-rawhide (libvirt) in workspace <https://ci.centos.org/job/libosinfo-check/systems=libvirt-fedora-rawhide/ws/> [libosinfo] $ /bin/sh -xe /tmp/jenkins6901943429594971338.sh + cd build + /usr/bin/gmake check GEN public-submodule-commit Making check in osinfo gmake[1]: Entering directory '<https://ci.centos.org/job/libosinfo-check/systems=libvirt-fedora-rawhide/ws…'> /usr/bin/gmake check-am gmake[2]: Entering directory '<https://ci.centos.org/job/libosinfo-check/systems=libvirt-fedora-rawhide/ws…'> /usr/bin/gmake check-local gmake[3]: Entering directory '<https://ci.centos.org/job/libosinfo-check/systems=libvirt-fedora-rawhide/ws…'> GEN check-symfile GEN check-symsorting gmake[3]: Leaving directory '<https://ci.centos.org/job/libosinfo-check/systems=libvirt-fedora-rawhide/ws…'> gmake[2]: Leaving directory '<https://ci.centos.org/job/libosinfo-check/systems=libvirt-fedora-rawhide/ws…'> gmake[1]: Leaving directory '<https://ci.centos.org/job/libosinfo-check/systems=libvirt-fedora-rawhide/ws…'> Making check in tools gmake[1]: Entering directory '<https://ci.centos.org/job/libosinfo-check/systems=libvirt-fedora-rawhide/ws…'> gmake[1]: Nothing to be done for 'check'. gmake[1]: Leaving directory '<https://ci.centos.org/job/libosinfo-check/systems=libvirt-fedora-rawhide/ws…'> Making check in docs gmake[1]: Entering directory '<https://ci.centos.org/job/libosinfo-check/systems=libvirt-fedora-rawhide/ws…'> Making check in reference gmake[2]: Entering directory '<https://ci.centos.org/job/libosinfo-check/systems=libvirt-fedora-rawhide/ws…'> gmake[2]: Nothing to be done for 'check'. gmake[2]: Leaving directory '<https://ci.centos.org/job/libosinfo-check/systems=libvirt-fedora-rawhide/ws…'> gmake[2]: Entering directory '<https://ci.centos.org/job/libosinfo-check/systems=libvirt-fedora-rawhide/ws…'> gmake[2]: Nothing to be done for 'check-am'. gmake[2]: Leaving directory '<https://ci.centos.org/job/libosinfo-check/systems=libvirt-fedora-rawhide/ws…'> gmake[1]: Leaving directory '<https://ci.centos.org/job/libosinfo-check/systems=libvirt-fedora-rawhide/ws…'> Making check in po gmake[1]: Entering directory '<https://ci.centos.org/job/libosinfo-check/systems=libvirt-fedora-rawhide/ws…'> INTLTOOL_EXTRACT="/usr/bin/intltool-extract" XGETTEXT="/usr/bin/xgettext" srcdir=../../po /usr/bin/intltool-update --gettext-package libosinfo --pot rm -f missing notexist srcdir=../../po /usr/bin/intltool-update -m if [ -r missing -o -r notexist ]; then \ exit 1; \ fi gmake[1]: Leaving directory '<https://ci.centos.org/job/libosinfo-check/systems=libvirt-fedora-rawhide/ws…'> Making check in examples gmake[1]: Entering directory '<https://ci.centos.org/job/libosinfo-check/systems=libvirt-fedora-rawhide/ws…'> gmake[1]: Nothing to be done for 'check'. gmake[1]: Leaving directory '<https://ci.centos.org/job/libosinfo-check/systems=libvirt-fedora-rawhide/ws…'> Making check in tests gmake[1]: Entering directory '<https://ci.centos.org/job/libosinfo-check/systems=libvirt-fedora-rawhide/ws…'> /usr/bin/gmake test-entity test-device test-list test-devicelist test-filter test-product test-os test-oslist test-productfilter test-platform test-platformlist test-db test-loader test-isodetect test-install-script test-os-resources test-mediauris test-treeuris gmake[2]: Entering directory '<https://ci.centos.org/job/libosinfo-check/systems=libvirt-fedora-rawhide/ws…'> CC test_entity-test-entity.o CC test_list-test-list.o CC test_device-test-device.o CC test_devicelist-test-devicelist.o CC test_filter-test-filter.o CC test_product-test-product.o CC test_os-test-os.o CC test_oslist-test-oslist.o CC test_productfilter-test-productfilter.o CC test_platform-test-platform.o CC test_platformlist-test-platformlist.o CC test_db-test-db.o CC test_loader-test-loader.o CC test_isodetect-test-isodetect.o CC test_install_script-test-install-script.o CC test_os_resources-test-os-resources.o CC test_mediauris-test-mediauris.o CC test_treeuris-test-treeuris.o CCLD test-entity CCLD test-device CCLD test-list CCLD test-devicelist CCLD test-filter CCLD test-product CCLD test-os CCLD test-oslist CCLD test-productfilter CCLD test-platform CCLD test-platformlist CCLD test-db CCLD test-loader CCLD test-isodetect CCLD test-install-script CCLD test-os-resources CCLD test-mediauris CCLD test-treeuris gmake[2]: Leaving directory '<https://ci.centos.org/job/libosinfo-check/systems=libvirt-fedora-rawhide/ws…'> /usr/bin/gmake check-TESTS gmake[2]: Entering directory '<https://ci.centos.org/job/libosinfo-check/systems=libvirt-fedora-rawhide/ws…'> gmake[3]: Entering directory '<https://ci.centos.org/job/libosinfo-check/systems=libvirt-fedora-rawhide/ws…'> PASS: test-list PASS: test-entity PASS: test-device PASS: test-devicelist PASS: test-filter PASS: test-product PASS: test-os PASS: test-oslist PASS: test-productfilter PASS: test-platform PASS: test-platformlist PASS: test-db PASS: test-install-script PASS: test-loader ../../build-aux/test-driver: line 107: 7123 Trace/breakpoint trap (core dumped) "$@" > $log_file 2>&1 FAIL: test-isodetect PASS: test-os-resources SKIP: test-mediauris SKIP: test-treeuris ============================================================================ Testsuite summary for libosinfo 1.3.0 ============================================================================ # TOTAL: 18 # PASS: 15 # SKIP: 2 # XFAIL: 0 # FAIL: 1 # XPASS: 0 # ERROR: 0 ============================================================================ See tests/test-suite.log Please report to libosinfo(a)redhat.com ============================================================================ gmake[3]: *** [Makefile:1313: test-suite.log] Error 1 gmake[3]: Leaving directory '<https://ci.centos.org/job/libosinfo-check/systems=libvirt-fedora-rawhide/ws…'> gmake[2]: *** [Makefile:1421: check-TESTS] Error 2 gmake[2]: Leaving directory '<https://ci.centos.org/job/libosinfo-check/systems=libvirt-fedora-rawhide/ws…'> gmake[1]: *** [Makefile:1614: check-am] Error 2 gmake[1]: Leaving directory '<https://ci.centos.org/job/libosinfo-check/systems=libvirt-fedora-rawhide/ws…'> gmake: *** [Makefile:594: check-recursive] Error 1 + cat tests/test-suite.log =========================================== libosinfo 1.3.0: tests/test-suite.log =========================================== # TOTAL: 18 # PASS: 15 # SKIP: 2 # XFAIL: 0 # FAIL: 1 # XPASS: 0 # ERROR: 0 .. contents:: :depth: 2 FAIL: test-isodetect ==================== /isodetect/haiku: ** (<https://ci.centos.org/job/libosinfo-check/systems=libvirt-fedora-rawhide/ws…>:7123): ERROR **: 20:50:57.613: ISO haiku-nightly-anyboot.iso.txt was not matched by OS haikunightly FAIL test-isodetect (exit status: 133) SKIP: test-mediauris ==================== SKIP test-mediauris (exit status: 77) SKIP: test-treeuris =================== SKIP test-treeuris (exit status: 77) + exit 1 Build step 'Execute shell' marked build as failure
1 1
0 0
[Libvirt-ci] Build failed in Jenkins: libosinfo-check » libvirt-fedora-27 #5
by ci@centos.org 11 Sep '18

11 Sep '18
See <https://ci.centos.org/job/libosinfo-check/systems=libvirt-fedora-27/5/displ…> ------------------------------------------ Started by upstream project "libosinfo-check" build number 5 originally caused by: Started by upstream project "libosinfo-syntax-check" build number 5 originally caused by: Started by upstream project "libosinfo-build" build number 5 originally caused by: Started by an SCM change [EnvInject] - Loading node environment variables. Building remotely on libvirt-fedora-27 (libvirt) in workspace <https://ci.centos.org/job/libosinfo-check/systems=libvirt-fedora-27/ws/> [libosinfo] $ /bin/sh -xe /tmp/jenkins8467391772283055643.sh + cd build + /usr/bin/gmake check GEN public-submodule-commit Making check in osinfo gmake[1]: Entering directory '<https://ci.centos.org/job/libosinfo-check/systems=libvirt-fedora-27/ws/buil…'> /usr/bin/gmake check-am gmake[2]: Entering directory '<https://ci.centos.org/job/libosinfo-check/systems=libvirt-fedora-27/ws/buil…'> /usr/bin/gmake check-local gmake[3]: Entering directory '<https://ci.centos.org/job/libosinfo-check/systems=libvirt-fedora-27/ws/buil…'> GEN check-symfile GEN check-symsorting gmake[3]: Leaving directory '<https://ci.centos.org/job/libosinfo-check/systems=libvirt-fedora-27/ws/buil…'> gmake[2]: Leaving directory '<https://ci.centos.org/job/libosinfo-check/systems=libvirt-fedora-27/ws/buil…'> gmake[1]: Leaving directory '<https://ci.centos.org/job/libosinfo-check/systems=libvirt-fedora-27/ws/buil…'> Making check in tools gmake[1]: Entering directory '<https://ci.centos.org/job/libosinfo-check/systems=libvirt-fedora-27/ws/buil…'> gmake[1]: Nothing to be done for 'check'. gmake[1]: Leaving directory '<https://ci.centos.org/job/libosinfo-check/systems=libvirt-fedora-27/ws/buil…'> Making check in docs gmake[1]: Entering directory '<https://ci.centos.org/job/libosinfo-check/systems=libvirt-fedora-27/ws/buil…'> Making check in reference gmake[2]: Entering directory '<https://ci.centos.org/job/libosinfo-check/systems=libvirt-fedora-27/ws/buil…'> gmake[2]: Nothing to be done for 'check'. gmake[2]: Leaving directory '<https://ci.centos.org/job/libosinfo-check/systems=libvirt-fedora-27/ws/buil…'> gmake[2]: Entering directory '<https://ci.centos.org/job/libosinfo-check/systems=libvirt-fedora-27/ws/buil…'> gmake[2]: Nothing to be done for 'check-am'. gmake[2]: Leaving directory '<https://ci.centos.org/job/libosinfo-check/systems=libvirt-fedora-27/ws/buil…'> gmake[1]: Leaving directory '<https://ci.centos.org/job/libosinfo-check/systems=libvirt-fedora-27/ws/buil…'> Making check in po gmake[1]: Entering directory '<https://ci.centos.org/job/libosinfo-check/systems=libvirt-fedora-27/ws/buil…'> INTLTOOL_EXTRACT="/usr/bin/intltool-extract" XGETTEXT="/usr/bin/xgettext" srcdir=../../po /usr/bin/intltool-update --gettext-package libosinfo --pot rm -f missing notexist srcdir=../../po /usr/bin/intltool-update -m if [ -r missing -o -r notexist ]; then \ exit 1; \ fi gmake[1]: Leaving directory '<https://ci.centos.org/job/libosinfo-check/systems=libvirt-fedora-27/ws/buil…'> Making check in examples gmake[1]: Entering directory '<https://ci.centos.org/job/libosinfo-check/systems=libvirt-fedora-27/ws/buil…'> gmake[1]: Nothing to be done for 'check'. gmake[1]: Leaving directory '<https://ci.centos.org/job/libosinfo-check/systems=libvirt-fedora-27/ws/buil…'> Making check in tests gmake[1]: Entering directory '<https://ci.centos.org/job/libosinfo-check/systems=libvirt-fedora-27/ws/buil…'> /usr/bin/gmake test-entity test-device test-list test-devicelist test-filter test-product test-os test-oslist test-productfilter test-platform test-platformlist test-db test-loader test-isodetect test-install-script test-os-resources test-mediauris test-treeuris gmake[2]: Entering directory '<https://ci.centos.org/job/libosinfo-check/systems=libvirt-fedora-27/ws/buil…'> CC test_entity-test-entity.o CC test_device-test-device.o CC test_list-test-list.o CC test_devicelist-test-devicelist.o CC test_filter-test-filter.o CC test_product-test-product.o CC test_os-test-os.o CC test_oslist-test-oslist.o CC test_productfilter-test-productfilter.o CC test_platform-test-platform.o CC test_platformlist-test-platformlist.o CC test_db-test-db.o CC test_loader-test-loader.o CC test_isodetect-test-isodetect.o CC test_install_script-test-install-script.o CC test_os_resources-test-os-resources.o CC test_mediauris-test-mediauris.o CC test_treeuris-test-treeuris.o CCLD test-entity CCLD test-device CCLD test-list CCLD test-devicelist CCLD test-filter CCLD test-product CCLD test-os CCLD test-oslist CCLD test-productfilter CCLD test-platform CCLD test-platformlist CCLD test-db CCLD test-loader CCLD test-isodetect CCLD test-install-script CCLD test-os-resources CCLD test-mediauris CCLD test-treeuris gmake[2]: Leaving directory '<https://ci.centos.org/job/libosinfo-check/systems=libvirt-fedora-27/ws/buil…'> /usr/bin/gmake check-TESTS gmake[2]: Entering directory '<https://ci.centos.org/job/libosinfo-check/systems=libvirt-fedora-27/ws/buil…'> gmake[3]: Entering directory '<https://ci.centos.org/job/libosinfo-check/systems=libvirt-fedora-27/ws/buil…'> PASS: test-list PASS: test-entity PASS: test-device PASS: test-filter PASS: test-devicelist PASS: test-product PASS: test-os PASS: test-oslist PASS: test-productfilter PASS: test-platform PASS: test-platformlist PASS: test-db PASS: test-install-script PASS: test-loader SKIP: test-mediauris PASS: test-os-resources SKIP: test-treeuris ../../build-aux/test-driver: line 107: 6908 Trace/breakpoint trap (core dumped) "$@" > $log_file 2>&1 FAIL: test-isodetect ============================================================================ Testsuite summary for libosinfo 1.3.0 ============================================================================ # TOTAL: 18 # PASS: 15 # SKIP: 2 # XFAIL: 0 # FAIL: 1 # XPASS: 0 # ERROR: 0 ============================================================================ See tests/test-suite.log Please report to libosinfo(a)redhat.com ============================================================================ gmake[3]: *** [Makefile:1289: test-suite.log] Error 1 gmake[3]: Leaving directory '<https://ci.centos.org/job/libosinfo-check/systems=libvirt-fedora-27/ws/buil…'> gmake[2]: *** [Makefile:1397: check-TESTS] Error 2 gmake[2]: Leaving directory '<https://ci.centos.org/job/libosinfo-check/systems=libvirt-fedora-27/ws/buil…'> gmake[1]: *** [Makefile:1587: check-am] Error 2 gmake[1]: Leaving directory '<https://ci.centos.org/job/libosinfo-check/systems=libvirt-fedora-27/ws/buil…'> gmake: *** [Makefile:594: check-recursive] Error 1 + cat tests/test-suite.log =========================================== libosinfo 1.3.0: tests/test-suite.log =========================================== # TOTAL: 18 # PASS: 15 # SKIP: 2 # XFAIL: 0 # FAIL: 1 # XPASS: 0 # ERROR: 0 .. contents:: :depth: 2 FAIL: test-isodetect ==================== /isodetect/windows: ** (<https://ci.centos.org/job/libosinfo-check/systems=libvirt-fedora-27/ws/buil…>:6908): ERROR **: ISO en_windows_10_multi-edition_version_1709_updated_sept_2017_x64_dvd_100090817.iso.txt was not matched by OS win10 FAIL test-isodetect (exit status: 133) SKIP: test-mediauris ==================== SKIP test-mediauris (exit status: 77) SKIP: test-treeuris =================== SKIP test-treeuris (exit status: 77) + exit 1 Build step 'Execute shell' marked build as failure
1 1
0 0
[Libvirt-ci] Build failed in Jenkins: libosinfo-check » libvirt-debian-9 #5
by ci@centos.org 11 Sep '18

11 Sep '18
See <https://ci.centos.org/job/libosinfo-check/systems=libvirt-debian-9/5/displa…> ------------------------------------------ Started by upstream project "libosinfo-check" build number 5 originally caused by: Started by upstream project "libosinfo-syntax-check" build number 5 originally caused by: Started by upstream project "libosinfo-build" build number 5 originally caused by: Started by an SCM change [EnvInject] - Loading node environment variables. Building remotely on libvirt-debian-9 (libvirt) in workspace <https://ci.centos.org/job/libosinfo-check/systems=libvirt-debian-9/ws/> [libosinfo] $ /bin/sh -xe /tmp/jenkins8367211934421306439.sh + cd build + /usr/bin/make check GEN public-submodule-commit Making check in osinfo make[1]: Entering directory '<https://ci.centos.org/job/libosinfo-check/systems=libvirt-debian-9/ws/build…'> /usr/bin/make check-am make[2]: Entering directory '<https://ci.centos.org/job/libosinfo-check/systems=libvirt-debian-9/ws/build…'> /usr/bin/make check-local make[3]: Entering directory '<https://ci.centos.org/job/libosinfo-check/systems=libvirt-debian-9/ws/build…'> GEN check-symsorting GEN check-symfile make[3]: Leaving directory '<https://ci.centos.org/job/libosinfo-check/systems=libvirt-debian-9/ws/build…'> make[2]: Leaving directory '<https://ci.centos.org/job/libosinfo-check/systems=libvirt-debian-9/ws/build…'> make[1]: Leaving directory '<https://ci.centos.org/job/libosinfo-check/systems=libvirt-debian-9/ws/build…'> Making check in tools make[1]: Entering directory '<https://ci.centos.org/job/libosinfo-check/systems=libvirt-debian-9/ws/build…'> make[1]: Nothing to be done for 'check'. make[1]: Leaving directory '<https://ci.centos.org/job/libosinfo-check/systems=libvirt-debian-9/ws/build…'> Making check in docs make[1]: Entering directory '<https://ci.centos.org/job/libosinfo-check/systems=libvirt-debian-9/ws/build…'> Making check in reference make[2]: Entering directory '<https://ci.centos.org/job/libosinfo-check/systems=libvirt-debian-9/ws/build…'> make[2]: Nothing to be done for 'check'. make[2]: Leaving directory '<https://ci.centos.org/job/libosinfo-check/systems=libvirt-debian-9/ws/build…'> make[2]: Entering directory '<https://ci.centos.org/job/libosinfo-check/systems=libvirt-debian-9/ws/build…'> make[2]: Nothing to be done for 'check-am'. make[2]: Leaving directory '<https://ci.centos.org/job/libosinfo-check/systems=libvirt-debian-9/ws/build…'> make[1]: Leaving directory '<https://ci.centos.org/job/libosinfo-check/systems=libvirt-debian-9/ws/build…'> Making check in po make[1]: Entering directory '<https://ci.centos.org/job/libosinfo-check/systems=libvirt-debian-9/ws/build…'> INTLTOOL_EXTRACT="/usr/bin/intltool-extract" XGETTEXT="/usr/bin/xgettext" srcdir=../../po /usr/bin/intltool-update --gettext-package libosinfo --pot rm -f missing notexist srcdir=../../po /usr/bin/intltool-update -m Unescaped left brace in regex is deprecated, passed through in regex; marked by <-- HERE in m/\${ <-- HERE ?PACKAGE_NAME}?/ at /usr/bin/intltool-update line 1071, <CONF> line 295. if [ -r missing -o -r notexist ]; then \ exit 1; \ fi make[1]: Leaving directory '<https://ci.centos.org/job/libosinfo-check/systems=libvirt-debian-9/ws/build…'> Making check in examples make[1]: Entering directory '<https://ci.centos.org/job/libosinfo-check/systems=libvirt-debian-9/ws/build…'> make[1]: Nothing to be done for 'check'. make[1]: Leaving directory '<https://ci.centos.org/job/libosinfo-check/systems=libvirt-debian-9/ws/build…'> Making check in tests make[1]: Entering directory '<https://ci.centos.org/job/libosinfo-check/systems=libvirt-debian-9/ws/build…'> /usr/bin/make test-entity test-device test-list test-devicelist test-filter test-product test-os test-oslist test-productfilter test-platform test-platformlist test-db test-loader test-isodetect test-install-script test-os-resources test-mediauris test-treeuris make[2]: Entering directory '<https://ci.centos.org/job/libosinfo-check/systems=libvirt-debian-9/ws/build…'> CC test_entity-test-entity.o CC test_device-test-device.o CC test_list-test-list.o CC test_devicelist-test-devicelist.o CC test_product-test-product.o CC test_filter-test-filter.o CC test_os-test-os.o CC test_oslist-test-oslist.o CC test_productfilter-test-productfilter.o CC test_platform-test-platform.o CC test_db-test-db.o CC test_platformlist-test-platformlist.o CC test_loader-test-loader.o CC test_isodetect-test-isodetect.o CC test_install_script-test-install-script.o CC test_os_resources-test-os-resources.o CC test_mediauris-test-mediauris.o CC test_treeuris-test-treeuris.o CCLD test-entity CCLD test-device CCLD test-list CCLD test-devicelist CCLD test-filter CCLD test-product CCLD test-os CCLD test-oslist CCLD test-productfilter CCLD test-platform CCLD test-platformlist CCLD test-db CCLD test-loader CCLD test-isodetect CCLD test-install-script CCLD test-os-resources CCLD test-mediauris CCLD test-treeuris make[2]: Leaving directory '<https://ci.centos.org/job/libosinfo-check/systems=libvirt-debian-9/ws/build…'> /usr/bin/make check-TESTS make[2]: Entering directory '<https://ci.centos.org/job/libosinfo-check/systems=libvirt-debian-9/ws/build…'> make[3]: Entering directory '<https://ci.centos.org/job/libosinfo-check/systems=libvirt-debian-9/ws/build…'> PASS: test-device PASS: test-list PASS: test-entity PASS: test-filter PASS: test-devicelist PASS: test-product PASS: test-oslist PASS: test-os PASS: test-productfilter PASS: test-platform PASS: test-platformlist PASS: test-db PASS: test-install-script ../../build-aux/test-driver: line 107: 23480 Trace/breakpoint trap "$@" > $log_file 2>&1 FAIL: test-isodetect PASS: test-loader SKIP: test-mediauris SKIP: test-treeuris PASS: test-os-resources ============================================================================ Testsuite summary for libosinfo 1.3.0 ============================================================================ # TOTAL: 18 # PASS: 15 # SKIP: 2 # XFAIL: 0 # FAIL: 1 # XPASS: 0 # ERROR: 0 ============================================================================ See tests/test-suite.log Please report to libosinfo(a)redhat.com ============================================================================ Makefile:1289: recipe for target 'test-suite.log' failed make[3]: *** [test-suite.log] Error 1 make[3]: Leaving directory '<https://ci.centos.org/job/libosinfo-check/systems=libvirt-debian-9/ws/build…'> Makefile:1395: recipe for target 'check-TESTS' failed make[2]: *** [check-TESTS] Error 2 make[2]: Leaving directory '<https://ci.centos.org/job/libosinfo-check/systems=libvirt-debian-9/ws/build…'> Makefile:1587: recipe for target 'check-am' failed make[1]: *** [check-am] Error 2 make[1]: Leaving directory '<https://ci.centos.org/job/libosinfo-check/systems=libvirt-debian-9/ws/build…'> Makefile:595: recipe for target 'check-recursive' failed make: *** [check-recursive] Error 1 + cat tests/test-suite.log =========================================== libosinfo 1.3.0: tests/test-suite.log =========================================== # TOTAL: 18 # PASS: 15 # SKIP: 2 # XFAIL: 0 # FAIL: 1 # XPASS: 0 # ERROR: 0 .. contents:: :depth: 2 FAIL: test-isodetect ==================== /isodetect/haiku: ** (<https://ci.centos.org/job/libosinfo-check/systems=libvirt-debian-9/ws/build…>:23480): ERROR **: ISO haiku-nightly-anyboot.iso.txt was not matched by OS haikunightly FAIL test-isodetect (exit status: 133) SKIP: test-mediauris ==================== SKIP test-mediauris (exit status: 77) SKIP: test-treeuris =================== SKIP test-treeuris (exit status: 77) + exit 1 Build step 'Execute shell' marked build as failure
1 1
0 0
  • ← Newer
  • 1
  • ...
  • 835
  • 836
  • 837
  • 838
  • 839
  • 840
  • 841
  • ...
  • 1022
  • Older →

HyperKitty Powered by HyperKitty version 1.3.12.