libvirt List Archives
Sign In Sign Up
Manage this list Sign In Sign Up

Keyboard Shortcuts

Thread View

  • j: Next unread message
  • k: Previous unread message
  • j a: Jump to all threads
  • j l: Jump to MailingList overview

CI

Thread Start a new thread
Download
Threads by month
  • ----- 2026 -----
  • September
  • August
  • July
  • June
  • May
  • April
  • March
  • February
  • January
  • ----- 2025 -----
  • December
  • November
  • October
  • September
  • August
  • July
  • June
  • May
  • April
  • March
  • February
  • January
  • ----- 2024 -----
  • December
  • November
  • October
  • September
  • August
  • July
  • June
  • May
  • April
  • March
  • February
  • January
  • ----- 2023 -----
  • December
  • November
  • October
  • September
  • August
  • July
  • June
  • May
  • April
  • March
  • February
  • January
  • ----- 2022 -----
  • December
  • November
  • October
  • September
  • August
  • July
  • June
  • May
  • April
  • March
  • February
  • January
  • ----- 2021 -----
  • December
  • November
  • October
  • September
  • August
  • July
  • June
  • May
  • April
  • March
  • February
  • January
  • ----- 2020 -----
  • December
  • November
  • October
  • September
  • August
  • July
  • June
  • May
  • April
  • March
  • February
  • January
  • ----- 2019 -----
  • December
  • November
  • October
  • September
  • August
  • July
  • June
  • May
  • April
  • March
  • February
  • January
  • ----- 2018 -----
  • December
  • November
  • October
  • September
  • August
  • July
  • June
  • May
  • April
  • March
  • February
  • January
  • ----- 2017 -----
  • December
  • November
  • October
  • September
  • August
  • July
  • June
  • May
  • April
  • March
  • February
  • January
  • ----- 2016 -----
  • December
  • November
  • October
  • September
  • August
  • July
ci@lists.libvirt.org

  • 2 participants
  • 10211 discussions
[Libvirt-ci] Broken: libvirt/libvirt#1710 (master - bfdd20c)
by Travis CI 24 Sep '18

24 Sep '18
Build Update for libvirt/libvirt ------------------------------------- Build: #1710 Status: Broken Duration: 20 mins and 45 secs Commit: bfdd20c (master) Author: Simon Kobyda Message: virt-admin: Implement vshTable API to server-list and client-list Signed-off-by: Simon Kobyda <skobyda(a)redhat.com> View the changeset: https://github.com/libvirt/libvirt/compare/2f754b26cb2b...bfdd20c5a974 View the full build log and details: https://travis-ci.org/libvirt/libvirt/builds/432360361?utm_medium=notificat… -- You can unsubscribe from build emails from the libvirt/libvirt repository going to https://travis-ci.org/account/preferences/unsubscribe?repository=4872032&ut…. Or unsubscribe from *all* email updating your settings at https://travis-ci.org/account/preferences/unsubscribe?utm_medium=notificati…. Or configure specific recipients for build notifications in your .travis.yml file. See https://docs.travis-ci.com/user/notifications.
1 0
0 0
[Libvirt-ci] Errored: libvirt/libvirt-python#9 (master - 9dff880)
by Travis CI 24 Sep '18

24 Sep '18
Build Update for libvirt/libvirt-python ------------------------------------- Build: #9 Status: Errored Duration: 13 mins and 42 secs Commit: 9dff880 (master) Author: Philipp Hahn Message: event-test.py: Fix blanks Closer to pep8 Signed-off-by: Philipp Hahn <hahn(a)univention.de> View the changeset: https://github.com/libvirt/libvirt-python/compare/fc4000152ef8...9dff88056c… View the full build log and details: https://travis-ci.org/libvirt/libvirt-python/builds/432348832?utm_medium=no… -- You can unsubscribe from build emails from the libvirt/libvirt-python repository going to https://travis-ci.org/account/preferences/unsubscribe?repository=4872050&ut…. Or unsubscribe from *all* email updating your settings at https://travis-ci.org/account/preferences/unsubscribe?utm_medium=notificati…. Or configure specific recipients for build notifications in your .travis.yml file. See https://docs.travis-ci.com/user/notifications.
1 0
0 0
[Libvirt-ci] Build failed in Jenkins: virt-viewer-build » libvirt-freebsd-10 #35
by ci@centos.org 21 Sep '18

21 Sep '18
See <https://ci.centos.org/job/virt-viewer-build/systems=libvirt-freebsd-10/35/d…> ------------------------------------------ Started by upstream project "virt-viewer-build" build number 35 originally caused by: Started by upstream project "libvirt-glib-build" build number 32 originally caused by: Started by upstream project "libvirt-build" build number 47 originally caused by: Started by an SCM change Started by an SCM change Started by an SCM change [EnvInject] - Loading node environment variables. Building remotely on libvirt-freebsd-10 (libvirt) in workspace <https://ci.centos.org/job/virt-viewer-build/systems=libvirt-freebsd-10/ws/> > git rev-parse --is-inside-work-tree # timeout=10 Fetching changes from the remote Git repository > git config remote.origin.url https://pagure.io/virt-viewer.git # timeout=10 Fetching upstream changes from https://pagure.io/virt-viewer.git > git --version # timeout=10 > git fetch --tags --progress https://pagure.io/virt-viewer.git +refs/heads/*:refs/remotes/origin/* Checking out Revision 65ef66e42a6db2a9826fffef0db49920a02d358f (refs/remotes/origin/master) > git config core.sparsecheckout # timeout=10 > git checkout -f 65ef66e42a6db2a9826fffef0db49920a02d358f Commit message: "Spice: listen for new 'SpiceSession::disconnected' signal" > git rev-list --no-walk 65ef66e42a6db2a9826fffef0db49920a02d358f # timeout=10 Cleaning workspace > git rev-parse --verify HEAD # timeout=10 FATAL: Invalid id: 65ef66e42a6db2a9826fffef0db49920a02d358f Process leaked file descriptors. See https://jenkins.io/redirect/troubleshooting/process-leaked-file-descriptors for more information Also: hudson.remoting.Channel$CallSiteStackTrace: Remote call to JNLP4-connect connection from n64.gusty.ci.centos.org/172.19.2.192:1027 at hudson.remoting.Channel.attachCallSiteStackTrace(Channel.java:1741) at hudson.remoting.UserRequest$ExceptionResponse.retrieve(UserRequest.java:357) at hudson.remoting.Channel.call(Channel.java:955) at hudson.remoting.RemoteInvocationHandler.invoke(RemoteInvocationHandler.java:283) at com.sun.proxy.$Proxy86.clean(Unknown Source) at org.jenkinsci.plugins.gitclient.RemoteGitImpl.clean(RemoteGitImpl.java:450) at hudson.plugins.git.extensions.impl.CleanCheckout.onCheckoutCompleted(CleanCheckout.java:30) at hudson.plugins.git.GitSCM.checkout(GitSCM.java:1264) at hudson.scm.SCM.checkout(SCM.java:504) at hudson.model.AbstractProject.checkout(AbstractProject.java:1208) at hudson.model.AbstractBuild$AbstractBuildExecution.defaultCheckout(AbstractBuild.java:574) at jenkins.scm.SCMCheckoutStrategy.checkout(SCMCheckoutStrategy.java:86) at hudson.model.AbstractBuild$AbstractBuildExecution.run(AbstractBuild.java:499) at hudson.model.Run.execute(Run.java:1798) at hudson.matrix.MatrixRun.run(MatrixRun.java:153) at hudson.model.ResourceController.execute(ResourceController.java:97) at hudson.model.Executor.run(Executor.java:429) org.eclipse.jgit.errors.InvalidObjectIdException: Invalid id: 65ef66e42a6db2a9826fffef0db49920a02d358f Process leaked file descriptors. See https://jenkins.io/redirect/troubleshooting/process-leaked-file-descriptors for more information at org.eclipse.jgit.lib.ObjectId.fromString(ObjectId.java:232) at org.jenkinsci.plugins.gitclient.CliGitAPIImpl.validateRevision(CliGitAPIImpl.java:866) at org.jenkinsci.plugins.gitclient.CliGitAPIImpl.reset(CliGitAPIImpl.java:465) at org.jenkinsci.plugins.gitclient.CliGitAPIImpl.clean(CliGitAPIImpl.java:801) at hudson.plugins.git.GitAPI.clean(GitAPI.java:311) at sun.reflect.GeneratedMethodAccessor359.invoke(Unknown Source) at sun.reflect.DelegatingMethodAccessorImpl.invoke(DelegatingMethodAccessorImpl.java:43) at java.lang.reflect.Method.invoke(Method.java:498) at hudson.remoting.RemoteInvocationHandler$RPCRequest.perform(RemoteInvocationHandler.java:929) at hudson.remoting.RemoteInvocationHandler$RPCRequest.call(RemoteInvocationHandler.java:903) at hudson.remoting.RemoteInvocationHandler$RPCRequest.call(RemoteInvocationHandler.java:855) at hudson.remoting.UserRequest.perform(UserRequest.java:212) at hudson.remoting.UserRequest.perform(UserRequest.java:54) at hudson.remoting.Request$2.run(Request.java:369) at hudson.remoting.InterceptingExecutorService$1.call(InterceptingExecutorService.java:72) at java.util.concurrent.FutureTask.run(FutureTask.java:266) at java.util.concurrent.ThreadPoolExecutor.runWorker(ThreadPoolExecutor.java:1149) at java.util.concurrent.ThreadPoolExecutor$Worker.run(ThreadPoolExecutor.java:624) at hudson.remoting.Engine$1.lambda$newThread$0(Engine.java:93) at java.lang.Thread.run(Thread.java:748)
1 1
0 0
[Libvirt-ci] Build failed in Jenkins: libvirt-dbus-check » libvirt-fedora-28 #31
by ci@centos.org 21 Sep '18

21 Sep '18
See <https://ci.centos.org/job/libvirt-dbus-check/systems=libvirt-fedora-28/31/d…> ------------------------------------------ [...truncated 6.25 KB...] platform linux -- Python 3.6.6, pytest-3.4.2, py-1.5.4, pluggy-0.6.0 rootdir: <https://ci.centos.org/job/libvirt-dbus-check/systems=libvirt-fedora-28/ws/,> inifile: collected 35 items ../../tests/test_connect.py .E.............E..................E [100%] ==================================== ERRORS ==================================== _________ ERROR at setup of TestConnect.test_connect_domain_define_xml _________ self = <test_connect.TestConnect object at 0x7f2318b74e48> request = <SubRequest 'libvirt_dbus_setup' for <Function 'test_connect_domain_define_xml'>> @pytest.fixture(autouse=True) def libvirt_dbus_setup(self, request): """Start libvirt-dbus for each test function """ os.environ['LIBVIRT_DEBUG'] = '3' self.libvirt_dbus = subprocess.Popen([exe, '--session']) self.bus = dbus.SessionBus() for i in range(10): if self.bus.name_has_owner('org.libvirt'): break time.sleep(0.1) else: > raise TimeoutError('error starting libvirt-dbus') E TimeoutError: error starting libvirt-dbus ../../tests/libvirttest.py:44: TimeoutError ERROR at setup of TestConnect.test_connect_interface_lookup_by_property[InterfaceLookupByMAC-MAC] self = <test_connect.TestConnect object at 0x7f2318c4ceb8> @pytest.fixture def interface_create(self): """ Fixture to define dummy interface on the test driver This fixture should be used in the setup of every test manipulating with interfaces. """ path = self.connect.InterfaceDefineXML(xmldata.minimal_interface_xml, 0) obj = self.bus.get_object('org.libvirt', path) interface_obj = dbus.Interface(obj, 'org.libvirt.Interface') > interface_obj.Create(0) ../../tests/libvirttest.py:84: _ _ _ _ _ _ _ _ _ _ _ _ _ _ _ _ _ _ _ _ _ _ _ _ _ _ _ _ _ _ _ _ _ _ _ _ _ _ _ _ /usr/lib64/python3.6/site-packages/dbus/proxies.py:70: in __call__ return self._proxy_method(*args, **keywords) /usr/lib64/python3.6/site-packages/dbus/proxies.py:145: in __call__ **keywords) _ _ _ _ _ _ _ _ _ _ _ _ _ _ _ _ _ _ _ _ _ _ _ _ _ _ _ _ _ _ _ _ _ _ _ _ _ _ _ _ self = <dbus._dbus.SessionBus (session) at 0x7f2318c10308> bus_name = dbus.String(':1.2') object_path = dbus.ObjectPath('/org/libvirt/Test/interface/11_3a22_3a33_3a44_3a55_3a66') dbus_interface = 'org.libvirt.Interface', method = 'Create', signature = 'u' args = (0,), timeout = -1.0, byte_arrays = False, kwargs = {} get_args_opts = {'byte_arrays': False} message = <dbus.lowlevel.MethodCallMessage path: /org/libvirt/Test/interface/11_3a22_3a33_3a44_3a55_3a66, iface: org.libvirt.Interface, member: Create dest: :1.2> def call_blocking(self, bus_name, object_path, dbus_interface, method, signature, args, timeout=-1.0, byte_arrays=False, **kwargs): """Call the given method, synchronously. :Since: 0.81.0 """ if object_path == LOCAL_PATH: raise DBusException('Methods may not be called on the reserved ' 'path %s' % LOCAL_PATH) if dbus_interface == LOCAL_IFACE: raise DBusException('Methods may not be called on the reserved ' 'interface %s' % LOCAL_IFACE) # no need to validate other args - MethodCallMessage ctor will do get_args_opts = dict(byte_arrays=byte_arrays) if is_py2: get_args_opts['utf8_strings'] = kwargs.get('utf8_strings', False) elif 'utf8_strings' in kwargs: raise TypeError("unexpected keyword argument 'utf8_strings'") message = MethodCallMessage(destination=bus_name, path=object_path, interface=dbus_interface, method=method) # Add the arguments to the function try: message.append(signature=signature, *args) except Exception as e: logging.basicConfig() _logger.error('Unable to set arguments %r according to ' 'signature %r: %s: %s', args, signature, e.__class__, e) raise # make a blocking call reply_message = self.send_message_with_reply_and_block( > message, timeout) E dbus.exceptions.DBusException: org.libvirt.Error: Requested operation is not valid /usr/lib64/python3.6/site-packages/dbus/connection.py:651: DBusException ERROR at setup of TestConnect.test_connect_storage_vol_lookup_by_property[StorageVolLookupByPath-Path] self = <test_connect.TestConnect object at 0x7f2318c3d630> @pytest.fixture def storage_volume_create(self): """ Fixture to create dummy storage volume on the test driver This fixture should be used in the setup of every test manipulating with test volume. """ _, test_storage_pool = self.get_test_storage_pool() interface_obj = dbus.Interface(test_storage_pool, 'org.libvirt.StoragePool') > path = interface_obj.StorageVolCreateXML(xmldata.minimal_storage_vol_xml, 0) ../../tests/libvirttest.py:122: _ _ _ _ _ _ _ _ _ _ _ _ _ _ _ _ _ _ _ _ _ _ _ _ _ _ _ _ _ _ _ _ _ _ _ _ _ _ _ _ /usr/lib64/python3.6/site-packages/dbus/proxies.py:70: in __call__ return self._proxy_method(*args, **keywords) /usr/lib64/python3.6/site-packages/dbus/proxies.py:145: in __call__ **keywords) _ _ _ _ _ _ _ _ _ _ _ _ _ _ _ _ _ _ _ _ _ _ _ _ _ _ _ _ _ _ _ _ _ _ _ _ _ _ _ _ self = <dbus._dbus.SessionBus (session) at 0x7f2318c10308> bus_name = dbus.String(':1.2') object_path = dbus.ObjectPath('/org/libvirt/Test/storagepool/_dfe224cb_28fb_8dd0_c4b2_64eb3f0f4566') dbus_interface = 'org.libvirt.StoragePool', method = 'StorageVolCreateXML' signature = 'su' args = ('\n<volume>\n <name>sparse.img</name>\n <capacity unit="G">2</capacity>\n <target>\n <path>/var/lib/virt/images/sparse.img</path>\n </target>\n</volume>\n', 0) timeout = -1.0, byte_arrays = False, kwargs = {} get_args_opts = {'byte_arrays': False} message = <dbus.lowlevel.MethodCallMessage path: /org/libvirt/Test/storagepool/_dfe224cb_28fb_8dd0_c4b2_64eb3f0f4566, iface: org.libvirt.StoragePool, member: StorageVolCreateXML dest: :1.2> def call_blocking(self, bus_name, object_path, dbus_interface, method, signature, args, timeout=-1.0, byte_arrays=False, **kwargs): """Call the given method, synchronously. :Since: 0.81.0 """ if object_path == LOCAL_PATH: raise DBusException('Methods may not be called on the reserved ' 'path %s' % LOCAL_PATH) if dbus_interface == LOCAL_IFACE: raise DBusException('Methods may not be called on the reserved ' 'interface %s' % LOCAL_IFACE) # no need to validate other args - MethodCallMessage ctor will do get_args_opts = dict(byte_arrays=byte_arrays) if is_py2: get_args_opts['utf8_strings'] = kwargs.get('utf8_strings', False) elif 'utf8_strings' in kwargs: raise TypeError("unexpected keyword argument 'utf8_strings'") message = MethodCallMessage(destination=bus_name, path=object_path, interface=dbus_interface, method=method) # Add the arguments to the function try: message.append(signature=signature, *args) except Exception as e: logging.basicConfig() _logger.error('Unable to set arguments %r according to ' 'signature %r: %s: %s', args, signature, e.__class__, e) raise # make a blocking call reply_message = self.send_message_with_reply_and_block( > message, timeout) E dbus.exceptions.DBusException: org.libvirt.Error: operation failed: storage vol already exists /usr/lib64/python3.6/site-packages/dbus/connection.py:651: DBusException ===================== 32 passed, 3 error in 10.30 seconds ====================== FAIL test_connect.py (exit status: 1) FAIL: test_network.py ===================== ============================= test session starts ============================== platform linux -- Python 3.6.6, pytest-3.4.2, py-1.5.4, pluggy-0.6.0 rootdir: <https://ci.centos.org/job/libvirt-dbus-check/systems=libvirt-fedora-28/ws/,> inifile: collected 7 items ../../tests/test_network.py ...E..F [100%] ==================================== ERRORS ==================================== ______________ ERROR at setup of TestNetwork.test_network_destroy ______________ self = <test_network.TestNetwork object at 0x7fbf74d529e8> request = <SubRequest 'libvirt_dbus_setup' for <Function 'test_network_destroy'>> @pytest.fixture(autouse=True) def libvirt_dbus_setup(self, request): """Start libvirt-dbus for each test function """ os.environ['LIBVIRT_DEBUG'] = '3' self.libvirt_dbus = subprocess.Popen([exe, '--session']) self.bus = dbus.SessionBus() for i in range(10): if self.bus.name_has_owner('org.libvirt'): break time.sleep(0.1) else: > raise TimeoutError('error starting libvirt-dbus') E TimeoutError: error starting libvirt-dbus ../../tests/libvirttest.py:44: TimeoutError =================================== FAILURES =================================== TestNetwork.test_network_update[4-4-0-\n <host mac='00:16:3e:77:e2:ed' name='foo.example.com' ip='192.168.122.10'/>\n -0] self = <test_network.TestNetwork object at 0x7fbf74d4ccc0>, command = '4' section = '4', parentIndex = 0 xml_str = "\n <host mac='00:16:3e:77:e2:ed' name='foo.example.com' ip='192.168.122.10'/>\n " flags = 0 @pytest.mark.parametrize("command, section, parentIndex, xml_str, flags", [ ('4', '4', 0, ip_dhcp_host_xml, 0), # add-first, ip-dhcp-host ]) def test_network_update(self, command, section, parentIndex, xml_str, flags): > _, test_network = self.get_test_network() ../../tests/test_network.py:91: _ _ _ _ _ _ _ _ _ _ _ _ _ _ _ _ _ _ _ _ _ _ _ _ _ _ _ _ _ _ _ _ _ _ _ _ _ _ _ _ self = <test_network.TestNetwork object at 0x7fbf74d4ccc0> def get_test_network(self): """Fetch information for the test network from test driver Returns: (dbus.proxies.ProxyObject, dbus.proxies.ProxyObject): Test Network Object, Local proxy for the test Network Object. """ > path = self.connect.ListNetworks(0)[0] E IndexError: list index out of range ../../tests/libvirttest.py:138: IndexError --------------------------- Captured stderr teardown --------------------------- Disconnected from D-Bus. ================= 1 failed, 5 passed, 1 error in 5.98 seconds ================== FAIL test_network.py (exit status: 1) + exit 1 Build step 'Execute shell' marked build as failure
1 1
0 0
[Libvirt-ci] Build failed in Jenkins: libvirt-dbus-check » libvirt-fedora-rawhide #30
by ci@centos.org 20 Sep '18

20 Sep '18
See <https://ci.centos.org/job/libvirt-dbus-check/systems=libvirt-fedora-rawhide…> ------------------------------------------ Started by upstream project "libvirt-dbus-check" build number 30 originally caused by: Started by upstream project "libvirt-dbus-syntax-check" build number 30 originally caused by: Started by upstream project "libvirt-dbus-build" build number 30 originally caused by: Started by upstream project "libvirt-glib-build" build number 30 originally caused by: Started by upstream project "libvirt-build" build number 45 originally caused by: Started by an SCM change [EnvInject] - Loading node environment variables. Building remotely on libvirt-fedora-rawhide (libvirt) in workspace <https://ci.centos.org/job/libvirt-dbus-check/systems=libvirt-fedora-rawhide…> [libvirt-dbus] $ /bin/sh -xe /tmp/jenkins5043944235434993403.sh + cd build + /usr/bin/gmake check Making check in data gmake[1]: Entering directory '<https://ci.centos.org/job/libvirt-dbus-check/systems=libvirt-fedora-rawhide…'> gmake[1]: Nothing to be done for 'check'. gmake[1]: Leaving directory '<https://ci.centos.org/job/libvirt-dbus-check/systems=libvirt-fedora-rawhide…'> Making check in docs gmake[1]: Entering directory '<https://ci.centos.org/job/libvirt-dbus-check/systems=libvirt-fedora-rawhide…'> gmake[1]: Nothing to be done for 'check'. gmake[1]: Leaving directory '<https://ci.centos.org/job/libvirt-dbus-check/systems=libvirt-fedora-rawhide…'> Making check in src gmake[1]: Entering directory '<https://ci.centos.org/job/libvirt-dbus-check/systems=libvirt-fedora-rawhide…'> gmake[1]: Nothing to be done for 'check'. gmake[1]: Leaving directory '<https://ci.centos.org/job/libvirt-dbus-check/systems=libvirt-fedora-rawhide…'> Making check in tests gmake[1]: Entering directory '<https://ci.centos.org/job/libvirt-dbus-check/systems=libvirt-fedora-rawhide…'> /usr/bin/gmake test_util gmake[2]: Entering directory '<https://ci.centos.org/job/libvirt-dbus-check/systems=libvirt-fedora-rawhide…'> CC test_util-test_util.o CCLD test_util gmake[2]: Leaving directory '<https://ci.centos.org/job/libvirt-dbus-check/systems=libvirt-fedora-rawhide…'> /usr/bin/gmake check-TESTS gmake[2]: Entering directory '<https://ci.centos.org/job/libvirt-dbus-check/systems=libvirt-fedora-rawhide…'> gmake[3]: Entering directory '<https://ci.centos.org/job/libvirt-dbus-check/systems=libvirt-fedora-rawhide…'> PASS: test_util PASS: test_interface.py PASS: test_domain.py PASS: test_network.py FAIL: test_nodedev.py PASS: test_connect.py PASS: test_storage.py ============================================================================ Testsuite summary for libvirt-dbus 1.3.0 ============================================================================ # TOTAL: 7 # PASS: 6 # SKIP: 0 # XFAIL: 0 # FAIL: 1 # XPASS: 0 # ERROR: 0 ============================================================================ See tests/test-suite.log Please report to libvir-list(a)redhat.com ============================================================================ gmake[3]: *** [Makefile:766: test-suite.log] Error 1 gmake[3]: Leaving directory '<https://ci.centos.org/job/libvirt-dbus-check/systems=libvirt-fedora-rawhide…'> gmake[2]: *** [Makefile:874: check-TESTS] Error 2 gmake[2]: Leaving directory '<https://ci.centos.org/job/libvirt-dbus-check/systems=libvirt-fedora-rawhide…'> gmake[1]: *** [Makefile:990: check-am] Error 2 gmake[1]: Leaving directory '<https://ci.centos.org/job/libvirt-dbus-check/systems=libvirt-fedora-rawhide…'> gmake: *** [Makefile:460: check-recursive] Error 1 + cat tests/test-suite.log ============================================== libvirt-dbus 1.3.0: tests/test-suite.log ============================================== # TOTAL: 7 # PASS: 6 # SKIP: 0 # XFAIL: 0 # FAIL: 1 # XPASS: 0 # ERROR: 0 .. contents:: :depth: 2 FAIL: test_nodedev.py ===================== ============================= test session starts ============================== platform linux -- Python 3.7.0, pytest-3.6.3, py-1.5.4, pluggy-0.6.0 rootdir: <https://ci.centos.org/job/libvirt-dbus-check/systems=libvirt-fedora-rawhide…,> inifile: collected 4 items ../../tests/test_nodedev.py ...E [100%] ==================================== ERRORS ==================================== ______ ERROR at setup of TestNodeDevice.test_node_device_properties_type _______ self = <test_nodedev.TestNodeDevice object at 0x7f1319ecde80> request = <SubRequest 'libvirt_dbus_setup' for <Function 'test_node_device_properties_type'>> @pytest.fixture(autouse=True) def libvirt_dbus_setup(self, request): """Start libvirt-dbus for each test function """ os.environ['LIBVIRT_DEBUG'] = '3' self.libvirt_dbus = subprocess.Popen([exe, '--session']) self.bus = dbus.SessionBus() for i in range(10): if self.bus.name_has_owner('org.libvirt'): break time.sleep(0.1) else: > raise TimeoutError('error starting libvirt-dbus') E TimeoutError: error starting libvirt-dbus ../../tests/libvirttest.py:44: TimeoutError ====================== 3 passed, 1 error in 3.93 seconds ======================= FAIL test_nodedev.py (exit status: 1) + exit 1 Build step 'Execute shell' marked build as failure
1 1
0 0
[Libvirt-ci] Build failed in Jenkins: libvirt+mingw64-build » libvirt-fedora-rawhide #48
by ci@centos.org 20 Sep '18

20 Sep '18
See <https://ci.centos.org/job/libvirt+mingw64-build/systems=libvirt-fedora-rawh…> Changes: [jferlan] util: Introduce monitor capability interface [jferlan] conf: Refactor cache bank capability structure [jferlan] conf: Refactor memory bandwidth capability structure [jferlan] conf: Introduce RDT monitor host capability ------------------------------------------ [...truncated 131.20 KB...] CC stdio-write.lo CC stpcpy.lo CC strchrnul.lo CC strdup.lo CC strerror.lo CC strerror-override.lo CC strerror_r.lo CC strndup.lo CC strptime.lo CC strsep.lo CC time_r.lo CC timegm.lo CC ttyname_r.lo CC uname.lo CC unsetenv.lo CC usleep.lo CC vasnprintf.lo CC vsnprintf.lo CC waitpid.lo CC wcwidth.lo CC glthread/lock.lo CC uniwidth/width.lo CCLD libgnu.la gmake[3]: Leaving directory '<https://ci.centos.org/job/libvirt+mingw64-build/systems=libvirt-fedora-rawh…'> gmake[2]: Leaving directory '<https://ci.centos.org/job/libvirt+mingw64-build/systems=libvirt-fedora-rawh…'> Making all in include/libvirt gmake[2]: Entering directory '<https://ci.centos.org/job/libvirt+mingw64-build/systems=libvirt-fedora-rawh…'> gmake[2]: Nothing to be done for 'all'. gmake[2]: Leaving directory '<https://ci.centos.org/job/libvirt+mingw64-build/systems=libvirt-fedora-rawh…'> Making all in src gmake[2]: Entering directory '<https://ci.centos.org/job/libvirt+mingw64-build/systems=libvirt-fedora-rawh…'> GEN util/virkeycodetable_linux.h GEN util/virkeycodetable_osx.h GEN util/virkeycodetable_atset1.h GEN util/virkeycodetable_atset2.h GEN util/virkeycodetable_atset3.h GEN util/virkeycodetable_xtkbd.h GEN util/virkeycodetable_usb.h GEN util/virkeycodetable_win32.h GEN util/virkeycodetable_qnum.h GEN util/virkeynametable_linux.h GEN util/virkeynametable_osx.h GEN util/virkeynametable_win32.h GEN ../../src/access/org.libvirt.api.policy GEN access/viraccessapicheck.h GEN access/viraccessapicheck.c GEN access/viraccessapicheckqemu.h GEN access/viraccessapicheckqemu.c GEN access/viraccessapichecklxc.h GEN access/viraccessapichecklxc.c GEN libvirt_access.xml GEN libvirt_access_qemu.xml GEN libvirt_access_lxc.xml GEN logging/log_protocol.h GEN logging/log_daemon_dispatch_stubs.h GEN locking/lock_protocol.h GEN locking/lock_daemon_dispatch_stubs.h GEN admin/admin_protocol.h GEN admin/admin_client.h GEN admin/admin_server_dispatch_stubs.h GEN rpc/virnetprotocol.h GEN rpc/virkeepaliveprotocol.h GEN .esx_vi_generator.stamp GEN .hyperv_wmi_generator.stamp GEN lxc/lxc_monitor_protocol.h GEN lxc/lxc_monitor_dispatch.h GEN ../../src/hyperv/hyperv_wmi_classes.generated.typedef GEN ../../src/hyperv/hyperv_wmi_classes.generated.h GEN ../../src/hyperv/hyperv_wmi_classes.generated.c GEN lxc/lxc_controller_dispatch.h GEN ../../src/esx/esx_vi_types.generated.typedef GEN ../../src/esx/esx_vi_types.generated.typeenum GEN ../../src/esx/esx_vi_types.generated.typetostring GEN ../../src/esx/esx_vi_types.generated.typefromstring GEN ../../src/esx/esx_vi_types.generated.h GEN ../../src/esx/esx_vi_types.generated.c GEN ../../src/esx/esx_vi_methods.generated.h GEN ../../src/esx/esx_vi_methods.generated.c GEN ../../src/esx/esx_vi_methods.generated.macro GEN ../../src/esx/esx_vi.generated.h GEN ../../src/esx/esx_vi.generated.c GEN remote/remote_protocol.h GEN remote/remote_client_bodies.h GEN remote/lxc_protocol.h GEN remote/lxc_client_bodies.h GEN remote/qemu_protocol.h GEN remote/qemu_client_bodies.h GEN remote/remote_daemon_dispatch_stubs.h GEN remote/remote_daemon_dispatch_lxc_stubs.h GEN remote/remote_daemon_dispatch_qemu_stubs.h GEN libvirt_access.syms GEN libvirt_access_qemu.syms GEN libvirt_access_lxc.syms GEN libvirt_qemu.def GEN libvirt_lxc.def GEN libvirt_admin.syms GEN libvirtd.qemu.logrotate GEN libvirtd.lxc.logrotate GEN libvirtd.libxl.logrotate GEN libvirtd.uml.logrotate GEN libvirtd.logrotate GEN logging/log_protocol.c GEN locking/lock_protocol.c GEN admin/admin_protocol.c GEN rpc/virnetprotocol.c GEN lxc/lxc_monitor_protocol.c GEN rpc/virkeepaliveprotocol.c GEN remote/remote_protocol.c GEN remote/lxc_protocol.c GEN remote/qemu_protocol.c GEN libvirt.syms GEN libvirt_admin.def GEN libvirt.def /usr/bin/gmake all-am gmake[3]: Entering directory '<https://ci.centos.org/job/libvirt+mingw64-build/systems=libvirt-fedora-rawh…'> CC libvirt_driver_la-driver.lo CC libvirt_driver_la-datatypes.lo CC libvirt_driver_la-libvirt.lo CC libvirt_driver_la-libvirt-domain.lo CC libvirt_driver_la-libvirt-domain-snapshot.lo CC libvirt_driver_la-libvirt-host.lo CC libvirt_driver_la-libvirt-interface.lo CC libvirt_driver_la-libvirt-network.lo CC libvirt_driver_la-libvirt-nodedev.lo CC libvirt_driver_la-libvirt-nwfilter.lo CC libvirt_driver_la-libvirt-secret.lo CC libvirt_driver_la-libvirt-storage.lo CC libvirt_driver_la-libvirt-stream.lo CC libvirt_qemu_la-libvirt-qemu.lo CC libvirt_lxc_la-libvirt-lxc.lo CC libvirt_admin_la-libvirt-admin.lo CC libvirt_admin_la-datatypes.lo CC admin/libvirt_driver_admin_la-admin_protocol.lo CC admin/libvirt_driver_admin_la-admin_server.lo CC admin/libvirt_driver_admin_la-admin_server_dispatch.lo GEN util/virkeycode-linux.pod GEN util/virkeycode-osx.pod GEN util/virkeycode-atset1.pod GEN util/virkeycode-atset2.pod GEN util/virkeycode-atset3.pod GEN util/virkeycode-xtkbd.pod GEN util/virkeycode-usb.pod GEN util/virkeycode-win32.pod GEN util/virkeycode-qnum.pod GEN util/virkeyname-linux.pod GEN util/virkeyname-osx.pod GEN util/virkeyname-win32.pod CC util/libvirt_util_la-viralloc.lo CC util/libvirt_util_la-virarch.lo CC util/libvirt_util_la-virarptable.lo CC util/libvirt_util_la-viratomic.lo CC util/libvirt_util_la-viraudit.lo CC util/libvirt_util_la-virauth.lo CC util/libvirt_util_la-virauthconfig.lo CC util/libvirt_util_la-virbitmap.lo CC util/libvirt_util_la-virbuffer.lo CC util/libvirt_util_la-virperf.lo CC util/libvirt_util_la-vircgroup.lo CC util/libvirt_util_la-virclosecallbacks.lo CC util/libvirt_util_la-vircommand.lo CC util/libvirt_util_la-virconf.lo CC util/libvirt_util_la-vircrypto.lo CC util/libvirt_util_la-virdbus.lo CC util/libvirt_util_la-virdevmapper.lo CC util/libvirt_util_la-virdnsmasq.lo CC util/libvirt_util_la-virebtables.lo CC util/libvirt_util_la-virerror.lo CC util/libvirt_util_la-virevent.lo CC util/libvirt_util_la-vireventpoll.lo CC util/libvirt_util_la-virfcp.lo CC util/libvirt_util_la-virfdstream.lo CC util/libvirt_util_la-virfile.lo CC util/libvirt_util_la-virfirewall.lo CC util/libvirt_util_la-virfirmware.lo CC util/libvirt_util_la-virgettext.lo CC util/libvirt_util_la-virgic.lo CC util/libvirt_util_la-virhash.lo CC util/libvirt_util_la-virhashcode.lo CC util/libvirt_util_la-virhook.lo CC util/libvirt_util_la-virhostcpu.lo CC util/libvirt_util_la-virhostdev.lo CC util/libvirt_util_la-virhostmem.lo CC util/libvirt_util_la-viridentity.lo CC util/libvirt_util_la-virinitctl.lo CC util/libvirt_util_la-viriptables.lo CC util/libvirt_util_la-viriscsi.lo CC util/libvirt_util_la-virjson.lo CC util/libvirt_util_la-virkeycode.lo CC util/libvirt_util_la-virkeyfile.lo CC util/libvirt_util_la-virlease.lo CC util/libvirt_util_la-virlockspace.lo CC util/libvirt_util_la-virlog.lo CC util/libvirt_util_la-virmacaddr.lo CC util/libvirt_util_la-virmacmap.lo CC util/libvirt_util_la-virmodule.lo CC util/libvirt_util_la-virnetdev.lo CC util/libvirt_util_la-virnetdevbandwidth.lo CC util/libvirt_util_la-virnetdevbridge.lo CC util/libvirt_util_la-virnetdevip.lo CC util/libvirt_util_la-virnetdevmacvlan.lo CC util/libvirt_util_la-virnetdevmidonet.lo CC util/libvirt_util_la-virnetdevopenvswitch.lo CC util/libvirt_util_la-virnetdevtap.lo CC util/libvirt_util_la-virnetdevveth.lo CC util/libvirt_util_la-virnetdevvlan.lo CC util/libvirt_util_la-virnetdevvportprofile.lo CC util/libvirt_util_la-virnetlink.lo CC util/libvirt_util_la-virnodesuspend.lo CC util/libvirt_util_la-virkmod.lo CC util/libvirt_util_la-virnuma.lo CC util/libvirt_util_la-virobject.lo CC util/libvirt_util_la-virpci.lo CC util/libvirt_util_la-virpidfile.lo CC util/libvirt_util_la-virpolkit.lo CC util/libvirt_util_la-virportallocator.lo CC util/libvirt_util_la-virprocess.lo CC util/libvirt_util_la-virqemu.lo CC util/libvirt_util_la-virrandom.lo CC util/libvirt_util_la-virresctrl.lo CC util/libvirt_util_la-virrotatingfile.lo CC util/libvirt_util_la-virscsi.lo CC util/libvirt_util_la-virscsihost.lo CC util/libvirt_util_la-virscsivhost.lo CC util/libvirt_util_la-virseclabel.lo CC util/libvirt_util_la-virsecret.lo CC util/libvirt_util_la-virsexpr.lo CC util/libvirt_util_la-virsocketaddr.lo In file included from ../../src/util/virresctrl.c:29: ../../src/util/virresctrl.c: In function 'virResctrlGetMonitorInfo': ../../src/util/virresctrl.c:679:15: error: format '%ld' expects argument of type 'long int', but argument 8 has type 'size_t' {aka 'long long unsigned int'} [-Werror=format=] VIR_DEBUG("Resctrl supported %ld monitoring features", nfeatures); ^~~~~~~~~~~~~~~~~~~~~~~~~~~~~~~~~~~~~~~~~~~ ~~~~~~~~~ ../../src/util/virlog.h:91:73: note: in definition of macro 'VIR_DEBUG_INT' virLogMessage(src, VIR_LOG_DEBUG, filename, linenr, funcname, NULL, __VA_ARGS__) ^~~~~~~~~~~ ../../src/util/virresctrl.c:679:5: note: in expansion of macro 'VIR_DEBUG' VIR_DEBUG("Resctrl supported %ld monitoring features", nfeatures); ^~~~~~~~~ cc1: all warnings being treated as errors gmake[3]: *** [Makefile:11973: util/libvirt_util_la-virresctrl.lo] Error 1 gmake[3]: *** Waiting for unfinished jobs.... rm util/virkeyname-osx.pod util/virkeycode-xtkbd.pod util/virkeycode-atset3.pod util/virkeycode-usb.pod util/virkeycode-qnum.pod util/virkeycode-win32.pod util/virkeyname-linux.pod util/virkeycode-osx.pod util/virkeycode-linux.pod util/virkeycode-atset1.pod util/virkeyname-win32.pod util/virkeycode-atset2.pod gmake[3]: Leaving directory '<https://ci.centos.org/job/libvirt+mingw64-build/systems=libvirt-fedora-rawh…'> gmake[2]: *** [Makefile:7001: all] Error 2 gmake[2]: Leaving directory '<https://ci.centos.org/job/libvirt+mingw64-build/systems=libvirt-fedora-rawh…'> gmake[1]: *** [Makefile:2111: all-recursive] Error 1 gmake[1]: Leaving directory '<https://ci.centos.org/job/libvirt+mingw64-build/systems=libvirt-fedora-rawh…'> gmake: *** [Makefile:2004: all] Error 2 Build step 'Execute shell' marked build as failure
1 2
0 0
[Libvirt-ci] Build failed in Jenkins: libvirt+mingw32-build » libvirt-fedora-rawhide #48
by ci@centos.org 20 Sep '18

20 Sep '18
See <https://ci.centos.org/job/libvirt+mingw32-build/systems=libvirt-fedora-rawh…> Changes: [jferlan] util: Introduce monitor capability interface [jferlan] conf: Refactor cache bank capability structure [jferlan] conf: Refactor memory bandwidth capability structure [jferlan] conf: Introduce RDT monitor host capability ------------------------------------------ [...truncated 129.59 KB...] CC stdio-write.lo CC stpcpy.lo CC strchrnul.lo CC strdup.lo CC strerror.lo CC strerror-override.lo CC strerror_r.lo CC strndup.lo CC strptime.lo CC strsep.lo CC time_r.lo CC timegm.lo CC ttyname_r.lo CC uname.lo CC unsetenv.lo CC usleep.lo CC vasnprintf.lo CC vsnprintf.lo CC waitpid.lo CC wcwidth.lo CC glthread/lock.lo CC uniwidth/width.lo CCLD libgnu.la gmake[3]: Leaving directory '<https://ci.centos.org/job/libvirt+mingw32-build/systems=libvirt-fedora-rawh…'> gmake[2]: Leaving directory '<https://ci.centos.org/job/libvirt+mingw32-build/systems=libvirt-fedora-rawh…'> Making all in include/libvirt gmake[2]: Entering directory '<https://ci.centos.org/job/libvirt+mingw32-build/systems=libvirt-fedora-rawh…'> gmake[2]: Nothing to be done for 'all'. gmake[2]: Leaving directory '<https://ci.centos.org/job/libvirt+mingw32-build/systems=libvirt-fedora-rawh…'> Making all in src gmake[2]: Entering directory '<https://ci.centos.org/job/libvirt+mingw32-build/systems=libvirt-fedora-rawh…'> GEN util/virkeycodetable_linux.h GEN util/virkeycodetable_osx.h GEN util/virkeycodetable_atset1.h GEN util/virkeycodetable_atset3.h GEN util/virkeycodetable_atset2.h GEN util/virkeycodetable_xtkbd.h GEN util/virkeycodetable_usb.h GEN util/virkeycodetable_win32.h GEN util/virkeycodetable_qnum.h GEN util/virkeynametable_linux.h GEN util/virkeynametable_osx.h GEN util/virkeynametable_win32.h GEN ../../src/access/org.libvirt.api.policy GEN access/viraccessapicheck.h GEN access/viraccessapicheck.c GEN access/viraccessapicheckqemu.h GEN access/viraccessapicheckqemu.c GEN access/viraccessapichecklxc.h GEN access/viraccessapichecklxc.c GEN libvirt_access.xml GEN libvirt_access_qemu.xml GEN libvirt_access_lxc.xml GEN logging/log_protocol.h GEN logging/log_daemon_dispatch_stubs.h GEN locking/lock_protocol.h GEN locking/lock_daemon_dispatch_stubs.h GEN admin/admin_protocol.h GEN admin/admin_client.h GEN admin/admin_server_dispatch_stubs.h GEN rpc/virnetprotocol.h GEN rpc/virkeepaliveprotocol.h GEN .esx_vi_generator.stamp GEN .hyperv_wmi_generator.stamp GEN lxc/lxc_monitor_protocol.h GEN lxc/lxc_monitor_dispatch.h GEN ../../src/hyperv/hyperv_wmi_classes.generated.typedef GEN ../../src/hyperv/hyperv_wmi_classes.generated.h GEN ../../src/hyperv/hyperv_wmi_classes.generated.c GEN lxc/lxc_controller_dispatch.h GEN ../../src/esx/esx_vi_types.generated.typedef GEN ../../src/esx/esx_vi_types.generated.typeenum GEN ../../src/esx/esx_vi_types.generated.typetostring GEN ../../src/esx/esx_vi_types.generated.typefromstring GEN ../../src/esx/esx_vi_types.generated.h GEN ../../src/esx/esx_vi_types.generated.c GEN ../../src/esx/esx_vi_methods.generated.h GEN ../../src/esx/esx_vi_methods.generated.c GEN ../../src/esx/esx_vi_methods.generated.macro GEN ../../src/esx/esx_vi.generated.h GEN ../../src/esx/esx_vi.generated.c GEN remote/remote_protocol.h GEN remote/remote_client_bodies.h GEN remote/lxc_protocol.h GEN remote/lxc_client_bodies.h GEN remote/qemu_protocol.h GEN remote/qemu_client_bodies.h GEN remote/remote_daemon_dispatch_stubs.h GEN remote/remote_daemon_dispatch_lxc_stubs.h GEN remote/remote_daemon_dispatch_qemu_stubs.h GEN libvirt_access.syms GEN libvirt_access_qemu.syms GEN libvirt_access_lxc.syms GEN libvirt_qemu.def GEN libvirt_lxc.def GEN libvirt_admin.syms GEN libvirtd.qemu.logrotate GEN libvirtd.lxc.logrotate GEN libvirtd.libxl.logrotate GEN libvirtd.uml.logrotate GEN libvirtd.logrotate GEN logging/log_protocol.c GEN locking/lock_protocol.c GEN admin/admin_protocol.c GEN rpc/virnetprotocol.c GEN rpc/virkeepaliveprotocol.c GEN lxc/lxc_monitor_protocol.c GEN remote/remote_protocol.c GEN remote/lxc_protocol.c GEN remote/qemu_protocol.c GEN libvirt.syms GEN libvirt_admin.def GEN libvirt.def /usr/bin/gmake all-am gmake[3]: Entering directory '<https://ci.centos.org/job/libvirt+mingw32-build/systems=libvirt-fedora-rawh…'> CC libvirt_driver_la-driver.lo CC libvirt_driver_la-datatypes.lo CC libvirt_driver_la-libvirt.lo CC libvirt_driver_la-libvirt-domain.lo CC libvirt_driver_la-libvirt-domain-snapshot.lo CC libvirt_driver_la-libvirt-host.lo CC libvirt_driver_la-libvirt-interface.lo CC libvirt_driver_la-libvirt-network.lo CC libvirt_driver_la-libvirt-nodedev.lo CC libvirt_driver_la-libvirt-nwfilter.lo CC libvirt_driver_la-libvirt-secret.lo CC libvirt_driver_la-libvirt-storage.lo CC libvirt_driver_la-libvirt-stream.lo CC libvirt_qemu_la-libvirt-qemu.lo CC libvirt_lxc_la-libvirt-lxc.lo CC libvirt_admin_la-libvirt-admin.lo CC libvirt_admin_la-datatypes.lo CC admin/libvirt_driver_admin_la-admin_protocol.lo CC admin/libvirt_driver_admin_la-admin_server.lo CC admin/libvirt_driver_admin_la-admin_server_dispatch.lo GEN util/virkeycode-linux.pod GEN util/virkeycode-osx.pod GEN util/virkeycode-atset1.pod GEN util/virkeycode-atset2.pod GEN util/virkeycode-atset3.pod GEN util/virkeycode-xtkbd.pod GEN util/virkeycode-usb.pod GEN util/virkeycode-win32.pod GEN util/virkeycode-qnum.pod GEN util/virkeyname-linux.pod GEN util/virkeyname-osx.pod GEN util/virkeyname-win32.pod CC util/libvirt_util_la-viralloc.lo CC util/libvirt_util_la-virarch.lo CC util/libvirt_util_la-virarptable.lo CC util/libvirt_util_la-viratomic.lo CC util/libvirt_util_la-viraudit.lo CC util/libvirt_util_la-virauth.lo CC util/libvirt_util_la-virauthconfig.lo CC util/libvirt_util_la-virbitmap.lo CC util/libvirt_util_la-virbuffer.lo CC util/libvirt_util_la-virperf.lo CC util/libvirt_util_la-vircgroup.lo CC util/libvirt_util_la-virclosecallbacks.lo CC util/libvirt_util_la-vircommand.lo CC util/libvirt_util_la-virconf.lo CC util/libvirt_util_la-vircrypto.lo CC util/libvirt_util_la-virdbus.lo CC util/libvirt_util_la-virdevmapper.lo CC util/libvirt_util_la-virdnsmasq.lo CC util/libvirt_util_la-virebtables.lo CC util/libvirt_util_la-virerror.lo CC util/libvirt_util_la-virevent.lo CC util/libvirt_util_la-vireventpoll.lo CC util/libvirt_util_la-virfcp.lo CC util/libvirt_util_la-virfdstream.lo CC util/libvirt_util_la-virfile.lo CC util/libvirt_util_la-virfirewall.lo CC util/libvirt_util_la-virfirmware.lo CC util/libvirt_util_la-virgettext.lo CC util/libvirt_util_la-virgic.lo CC util/libvirt_util_la-virhash.lo CC util/libvirt_util_la-virhashcode.lo CC util/libvirt_util_la-virhook.lo CC util/libvirt_util_la-virhostcpu.lo CC util/libvirt_util_la-virhostdev.lo CC util/libvirt_util_la-virhostmem.lo CC util/libvirt_util_la-viridentity.lo CC util/libvirt_util_la-virinitctl.lo CC util/libvirt_util_la-viriptables.lo CC util/libvirt_util_la-viriscsi.lo CC util/libvirt_util_la-virjson.lo CC util/libvirt_util_la-virkeycode.lo CC util/libvirt_util_la-virkeyfile.lo CC util/libvirt_util_la-virlease.lo CC util/libvirt_util_la-virlockspace.lo CC util/libvirt_util_la-virlog.lo CC util/libvirt_util_la-virmacaddr.lo CC util/libvirt_util_la-virmacmap.lo CC util/libvirt_util_la-virmodule.lo CC util/libvirt_util_la-virnetdev.lo CC util/libvirt_util_la-virnetdevbandwidth.lo CC util/libvirt_util_la-virnetdevbridge.lo CC util/libvirt_util_la-virnetdevip.lo CC util/libvirt_util_la-virnetdevmacvlan.lo CC util/libvirt_util_la-virnetdevmidonet.lo CC util/libvirt_util_la-virnetdevopenvswitch.lo CC util/libvirt_util_la-virnetdevtap.lo CC util/libvirt_util_la-virnetdevveth.lo CC util/libvirt_util_la-virnetdevvlan.lo CC util/libvirt_util_la-virnetdevvportprofile.lo CC util/libvirt_util_la-virnetlink.lo CC util/libvirt_util_la-virnodesuspend.lo CC util/libvirt_util_la-virkmod.lo CC util/libvirt_util_la-virnuma.lo CC util/libvirt_util_la-virobject.lo CC util/libvirt_util_la-virpci.lo CC util/libvirt_util_la-virpidfile.lo CC util/libvirt_util_la-virpolkit.lo CC util/libvirt_util_la-virportallocator.lo CC util/libvirt_util_la-virprocess.lo CC util/libvirt_util_la-virqemu.lo CC util/libvirt_util_la-virrandom.lo CC util/libvirt_util_la-virresctrl.lo CC util/libvirt_util_la-virrotatingfile.lo CC util/libvirt_util_la-virscsi.lo CC util/libvirt_util_la-virscsihost.lo CC util/libvirt_util_la-virscsivhost.lo CC util/libvirt_util_la-virseclabel.lo CC util/libvirt_util_la-virsecret.lo CC util/libvirt_util_la-virsexpr.lo CC util/libvirt_util_la-virsocketaddr.lo In file included from ../../src/util/virresctrl.c:29: ../../src/util/virresctrl.c: In function 'virResctrlGetMonitorInfo': ../../src/util/virresctrl.c:679:15: error: format '%ld' expects argument of type 'long int', but argument 8 has type 'size_t' {aka 'unsigned int'} [-Werror=format=] VIR_DEBUG("Resctrl supported %ld monitoring features", nfeatures); ^~~~~~~~~~~~~~~~~~~~~~~~~~~~~~~~~~~~~~~~~~~ ~~~~~~~~~ ../../src/util/virlog.h:91:73: note: in definition of macro 'VIR_DEBUG_INT' virLogMessage(src, VIR_LOG_DEBUG, filename, linenr, funcname, NULL, __VA_ARGS__) ^~~~~~~~~~~ ../../src/util/virresctrl.c:679:5: note: in expansion of macro 'VIR_DEBUG' VIR_DEBUG("Resctrl supported %ld monitoring features", nfeatures); ^~~~~~~~~ cc1: all warnings being treated as errors gmake[3]: *** [Makefile:11973: util/libvirt_util_la-virresctrl.lo] Error 1 gmake[3]: *** Waiting for unfinished jobs.... rm util/virkeyname-osx.pod util/virkeycode-xtkbd.pod util/virkeycode-atset3.pod util/virkeycode-usb.pod util/virkeycode-qnum.pod util/virkeycode-win32.pod util/virkeyname-linux.pod util/virkeycode-osx.pod util/virkeycode-linux.pod util/virkeycode-atset1.pod util/virkeyname-win32.pod util/virkeycode-atset2.pod gmake[3]: Leaving directory '<https://ci.centos.org/job/libvirt+mingw32-build/systems=libvirt-fedora-rawh…'> gmake[2]: *** [Makefile:7001: all] Error 2 gmake[2]: Leaving directory '<https://ci.centos.org/job/libvirt+mingw32-build/systems=libvirt-fedora-rawh…'> gmake[1]: *** [Makefile:2111: all-recursive] Error 1 gmake[1]: Leaving directory '<https://ci.centos.org/job/libvirt+mingw32-build/systems=libvirt-fedora-rawh…'> gmake: *** [Makefile:2004: all] Error 2 Build step 'Execute shell' marked build as failure
1 2
0 0
[Libvirt-ci] Fixed: libvirt/libvirt#1702 (master - 2c476db)
by Travis CI 20 Sep '18

20 Sep '18
Build Update for libvirt/libvirt ------------------------------------- Build: #1702 Status: Fixed Duration: 20 mins and 59 secs Commit: 2c476db (master) Author: John Ferlan Message: util: Fix travis build error Commit 12093f1f used %ld instead of %zd for a size_t. Signed-off-by: John Ferlan <jferlan(a)redhat.com> View the changeset: https://github.com/libvirt/libvirt/compare/e3a42028af88...2c476dbc071a View the full build log and details: https://travis-ci.org/libvirt/libvirt/builds/431180766?utm_medium=notificat… -- You can unsubscribe from build emails from the libvirt/libvirt repository going to https://travis-ci.org/account/preferences/unsubscribe?repository=4872032&ut…. Or unsubscribe from *all* email updating your settings at https://travis-ci.org/account/preferences/unsubscribe?utm_medium=notificati…. Or configure specific recipients for build notifications in your .travis.yml file. See https://docs.travis-ci.com/user/notifications.
1 0
0 0
[Libvirt-ci] Build failed in Jenkins: libvirt-dbus-check » libvirt-freebsd-11 #29
by ci@centos.org 20 Sep '18

20 Sep '18
See <https://ci.centos.org/job/libvirt-dbus-check/systems=libvirt-freebsd-11/29/…> ------------------------------------------ Started by upstream project "libvirt-dbus-check" build number 29 originally caused by: Started by upstream project "libvirt-dbus-syntax-check" build number 29 originally caused by: Started by upstream project "libvirt-dbus-build" build number 29 originally caused by: Started by upstream project "libvirt-glib-build" build number 29 originally caused by: Started by upstream project "libvirt-build" build number 44 originally caused by: Started by user Libvirt [EnvInject] - Loading node environment variables. Building remotely on libvirt-freebsd-11 (libvirt) in workspace <https://ci.centos.org/job/libvirt-dbus-check/systems=libvirt-freebsd-11/ws/> [libvirt-dbus] $ /bin/sh -xe /tmp/jenkins8855371048141546662.sh + cd build + /usr/local/bin/gmake check Making check in data gmake[1]: Entering directory '/usr<https://ci.centos.org/job/libvirt-dbus-check/systems=libvirt-freebsd-11/ws/…'> gmake[1]: Nothing to be done for 'check'. gmake[1]: Leaving directory '/usr<https://ci.centos.org/job/libvirt-dbus-check/systems=libvirt-freebsd-11/ws/…'> Making check in docs gmake[1]: Entering directory '/usr<https://ci.centos.org/job/libvirt-dbus-check/systems=libvirt-freebsd-11/ws/…'> gmake[1]: Nothing to be done for 'check'. gmake[1]: Leaving directory '/usr<https://ci.centos.org/job/libvirt-dbus-check/systems=libvirt-freebsd-11/ws/…'> Making check in src gmake[1]: Entering directory '/usr<https://ci.centos.org/job/libvirt-dbus-check/systems=libvirt-freebsd-11/ws/…'> gmake[1]: Nothing to be done for 'check'. gmake[1]: Leaving directory '/usr<https://ci.centos.org/job/libvirt-dbus-check/systems=libvirt-freebsd-11/ws/…'> Making check in tests gmake[1]: Entering directory '/usr<https://ci.centos.org/job/libvirt-dbus-check/systems=libvirt-freebsd-11/ws/…'> /usr/local/bin/gmake test_util gmake[2]: Entering directory '/usr<https://ci.centos.org/job/libvirt-dbus-check/systems=libvirt-freebsd-11/ws/…'> CC test_util-test_util.o CCLD test_util gmake[2]: Leaving directory '/usr<https://ci.centos.org/job/libvirt-dbus-check/systems=libvirt-freebsd-11/ws/…'> /usr/local/bin/gmake check-TESTS gmake[2]: Entering directory '/usr<https://ci.centos.org/job/libvirt-dbus-check/systems=libvirt-freebsd-11/ws/…'> gmake[3]: Entering directory '/usr<https://ci.centos.org/job/libvirt-dbus-check/systems=libvirt-freebsd-11/ws/…'> PASS: test_util PASS: test_interface.py PASS: test_domain.py PASS: test_nodedev.py FAIL: test_network.py PASS: test_connect.py PASS: test_storage.py ============================================================================ Testsuite summary for libvirt-dbus 1.3.0 ============================================================================ # TOTAL: 7 # PASS: 6 # SKIP: 0 # XFAIL: 0 # FAIL: 1 # XPASS: 0 # ERROR: 0 ============================================================================ See tests/test-suite.log Please report to libvir-list(a)redhat.com ============================================================================ gmake[3]: *** [Makefile:766: test-suite.log] Error 1 gmake[3]: Leaving directory '/usr<https://ci.centos.org/job/libvirt-dbus-check/systems=libvirt-freebsd-11/ws/…'> gmake[2]: *** [Makefile:874: check-TESTS] Error 2 gmake[2]: Leaving directory '/usr<https://ci.centos.org/job/libvirt-dbus-check/systems=libvirt-freebsd-11/ws/…'> gmake[1]: *** [Makefile:990: check-am] Error 2 gmake[1]: Leaving directory '/usr<https://ci.centos.org/job/libvirt-dbus-check/systems=libvirt-freebsd-11/ws/…'> gmake: *** [Makefile:460: check-recursive] Error 1 + cat tests/test-suite.log ============================================== libvirt-dbus 1.3.0: tests/test-suite.log ============================================== # TOTAL: 7 # PASS: 6 # SKIP: 0 # XFAIL: 0 # FAIL: 1 # XPASS: 0 # ERROR: 0 .. contents:: :depth: 2 FAIL: test_network.py ===================== ============================= test session starts ============================== platform freebsd11 -- Python 3.6.5, pytest-3.4.2, py-1.5.3, pluggy-0.6.0 rootdir: /usr<https://ci.centos.org/job/libvirt-dbus-check/systems=libvirt-freebsd-11/ws/,> inifile: collected 7 items ../../tests/test_network.py E.....F [100%] ==================================== ERRORS ==================================== __________ ERROR at setup of TestNetwork.test_network_properties_type __________ self = <test_network.TestNetwork object at 0x809448b38> request = <SubRequest 'libvirt_dbus_setup' for <Function 'test_network_properties_type'>> @pytest.fixture(autouse=True) def libvirt_dbus_setup(self, request): """Start libvirt-dbus for each test function """ os.environ['LIBVIRT_DEBUG'] = '3' self.libvirt_dbus = subprocess.Popen([exe, '--session']) self.bus = dbus.SessionBus() for i in range(10): if self.bus.name_has_owner('org.libvirt'): break time.sleep(0.1) else: > raise TimeoutError('error starting libvirt-dbus') E TimeoutError: error starting libvirt-dbus ../../tests/libvirttest.py:44: TimeoutError =================================== FAILURES =================================== TestNetwork.test_network_update[4-4-0-\n <host mac='00:16:3e:77:e2:ed' name='foo.example.com' ip='192.168.122.10'/>\n -0] self = <test_network.TestNetwork object at 0x809435630>, command = '4' section = '4', parentIndex = 0 xml_str = "\n <host mac='00:16:3e:77:e2:ed' name='foo.example.com' ip='192.168.122.10'/>\n " flags = 0 @pytest.mark.parametrize("command, section, parentIndex, xml_str, flags", [ ('4', '4', 0, ip_dhcp_host_xml, 0), # add-first, ip-dhcp-host ]) def test_network_update(self, command, section, parentIndex, xml_str, flags): > _, test_network = self.get_test_network() ../../tests/test_network.py:91: _ _ _ _ _ _ _ _ _ _ _ _ _ _ _ _ _ _ _ _ _ _ _ _ _ _ _ _ _ _ _ _ _ _ _ _ _ _ _ _ self = <test_network.TestNetwork object at 0x809435630> def get_test_network(self): """Fetch information for the test network from test driver Returns: (dbus.proxies.ProxyObject, dbus.proxies.ProxyObject): Test Network Object, Local proxy for the test Network Object. """ > path = self.connect.ListNetworks(0)[0] E IndexError: list index out of range ../../tests/libvirttest.py:138: IndexError --------------------------- Captured stderr teardown --------------------------- Disconnected from D-Bus. Disconnected from D-Bus. ================= 1 failed, 5 passed, 1 error in 8.49 seconds ================== FAIL test_network.py (exit status: 1) + exit 1 Build step 'Execute shell' marked build as failure
1 1
0 0
[Libvirt-ci] Still Failing: libvirt/libvirt#1701 (master - e3a4202)
by Travis CI 20 Sep '18

20 Sep '18
Build Update for libvirt/libvirt ------------------------------------- Build: #1701 Status: Still Failing Duration: 20 mins and 56 secs Commit: e3a4202 (master) Author: John Ferlan Message: Remove ignore_value or void from unlink calls There seems to be no need to add the ignore_value wrapper or caste with (void) to the unlink() calls, so let's just remove them. I assume at one point in time Coverity complained. So, let's just be consistent - those that care to check the return status can and those that don't can just have the naked unlink. Signed-off-by: John Ferlan <jferlan(a)redhat.com> Reviewed-by: Erik Skultety <eskultet(a)redhat.com> View the changeset: https://github.com/libvirt/libvirt/compare/6af841741550...e3a42028af88 View the full build log and details: https://travis-ci.org/libvirt/libvirt/builds/431155798?utm_medium=notificat… -- You can unsubscribe from build emails from the libvirt/libvirt repository going to https://travis-ci.org/account/preferences/unsubscribe?repository=4872032&ut…. Or unsubscribe from *all* email updating your settings at https://travis-ci.org/account/preferences/unsubscribe?utm_medium=notificati…. Or configure specific recipients for build notifications in your .travis.yml file. See https://docs.travis-ci.com/user/notifications.
1 0
0 0
  • ← Newer
  • 1
  • ...
  • 833
  • 834
  • 835
  • 836
  • 837
  • 838
  • 839
  • ...
  • 1022
  • Older →

HyperKitty Powered by HyperKitty version 1.3.12.