libvirt List Archives
Sign In Sign Up
Manage this list Sign In Sign Up

Keyboard Shortcuts

Thread View

  • j: Next unread message
  • k: Previous unread message
  • j a: Jump to all threads
  • j l: Jump to MailingList overview

CI

Thread Start a new thread
Download
Threads by month
  • ----- 2026 -----
  • September
  • August
  • July
  • June
  • May
  • April
  • March
  • February
  • January
  • ----- 2025 -----
  • December
  • November
  • October
  • September
  • August
  • July
  • June
  • May
  • April
  • March
  • February
  • January
  • ----- 2024 -----
  • December
  • November
  • October
  • September
  • August
  • July
  • June
  • May
  • April
  • March
  • February
  • January
  • ----- 2023 -----
  • December
  • November
  • October
  • September
  • August
  • July
  • June
  • May
  • April
  • March
  • February
  • January
  • ----- 2022 -----
  • December
  • November
  • October
  • September
  • August
  • July
  • June
  • May
  • April
  • March
  • February
  • January
  • ----- 2021 -----
  • December
  • November
  • October
  • September
  • August
  • July
  • June
  • May
  • April
  • March
  • February
  • January
  • ----- 2020 -----
  • December
  • November
  • October
  • September
  • August
  • July
  • June
  • May
  • April
  • March
  • February
  • January
  • ----- 2019 -----
  • December
  • November
  • October
  • September
  • August
  • July
  • June
  • May
  • April
  • March
  • February
  • January
  • ----- 2018 -----
  • December
  • November
  • October
  • September
  • August
  • July
  • June
  • May
  • April
  • March
  • February
  • January
  • ----- 2017 -----
  • December
  • November
  • October
  • September
  • August
  • July
  • June
  • May
  • April
  • March
  • February
  • January
  • ----- 2016 -----
  • December
  • November
  • October
  • September
  • August
  • July
ci@lists.libvirt.org

  • 2 participants
  • 10211 discussions
[Libvirt-ci] Build failed in Jenkins: libosinfo-check » libvirt-fedora-27 #25
by ci@centos.org 15 Oct '18

15 Oct '18
See <https://ci.centos.org/job/libosinfo-check/systems=libvirt-fedora-27/25/disp…> ------------------------------------------ Started by upstream project "libosinfo-check" build number 25 originally caused by: Started by upstream project "libosinfo-syntax-check" build number 25 originally caused by: Started by upstream project "libosinfo-build" build number 25 originally caused by: Started by upstream project "osinfo-db-build" build number 18 originally caused by: Started by upstream project "osinfo-db-tools-build" build number 5 originally caused by: Started by an SCM change [EnvInject] - Loading node environment variables. Building remotely on libvirt-fedora-27 (libvirt) in workspace <https://ci.centos.org/job/libosinfo-check/systems=libvirt-fedora-27/ws/> [libosinfo] $ /bin/sh -xe /tmp/jenkins625032861861364313.sh + export LIBOSINFO_NETWORK_TESTS=1 + LIBOSINFO_NETWORK_TESTS=1 + cd build + /usr/bin/gmake check GEN public-submodule-commit Making check in osinfo gmake[1]: Entering directory '<https://ci.centos.org/job/libosinfo-check/systems=libvirt-fedora-27/ws/buil…'> /usr/bin/gmake check-am gmake[2]: Entering directory '<https://ci.centos.org/job/libosinfo-check/systems=libvirt-fedora-27/ws/buil…'> /usr/bin/gmake check-local gmake[3]: Entering directory '<https://ci.centos.org/job/libosinfo-check/systems=libvirt-fedora-27/ws/buil…'> GEN check-symfile GEN check-symsorting gmake[3]: Leaving directory '<https://ci.centos.org/job/libosinfo-check/systems=libvirt-fedora-27/ws/buil…'> gmake[2]: Leaving directory '<https://ci.centos.org/job/libosinfo-check/systems=libvirt-fedora-27/ws/buil…'> gmake[1]: Leaving directory '<https://ci.centos.org/job/libosinfo-check/systems=libvirt-fedora-27/ws/buil…'> Making check in tools gmake[1]: Entering directory '<https://ci.centos.org/job/libosinfo-check/systems=libvirt-fedora-27/ws/buil…'> gmake[1]: Nothing to be done for 'check'. gmake[1]: Leaving directory '<https://ci.centos.org/job/libosinfo-check/systems=libvirt-fedora-27/ws/buil…'> Making check in docs gmake[1]: Entering directory '<https://ci.centos.org/job/libosinfo-check/systems=libvirt-fedora-27/ws/buil…'> Making check in reference gmake[2]: Entering directory '<https://ci.centos.org/job/libosinfo-check/systems=libvirt-fedora-27/ws/buil…'> gmake[2]: Nothing to be done for 'check'. gmake[2]: Leaving directory '<https://ci.centos.org/job/libosinfo-check/systems=libvirt-fedora-27/ws/buil…'> gmake[2]: Entering directory '<https://ci.centos.org/job/libosinfo-check/systems=libvirt-fedora-27/ws/buil…'> gmake[2]: Nothing to be done for 'check-am'. gmake[2]: Leaving directory '<https://ci.centos.org/job/libosinfo-check/systems=libvirt-fedora-27/ws/buil…'> gmake[1]: Leaving directory '<https://ci.centos.org/job/libosinfo-check/systems=libvirt-fedora-27/ws/buil…'> Making check in po gmake[1]: Entering directory '<https://ci.centos.org/job/libosinfo-check/systems=libvirt-fedora-27/ws/buil…'> INTLTOOL_EXTRACT="/usr/bin/intltool-extract" XGETTEXT="/usr/bin/xgettext" srcdir=../../po /usr/bin/intltool-update --gettext-package libosinfo --pot rm -f missing notexist srcdir=../../po /usr/bin/intltool-update -m if [ -r missing -o -r notexist ]; then \ exit 1; \ fi gmake[1]: Leaving directory '<https://ci.centos.org/job/libosinfo-check/systems=libvirt-fedora-27/ws/buil…'> Making check in examples gmake[1]: Entering directory '<https://ci.centos.org/job/libosinfo-check/systems=libvirt-fedora-27/ws/buil…'> gmake[1]: Nothing to be done for 'check'. gmake[1]: Leaving directory '<https://ci.centos.org/job/libosinfo-check/systems=libvirt-fedora-27/ws/buil…'> Making check in tests gmake[1]: Entering directory '<https://ci.centos.org/job/libosinfo-check/systems=libvirt-fedora-27/ws/buil…'> /usr/bin/gmake test-entity test-device test-list test-devicelist test-filter test-product test-os test-oslist test-productfilter test-platform test-platformlist test-db test-loader test-isodetect test-install-script test-os-resources test-mediauris test-treeuris gmake[2]: Entering directory '<https://ci.centos.org/job/libosinfo-check/systems=libvirt-fedora-27/ws/buil…'> CC test_device-test-device.o CC test_entity-test-entity.o CC test_list-test-list.o CC test_devicelist-test-devicelist.o CC test_filter-test-filter.o CC test_product-test-product.o CC test_os-test-os.o CC test_oslist-test-oslist.o CC test_productfilter-test-productfilter.o CC test_platform-test-platform.o CC test_platformlist-test-platformlist.o CC test_db-test-db.o CC test_loader-test-loader.o CC test_isodetect-test-isodetect.o CC test_install_script-test-install-script.o CC test_os_resources-test-os-resources.o CC test_mediauris-test-mediauris.o CC test_treeuris-test-treeuris.o CCLD test-entity CCLD test-device CCLD test-list CCLD test-devicelist CCLD test-filter CCLD test-product CCLD test-os CCLD test-oslist CCLD test-productfilter CCLD test-platform CCLD test-platformlist CCLD test-db CCLD test-loader CCLD test-isodetect CCLD test-install-script CCLD test-os-resources CCLD test-mediauris CCLD test-treeuris gmake[2]: Leaving directory '<https://ci.centos.org/job/libosinfo-check/systems=libvirt-fedora-27/ws/buil…'> /usr/bin/gmake check-TESTS gmake[2]: Entering directory '<https://ci.centos.org/job/libosinfo-check/systems=libvirt-fedora-27/ws/buil…'> gmake[3]: Entering directory '<https://ci.centos.org/job/libosinfo-check/systems=libvirt-fedora-27/ws/buil…'> PASS: test-device PASS: test-entity PASS: test-list PASS: test-filter PASS: test-devicelist PASS: test-product PASS: test-os PASS: test-oslist PASS: test-productfilter PASS: test-platformlist PASS: test-platform PASS: test-db PASS: test-install-script PASS: test-loader PASS: test-os-resources PASS: test-treeuris PASS: test-isodetect ../../build-aux/test-driver: line 107: 12205 Aborted (core dumped) "$@" > $log_file 2>&1 FAIL: test-mediauris ============================================================================ Testsuite summary for libosinfo 1.3.0 ============================================================================ # TOTAL: 18 # PASS: 17 # SKIP: 0 # XFAIL: 0 # FAIL: 1 # XPASS: 0 # ERROR: 0 ============================================================================ See tests/test-suite.log Please report to libosinfo(a)redhat.com ============================================================================ gmake[3]: *** [Makefile:1289: test-suite.log] Error 1 gmake[3]: Leaving directory '<https://ci.centos.org/job/libosinfo-check/systems=libvirt-fedora-27/ws/buil…'> gmake[2]: *** [Makefile:1397: check-TESTS] Error 2 gmake[2]: Leaving directory '<https://ci.centos.org/job/libosinfo-check/systems=libvirt-fedora-27/ws/buil…'> gmake[1]: *** [Makefile:1587: check-am] Error 2 gmake[1]: Leaving directory '<https://ci.centos.org/job/libosinfo-check/systems=libvirt-fedora-27/ws/buil…'> gmake: *** [Makefile:594: check-recursive] Error 1 + cat tests/test-suite.log =========================================== libosinfo 1.3.0: tests/test-suite.log =========================================== # TOTAL: 18 # PASS: 17 # SKIP: 0 # XFAIL: 0 # FAIL: 1 # XPASS: 0 # ERROR: 0 .. contents:: :depth: 2 FAIL: test-mediauris ==================== /mediauris/uris: ** ERROR:../../tests/test-mediauris.c:50:test_media: assertion failed (res == CURLE_OK): (28 == 0) FAIL test-mediauris (exit status: 134) + exit 1 Build step 'Execute shell' marked build as failure
1 1
0 0
[Libvirt-ci] Build failed in Jenkins: libosinfo-check » libvirt-freebsd-10 #25
by ci@centos.org 15 Oct '18

15 Oct '18
See <https://ci.centos.org/job/libosinfo-check/systems=libvirt-freebsd-10/25/dis…> ------------------------------------------ Started by upstream project "libosinfo-check" build number 25 originally caused by: Started by upstream project "libosinfo-syntax-check" build number 25 originally caused by: Started by upstream project "libosinfo-build" build number 25 originally caused by: Started by upstream project "osinfo-db-build" build number 18 originally caused by: Started by upstream project "osinfo-db-tools-build" build number 5 originally caused by: Started by an SCM change [EnvInject] - Loading node environment variables. Building remotely on libvirt-freebsd-10 (libvirt) in workspace <https://ci.centos.org/job/libosinfo-check/systems=libvirt-freebsd-10/ws/> [libosinfo] $ /bin/sh -xe /tmp/jenkins4195017440608769323.sh + export LIBOSINFO_NETWORK_TESTS=1 + cd build + /usr/local/bin/gmake check Making check in osinfo GEN public-submodule-commit gmake[1]: Entering directory '/usr<https://ci.centos.org/job/libosinfo-check/systems=libvirt-freebsd-10/ws/bui…'> /usr/local/bin/gmake check-am gmake[2]: Entering directory '/usr<https://ci.centos.org/job/libosinfo-check/systems=libvirt-freebsd-10/ws/bui…'> /usr/local/bin/gmake check-local gmake[3]: Entering directory '/usr<https://ci.centos.org/job/libosinfo-check/systems=libvirt-freebsd-10/ws/bui…'> GEN check-symsorting gmake[3]: Leaving directory '/usr<https://ci.centos.org/job/libosinfo-check/systems=libvirt-freebsd-10/ws/bui…'> gmake[2]: Leaving directory '/usr<https://ci.centos.org/job/libosinfo-check/systems=libvirt-freebsd-10/ws/bui…'> gmake[1]: Leaving directory '/usr<https://ci.centos.org/job/libosinfo-check/systems=libvirt-freebsd-10/ws/bui…'> Making check in tools gmake[1]: Entering directory '/usr<https://ci.centos.org/job/libosinfo-check/systems=libvirt-freebsd-10/ws/bui…'> gmake[1]: Nothing to be done for 'check'. gmake[1]: Leaving directory '/usr<https://ci.centos.org/job/libosinfo-check/systems=libvirt-freebsd-10/ws/bui…'> Making check in docs gmake[1]: Entering directory '/usr<https://ci.centos.org/job/libosinfo-check/systems=libvirt-freebsd-10/ws/bui…'> Making check in reference gmake[2]: Entering directory '/usr<https://ci.centos.org/job/libosinfo-check/systems=libvirt-freebsd-10/ws/bui…'> gmake[2]: Nothing to be done for 'check'. gmake[2]: Leaving directory '/usr<https://ci.centos.org/job/libosinfo-check/systems=libvirt-freebsd-10/ws/bui…'> gmake[2]: Entering directory '/usr<https://ci.centos.org/job/libosinfo-check/systems=libvirt-freebsd-10/ws/bui…'> gmake[2]: Nothing to be done for 'check-am'. gmake[2]: Leaving directory '/usr<https://ci.centos.org/job/libosinfo-check/systems=libvirt-freebsd-10/ws/bui…'> gmake[1]: Leaving directory '/usr<https://ci.centos.org/job/libosinfo-check/systems=libvirt-freebsd-10/ws/bui…'> Making check in po gmake[1]: Entering directory '/usr<https://ci.centos.org/job/libosinfo-check/systems=libvirt-freebsd-10/ws/bui…'> INTLTOOL_EXTRACT="/usr/local/bin/intltool-extract" XGETTEXT="/usr/local/bin/xgettext" srcdir=../../po /usr/local/bin/intltool-update --gettext-package libosinfo --pot rm -f missing notexist srcdir=../../po /usr/local/bin/intltool-update -m if [ -r missing -o -r notexist ]; then \ exit 1; \ fi gmake[1]: Leaving directory '/usr<https://ci.centos.org/job/libosinfo-check/systems=libvirt-freebsd-10/ws/bui…'> Making check in examples gmake[1]: Entering directory '/usr<https://ci.centos.org/job/libosinfo-check/systems=libvirt-freebsd-10/ws/bui…'> gmake[1]: Nothing to be done for 'check'. gmake[1]: Leaving directory '/usr<https://ci.centos.org/job/libosinfo-check/systems=libvirt-freebsd-10/ws/bui…'> Making check in tests gmake[1]: Entering directory '/usr<https://ci.centos.org/job/libosinfo-check/systems=libvirt-freebsd-10/ws/bui…'> /usr/local/bin/gmake test-entity test-device test-list test-devicelist test-filter test-product test-os test-oslist test-productfilter test-platform test-platformlist test-db test-loader test-isodetect test-install-script test-os-resources test-mediauris test-treeuris gmake[2]: Entering directory '/usr<https://ci.centos.org/job/libosinfo-check/systems=libvirt-freebsd-10/ws/bui…'> CC test_entity-test-entity.o CC test_device-test-device.o CC test_list-test-list.o CC test_devicelist-test-devicelist.o CC test_filter-test-filter.o CC test_product-test-product.o CC test_os-test-os.o CC test_oslist-test-oslist.o CC test_productfilter-test-productfilter.o CC test_platform-test-platform.o CC test_platformlist-test-platformlist.o CC test_db-test-db.o CC test_loader-test-loader.o CC test_isodetect-test-isodetect.o CC test_install_script-test-install-script.o CC test_os_resources-test-os-resources.o CC test_mediauris-test-mediauris.o CC test_treeuris-test-treeuris.o CCLD test-entity CCLD test-device CCLD test-list CCLD test-devicelist CCLD test-filter CCLD test-product CCLD test-os CCLD test-oslist CCLD test-productfilter CCLD test-platform CCLD test-platformlist CCLD test-db CCLD test-loader CCLD test-isodetect CCLD test-install-script CCLD test-os-resources CCLD test-mediauris CCLD test-treeuris gmake[2]: Leaving directory '/usr<https://ci.centos.org/job/libosinfo-check/systems=libvirt-freebsd-10/ws/bui…'> /usr/local/bin/gmake check-TESTS gmake[2]: Entering directory '/usr<https://ci.centos.org/job/libosinfo-check/systems=libvirt-freebsd-10/ws/bui…'> gmake[3]: Entering directory '/usr<https://ci.centos.org/job/libosinfo-check/systems=libvirt-freebsd-10/ws/bui…'> PASS: test-device PASS: test-entity PASS: test-list PASS: test-devicelist PASS: test-filter PASS: test-product PASS: test-oslist PASS: test-productfilter PASS: test-os PASS: test-platform PASS: test-platformlist PASS: test-db PASS: test-install-script PASS: test-loader PASS: test-os-resources PASS: test-treeuris PASS: test-isodetect Abort trap (core dumped) FAIL: test-mediauris ============================================================================ Testsuite summary for libosinfo 1.3.0 ============================================================================ # TOTAL: 18 # PASS: 17 # SKIP: 0 # XFAIL: 0 # FAIL: 1 # XPASS: 0 # ERROR: 0 ============================================================================ See tests/test-suite.log Please report to libosinfo(a)redhat.com ============================================================================ gmake[3]: *** [Makefile:1313: test-suite.log] Error 1 gmake[3]: Leaving directory '/usr<https://ci.centos.org/job/libosinfo-check/systems=libvirt-freebsd-10/ws/bui…'> gmake[2]: *** [Makefile:1421: check-TESTS] Error 2 gmake[2]: Leaving directory '/usr<https://ci.centos.org/job/libosinfo-check/systems=libvirt-freebsd-10/ws/bui…'> gmake[1]: *** [Makefile:1614: check-am] Error 2 gmake[1]: Leaving directory '/usr<https://ci.centos.org/job/libosinfo-check/systems=libvirt-freebsd-10/ws/bui…'> gmake: *** [Makefile:594: check-recursive] Error 1 + cat tests/test-suite.log =========================================== libosinfo 1.3.0: tests/test-suite.log =========================================== # TOTAL: 18 # PASS: 17 # SKIP: 0 # XFAIL: 0 # FAIL: 1 # XPASS: 0 # ERROR: 0 .. contents:: :depth: 2 FAIL: test-mediauris ==================== /mediauris/uris: ** ERROR:../../tests/test-mediauris.c:50:test_media: assertion failed (res == CURLE_OK): (28 == 0) FAIL test-mediauris (exit status: 134) + exit 1 Build step 'Execute shell' marked build as failure
1 1
0 0
[Libvirt-ci] Build failed in Jenkins: libosinfo-check » libvirt-fedora-rawhide #23
by ci@centos.org 15 Oct '18

15 Oct '18
See <https://ci.centos.org/job/libosinfo-check/systems=libvirt-fedora-rawhide/23…> ------------------------------------------ Started by upstream project "libosinfo-check" build number 23 originally caused by: Started by upstream project "libosinfo-syntax-check" build number 23 originally caused by: Started by upstream project "libosinfo-build" build number 23 originally caused by: Started by upstream project "osinfo-db-build" build number 16 originally caused by: Started by an SCM change [EnvInject] - Loading node environment variables. Building remotely on libvirt-fedora-rawhide (libvirt) in workspace <https://ci.centos.org/job/libosinfo-check/systems=libvirt-fedora-rawhide/ws/> [libosinfo] $ /bin/sh -xe /tmp/jenkins8451179203710406192.sh + export LIBOSINFO_NETWORK_TESTS=1 + LIBOSINFO_NETWORK_TESTS=1 + cd build + /usr/bin/gmake check GEN public-submodule-commit Making check in osinfo gmake[1]: Entering directory '<https://ci.centos.org/job/libosinfo-check/systems=libvirt-fedora-rawhide/ws…'> /usr/bin/gmake check-am gmake[2]: Entering directory '<https://ci.centos.org/job/libosinfo-check/systems=libvirt-fedora-rawhide/ws…'> /usr/bin/gmake check-local gmake[3]: Entering directory '<https://ci.centos.org/job/libosinfo-check/systems=libvirt-fedora-rawhide/ws…'> GEN check-symfile GEN check-symsorting gmake[3]: Leaving directory '<https://ci.centos.org/job/libosinfo-check/systems=libvirt-fedora-rawhide/ws…'> gmake[2]: Leaving directory '<https://ci.centos.org/job/libosinfo-check/systems=libvirt-fedora-rawhide/ws…'> gmake[1]: Leaving directory '<https://ci.centos.org/job/libosinfo-check/systems=libvirt-fedora-rawhide/ws…'> Making check in tools gmake[1]: Entering directory '<https://ci.centos.org/job/libosinfo-check/systems=libvirt-fedora-rawhide/ws…'> gmake[1]: Nothing to be done for 'check'. gmake[1]: Leaving directory '<https://ci.centos.org/job/libosinfo-check/systems=libvirt-fedora-rawhide/ws…'> Making check in docs gmake[1]: Entering directory '<https://ci.centos.org/job/libosinfo-check/systems=libvirt-fedora-rawhide/ws…'> Making check in reference gmake[2]: Entering directory '<https://ci.centos.org/job/libosinfo-check/systems=libvirt-fedora-rawhide/ws…'> gmake[2]: Nothing to be done for 'check'. gmake[2]: Leaving directory '<https://ci.centos.org/job/libosinfo-check/systems=libvirt-fedora-rawhide/ws…'> gmake[2]: Entering directory '<https://ci.centos.org/job/libosinfo-check/systems=libvirt-fedora-rawhide/ws…'> gmake[2]: Nothing to be done for 'check-am'. gmake[2]: Leaving directory '<https://ci.centos.org/job/libosinfo-check/systems=libvirt-fedora-rawhide/ws…'> gmake[1]: Leaving directory '<https://ci.centos.org/job/libosinfo-check/systems=libvirt-fedora-rawhide/ws…'> Making check in po gmake[1]: Entering directory '<https://ci.centos.org/job/libosinfo-check/systems=libvirt-fedora-rawhide/ws…'> INTLTOOL_EXTRACT="/usr/bin/intltool-extract" XGETTEXT="/usr/bin/xgettext" srcdir=../../po /usr/bin/intltool-update --gettext-package libosinfo --pot rm -f missing notexist srcdir=../../po /usr/bin/intltool-update -m if [ -r missing -o -r notexist ]; then \ exit 1; \ fi gmake[1]: Leaving directory '<https://ci.centos.org/job/libosinfo-check/systems=libvirt-fedora-rawhide/ws…'> Making check in examples gmake[1]: Entering directory '<https://ci.centos.org/job/libosinfo-check/systems=libvirt-fedora-rawhide/ws…'> gmake[1]: Nothing to be done for 'check'. gmake[1]: Leaving directory '<https://ci.centos.org/job/libosinfo-check/systems=libvirt-fedora-rawhide/ws…'> Making check in tests gmake[1]: Entering directory '<https://ci.centos.org/job/libosinfo-check/systems=libvirt-fedora-rawhide/ws…'> /usr/bin/gmake test-entity test-device test-list test-devicelist test-filter test-product test-os test-oslist test-productfilter test-platform test-platformlist test-db test-loader test-isodetect test-install-script test-os-resources test-mediauris test-treeuris gmake[2]: Entering directory '<https://ci.centos.org/job/libosinfo-check/systems=libvirt-fedora-rawhide/ws…'> CC test_entity-test-entity.o CC test_device-test-device.o CC test_list-test-list.o CC test_devicelist-test-devicelist.o CC test_filter-test-filter.o CC test_product-test-product.o CC test_os-test-os.o CC test_oslist-test-oslist.o CC test_productfilter-test-productfilter.o CC test_platform-test-platform.o CC test_platformlist-test-platformlist.o CC test_db-test-db.o CC test_loader-test-loader.o CC test_isodetect-test-isodetect.o CC test_install_script-test-install-script.o CC test_os_resources-test-os-resources.o CC test_mediauris-test-mediauris.o CC test_treeuris-test-treeuris.o CCLD test-entity CCLD test-device CCLD test-list CCLD test-devicelist CCLD test-filter CCLD test-product CCLD test-os CCLD test-oslist CCLD test-productfilter CCLD test-platform CCLD test-platformlist CCLD test-db CCLD test-loader CCLD test-isodetect CCLD test-install-script CCLD test-os-resources CCLD test-mediauris CCLD test-treeuris gmake[2]: Leaving directory '<https://ci.centos.org/job/libosinfo-check/systems=libvirt-fedora-rawhide/ws…'> /usr/bin/gmake check-TESTS gmake[2]: Entering directory '<https://ci.centos.org/job/libosinfo-check/systems=libvirt-fedora-rawhide/ws…'> gmake[3]: Entering directory '<https://ci.centos.org/job/libosinfo-check/systems=libvirt-fedora-rawhide/ws…'> PASS: test-list PASS: test-device PASS: test-entity PASS: test-filter PASS: test-devicelist PASS: test-product PASS: test-os PASS: test-oslist PASS: test-productfilter PASS: test-platform PASS: test-platformlist PASS: test-db PASS: test-install-script PASS: test-loader PASS: test-os-resources PASS: test-treeuris PASS: test-isodetect ../../build-aux/test-driver: line 107: 30563 Aborted (core dumped) "$@" > $log_file 2>&1 FAIL: test-mediauris ============================================================================ Testsuite summary for libosinfo 1.3.0 ============================================================================ # TOTAL: 18 # PASS: 17 # SKIP: 0 # XFAIL: 0 # FAIL: 1 # XPASS: 0 # ERROR: 0 ============================================================================ See tests/test-suite.log Please report to libosinfo(a)redhat.com ============================================================================ gmake[3]: *** [Makefile:1313: test-suite.log] Error 1 gmake[3]: Leaving directory '<https://ci.centos.org/job/libosinfo-check/systems=libvirt-fedora-rawhide/ws…'> gmake[2]: *** [Makefile:1421: check-TESTS] Error 2 gmake[2]: Leaving directory '<https://ci.centos.org/job/libosinfo-check/systems=libvirt-fedora-rawhide/ws…'> gmake[1]: *** [Makefile:1614: check-am] Error 2 gmake[1]: Leaving directory '<https://ci.centos.org/job/libosinfo-check/systems=libvirt-fedora-rawhide/ws…'> gmake: *** [Makefile:594: check-recursive] Error 1 + cat tests/test-suite.log =========================================== libosinfo 1.3.0: tests/test-suite.log =========================================== # TOTAL: 18 # PASS: 17 # SKIP: 0 # XFAIL: 0 # FAIL: 1 # XPASS: 0 # ERROR: 0 .. contents:: :depth: 2 FAIL: test-mediauris ==================== /mediauris/uris: ** ERROR:../../tests/test-mediauris.c:50:test_media: assertion failed (res == CURLE_OK): (28 == 0) FAIL test-mediauris (exit status: 134) + exit 1 Build step 'Execute shell' marked build as failure
1 2
0 0
[Libvirt-ci] Build failed in Jenkins: libosinfo-check » libvirt-fedora-28 #24
by ci@centos.org 15 Oct '18

15 Oct '18
See <https://ci.centos.org/job/libosinfo-check/systems=libvirt-fedora-28/24/disp…> ------------------------------------------ Started by upstream project "libosinfo-check" build number 24 originally caused by: Started by upstream project "libosinfo-syntax-check" build number 24 originally caused by: Started by upstream project "libosinfo-build" build number 24 originally caused by: Started by upstream project "osinfo-db-build" build number 17 originally caused by: Started by an SCM change [EnvInject] - Loading node environment variables. Building remotely on libvirt-fedora-28 (libvirt) in workspace <https://ci.centos.org/job/libosinfo-check/systems=libvirt-fedora-28/ws/> [libosinfo] $ /bin/sh -xe /tmp/jenkins6650724397250479318.sh + export LIBOSINFO_NETWORK_TESTS=1 + LIBOSINFO_NETWORK_TESTS=1 + cd build + /usr/bin/gmake check GEN public-submodule-commit Making check in osinfo gmake[1]: Entering directory '<https://ci.centos.org/job/libosinfo-check/systems=libvirt-fedora-28/ws/buil…'> /usr/bin/gmake check-am gmake[2]: Entering directory '<https://ci.centos.org/job/libosinfo-check/systems=libvirt-fedora-28/ws/buil…'> /usr/bin/gmake check-local gmake[3]: Entering directory '<https://ci.centos.org/job/libosinfo-check/systems=libvirt-fedora-28/ws/buil…'> GEN check-symfile GEN check-symsorting gmake[3]: Leaving directory '<https://ci.centos.org/job/libosinfo-check/systems=libvirt-fedora-28/ws/buil…'> gmake[2]: Leaving directory '<https://ci.centos.org/job/libosinfo-check/systems=libvirt-fedora-28/ws/buil…'> gmake[1]: Leaving directory '<https://ci.centos.org/job/libosinfo-check/systems=libvirt-fedora-28/ws/buil…'> Making check in tools gmake[1]: Entering directory '<https://ci.centos.org/job/libosinfo-check/systems=libvirt-fedora-28/ws/buil…'> gmake[1]: Nothing to be done for 'check'. gmake[1]: Leaving directory '<https://ci.centos.org/job/libosinfo-check/systems=libvirt-fedora-28/ws/buil…'> Making check in docs gmake[1]: Entering directory '<https://ci.centos.org/job/libosinfo-check/systems=libvirt-fedora-28/ws/buil…'> Making check in reference gmake[2]: Entering directory '<https://ci.centos.org/job/libosinfo-check/systems=libvirt-fedora-28/ws/buil…'> gmake[2]: Nothing to be done for 'check'. gmake[2]: Leaving directory '<https://ci.centos.org/job/libosinfo-check/systems=libvirt-fedora-28/ws/buil…'> gmake[2]: Entering directory '<https://ci.centos.org/job/libosinfo-check/systems=libvirt-fedora-28/ws/buil…'> gmake[2]: Nothing to be done for 'check-am'. gmake[2]: Leaving directory '<https://ci.centos.org/job/libosinfo-check/systems=libvirt-fedora-28/ws/buil…'> gmake[1]: Leaving directory '<https://ci.centos.org/job/libosinfo-check/systems=libvirt-fedora-28/ws/buil…'> Making check in po gmake[1]: Entering directory '<https://ci.centos.org/job/libosinfo-check/systems=libvirt-fedora-28/ws/buil…'> INTLTOOL_EXTRACT="/usr/bin/intltool-extract" XGETTEXT="/usr/bin/xgettext" srcdir=../../po /usr/bin/intltool-update --gettext-package libosinfo --pot rm -f missing notexist srcdir=../../po /usr/bin/intltool-update -m if [ -r missing -o -r notexist ]; then \ exit 1; \ fi gmake[1]: Leaving directory '<https://ci.centos.org/job/libosinfo-check/systems=libvirt-fedora-28/ws/buil…'> Making check in examples gmake[1]: Entering directory '<https://ci.centos.org/job/libosinfo-check/systems=libvirt-fedora-28/ws/buil…'> gmake[1]: Nothing to be done for 'check'. gmake[1]: Leaving directory '<https://ci.centos.org/job/libosinfo-check/systems=libvirt-fedora-28/ws/buil…'> Making check in tests gmake[1]: Entering directory '<https://ci.centos.org/job/libosinfo-check/systems=libvirt-fedora-28/ws/buil…'> /usr/bin/gmake test-entity test-device test-list test-devicelist test-filter test-product test-os test-oslist test-productfilter test-platform test-platformlist test-db test-loader test-isodetect test-install-script test-os-resources test-mediauris test-treeuris gmake[2]: Entering directory '<https://ci.centos.org/job/libosinfo-check/systems=libvirt-fedora-28/ws/buil…'> CC test_entity-test-entity.o CC test_device-test-device.o CC test_list-test-list.o CC test_devicelist-test-devicelist.o CC test_filter-test-filter.o CC test_product-test-product.o CC test_os-test-os.o CC test_oslist-test-oslist.o CC test_productfilter-test-productfilter.o CC test_platform-test-platform.o CC test_platformlist-test-platformlist.o CC test_db-test-db.o CC test_loader-test-loader.o CC test_isodetect-test-isodetect.o CC test_install_script-test-install-script.o CC test_os_resources-test-os-resources.o CC test_mediauris-test-mediauris.o CC test_treeuris-test-treeuris.o CCLD test-entity CCLD test-device CCLD test-list CCLD test-devicelist CCLD test-filter CCLD test-product CCLD test-os CCLD test-oslist CCLD test-productfilter CCLD test-platform CCLD test-platformlist CCLD test-db CCLD test-loader CCLD test-isodetect CCLD test-install-script CCLD test-os-resources CCLD test-mediauris CCLD test-treeuris gmake[2]: Leaving directory '<https://ci.centos.org/job/libosinfo-check/systems=libvirt-fedora-28/ws/buil…'> /usr/bin/gmake check-TESTS gmake[2]: Entering directory '<https://ci.centos.org/job/libosinfo-check/systems=libvirt-fedora-28/ws/buil…'> gmake[3]: Entering directory '<https://ci.centos.org/job/libosinfo-check/systems=libvirt-fedora-28/ws/buil…'> PASS: test-list PASS: test-entity PASS: test-device PASS: test-filter PASS: test-product PASS: test-devicelist PASS: test-os PASS: test-productfilter PASS: test-oslist PASS: test-platform PASS: test-db PASS: test-platformlist PASS: test-install-script PASS: test-loader PASS: test-os-resources PASS: test-treeuris PASS: test-isodetect ../../build-aux/test-driver: line 107: 13740 Aborted (core dumped) "$@" > $log_file 2>&1 FAIL: test-mediauris ============================================================================ Testsuite summary for libosinfo 1.3.0 ============================================================================ # TOTAL: 18 # PASS: 17 # SKIP: 0 # XFAIL: 0 # FAIL: 1 # XPASS: 0 # ERROR: 0 ============================================================================ See tests/test-suite.log Please report to libosinfo(a)redhat.com ============================================================================ gmake[3]: *** [Makefile:1289: test-suite.log] Error 1 gmake[3]: Leaving directory '<https://ci.centos.org/job/libosinfo-check/systems=libvirt-fedora-28/ws/buil…'> gmake[2]: *** [Makefile:1397: check-TESTS] Error 2 gmake[2]: Leaving directory '<https://ci.centos.org/job/libosinfo-check/systems=libvirt-fedora-28/ws/buil…'> gmake[1]: *** [Makefile:1587: check-am] Error 2 gmake[1]: Leaving directory '<https://ci.centos.org/job/libosinfo-check/systems=libvirt-fedora-28/ws/buil…'> gmake: *** [Makefile:594: check-recursive] Error 1 + cat tests/test-suite.log =========================================== libosinfo 1.3.0: tests/test-suite.log =========================================== # TOTAL: 18 # PASS: 17 # SKIP: 0 # XFAIL: 0 # FAIL: 1 # XPASS: 0 # ERROR: 0 .. contents:: :depth: 2 FAIL: test-mediauris ==================== /mediauris/uris: ** ERROR:../../tests/test-mediauris.c:50:test_media: assertion failed (res == CURLE_OK): (28 == 0) FAIL test-mediauris (exit status: 134) + exit 1 Build step 'Execute shell' marked build as failure
1 1
0 0
[Libvirt-ci] Build failed in Jenkins: libosinfo-check » libvirt-debian-9 #23
by ci@centos.org 15 Oct '18

15 Oct '18
See <https://ci.centos.org/job/libosinfo-check/systems=libvirt-debian-9/23/displ…> ------------------------------------------ Started by upstream project "libosinfo-check" build number 23 originally caused by: Started by upstream project "libosinfo-syntax-check" build number 23 originally caused by: Started by upstream project "libosinfo-build" build number 23 originally caused by: Started by upstream project "osinfo-db-build" build number 16 originally caused by: Started by an SCM change [EnvInject] - Loading node environment variables. Building remotely on libvirt-debian-9 (libvirt) in workspace <https://ci.centos.org/job/libosinfo-check/systems=libvirt-debian-9/ws/> [libosinfo] $ /bin/sh -xe /tmp/jenkins2979740855077781835.sh + export LIBOSINFO_NETWORK_TESTS=1 + cd build + /usr/bin/make check GEN public-submodule-commit Making check in osinfo make[1]: Entering directory '<https://ci.centos.org/job/libosinfo-check/systems=libvirt-debian-9/ws/build…'> /usr/bin/make check-am make[2]: Entering directory '<https://ci.centos.org/job/libosinfo-check/systems=libvirt-debian-9/ws/build…'> /usr/bin/make check-local make[3]: Entering directory '<https://ci.centos.org/job/libosinfo-check/systems=libvirt-debian-9/ws/build…'> GEN check-symfile GEN check-symsorting make[3]: Leaving directory '<https://ci.centos.org/job/libosinfo-check/systems=libvirt-debian-9/ws/build…'> make[2]: Leaving directory '<https://ci.centos.org/job/libosinfo-check/systems=libvirt-debian-9/ws/build…'> make[1]: Leaving directory '<https://ci.centos.org/job/libosinfo-check/systems=libvirt-debian-9/ws/build…'> Making check in tools make[1]: Entering directory '<https://ci.centos.org/job/libosinfo-check/systems=libvirt-debian-9/ws/build…'> make[1]: Nothing to be done for 'check'. make[1]: Leaving directory '<https://ci.centos.org/job/libosinfo-check/systems=libvirt-debian-9/ws/build…'> Making check in docs make[1]: Entering directory '<https://ci.centos.org/job/libosinfo-check/systems=libvirt-debian-9/ws/build…'> Making check in reference make[2]: Entering directory '<https://ci.centos.org/job/libosinfo-check/systems=libvirt-debian-9/ws/build…'> make[2]: Nothing to be done for 'check'. make[2]: Leaving directory '<https://ci.centos.org/job/libosinfo-check/systems=libvirt-debian-9/ws/build…'> make[2]: Entering directory '<https://ci.centos.org/job/libosinfo-check/systems=libvirt-debian-9/ws/build…'> make[2]: Nothing to be done for 'check-am'. make[2]: Leaving directory '<https://ci.centos.org/job/libosinfo-check/systems=libvirt-debian-9/ws/build…'> make[1]: Leaving directory '<https://ci.centos.org/job/libosinfo-check/systems=libvirt-debian-9/ws/build…'> Making check in po make[1]: Entering directory '<https://ci.centos.org/job/libosinfo-check/systems=libvirt-debian-9/ws/build…'> INTLTOOL_EXTRACT="/usr/bin/intltool-extract" XGETTEXT="/usr/bin/xgettext" srcdir=../../po /usr/bin/intltool-update --gettext-package libosinfo --pot rm -f missing notexist srcdir=../../po /usr/bin/intltool-update -m Unescaped left brace in regex is deprecated, passed through in regex; marked by <-- HERE in m/\${ <-- HERE ?PACKAGE_NAME}?/ at /usr/bin/intltool-update line 1071, <CONF> line 295. if [ -r missing -o -r notexist ]; then \ exit 1; \ fi make[1]: Leaving directory '<https://ci.centos.org/job/libosinfo-check/systems=libvirt-debian-9/ws/build…'> Making check in examples make[1]: Entering directory '<https://ci.centos.org/job/libosinfo-check/systems=libvirt-debian-9/ws/build…'> make[1]: Nothing to be done for 'check'. make[1]: Leaving directory '<https://ci.centos.org/job/libosinfo-check/systems=libvirt-debian-9/ws/build…'> Making check in tests make[1]: Entering directory '<https://ci.centos.org/job/libosinfo-check/systems=libvirt-debian-9/ws/build…'> /usr/bin/make test-entity test-device test-list test-devicelist test-filter test-product test-os test-oslist test-productfilter test-platform test-platformlist test-db test-loader test-isodetect test-install-script test-os-resources test-mediauris test-treeuris make[2]: Entering directory '<https://ci.centos.org/job/libosinfo-check/systems=libvirt-debian-9/ws/build…'> CC test_list-test-list.o CC test_device-test-device.o CC test_entity-test-entity.o CC test_devicelist-test-devicelist.o CC test_filter-test-filter.o CC test_product-test-product.o CC test_os-test-os.o CC test_oslist-test-oslist.o CC test_productfilter-test-productfilter.o CC test_platform-test-platform.o CC test_platformlist-test-platformlist.o CC test_db-test-db.o CC test_loader-test-loader.o CC test_isodetect-test-isodetect.o CC test_install_script-test-install-script.o CC test_os_resources-test-os-resources.o CC test_mediauris-test-mediauris.o CC test_treeuris-test-treeuris.o CCLD test-entity CCLD test-device CCLD test-list CCLD test-devicelist CCLD test-filter CCLD test-product CCLD test-os CCLD test-oslist CCLD test-productfilter CCLD test-platform CCLD test-platformlist CCLD test-db CCLD test-loader CCLD test-isodetect CCLD test-install-script CCLD test-os-resources CCLD test-mediauris CCLD test-treeuris make[2]: Leaving directory '<https://ci.centos.org/job/libosinfo-check/systems=libvirt-debian-9/ws/build…'> /usr/bin/make check-TESTS make[2]: Entering directory '<https://ci.centos.org/job/libosinfo-check/systems=libvirt-debian-9/ws/build…'> make[3]: Entering directory '<https://ci.centos.org/job/libosinfo-check/systems=libvirt-debian-9/ws/build…'> PASS: test-entity PASS: test-device PASS: test-list PASS: test-devicelist PASS: test-filter PASS: test-product PASS: test-os PASS: test-productfilter PASS: test-oslist PASS: test-platform PASS: test-platformlist PASS: test-db PASS: test-install-script PASS: test-loader PASS: test-os-resources PASS: test-treeuris PASS: test-isodetect ../../build-aux/test-driver: line 107: 29072 Aborted "$@" > $log_file 2>&1 FAIL: test-mediauris ============================================================================ Testsuite summary for libosinfo 1.3.0 ============================================================================ # TOTAL: 18 # PASS: 17 # SKIP: 0 # XFAIL: 0 # FAIL: 1 # XPASS: 0 # ERROR: 0 ============================================================================ See tests/test-suite.log Please report to libosinfo(a)redhat.com ============================================================================ Makefile:1289: recipe for target 'test-suite.log' failed make[3]: *** [test-suite.log] Error 1 make[3]: Leaving directory '<https://ci.centos.org/job/libosinfo-check/systems=libvirt-debian-9/ws/build…'> Makefile:1395: recipe for target 'check-TESTS' failed make[2]: *** [check-TESTS] Error 2 make[2]: Leaving directory '<https://ci.centos.org/job/libosinfo-check/systems=libvirt-debian-9/ws/build…'> Makefile:1587: recipe for target 'check-am' failed make[1]: *** [check-am] Error 2 make[1]: Leaving directory '<https://ci.centos.org/job/libosinfo-check/systems=libvirt-debian-9/ws/build…'> Makefile:595: recipe for target 'check-recursive' failed make: *** [check-recursive] Error 1 + cat tests/test-suite.log =========================================== libosinfo 1.3.0: tests/test-suite.log =========================================== # TOTAL: 18 # PASS: 17 # SKIP: 0 # XFAIL: 0 # FAIL: 1 # XPASS: 0 # ERROR: 0 .. contents:: :depth: 2 FAIL: test-mediauris ==================== /mediauris/uris: ** ERROR:../../tests/test-mediauris.c:50:test_media: assertion failed (res == CURLE_OK): (28 == 0) FAIL test-mediauris (exit status: 134) + exit 1 Build step 'Execute shell' marked build as failure
1 2
0 0
[Libvirt-ci] Build failed in Jenkins: libosinfo-check » libvirt-freebsd-11 #24
by ci@centos.org 15 Oct '18

15 Oct '18
See <https://ci.centos.org/job/libosinfo-check/systems=libvirt-freebsd-11/24/dis…> ------------------------------------------ Started by upstream project "libosinfo-check" build number 24 originally caused by: Started by upstream project "libosinfo-syntax-check" build number 24 originally caused by: Started by upstream project "libosinfo-build" build number 24 originally caused by: Started by upstream project "osinfo-db-build" build number 17 originally caused by: Started by an SCM change [EnvInject] - Loading node environment variables. Building remotely on libvirt-freebsd-11 (libvirt) in workspace <https://ci.centos.org/job/libosinfo-check/systems=libvirt-freebsd-11/ws/> [libosinfo] $ /bin/sh -xe /tmp/jenkins5987410227891403679.sh + export 'LIBOSINFO_NETWORK_TESTS=1' + cd build + /usr/local/bin/gmake check GEN public-submodule-commit Making check in osinfo gmake[1]: Entering directory '/usr<https://ci.centos.org/job/libosinfo-check/systems=libvirt-freebsd-11/ws/bui…'> /usr/local/bin/gmake check-am gmake[2]: Entering directory '/usr<https://ci.centos.org/job/libosinfo-check/systems=libvirt-freebsd-11/ws/bui…'> /usr/local/bin/gmake check-local gmake[3]: Entering directory '/usr<https://ci.centos.org/job/libosinfo-check/systems=libvirt-freebsd-11/ws/bui…'> GEN check-symsorting gmake[3]: Leaving directory '/usr<https://ci.centos.org/job/libosinfo-check/systems=libvirt-freebsd-11/ws/bui…'> gmake[2]: Leaving directory '/usr<https://ci.centos.org/job/libosinfo-check/systems=libvirt-freebsd-11/ws/bui…'> gmake[1]: Leaving directory '/usr<https://ci.centos.org/job/libosinfo-check/systems=libvirt-freebsd-11/ws/bui…'> Making check in tools gmake[1]: Entering directory '/usr<https://ci.centos.org/job/libosinfo-check/systems=libvirt-freebsd-11/ws/bui…'> gmake[1]: Nothing to be done for 'check'. gmake[1]: Leaving directory '/usr<https://ci.centos.org/job/libosinfo-check/systems=libvirt-freebsd-11/ws/bui…'> Making check in docs gmake[1]: Entering directory '/usr<https://ci.centos.org/job/libosinfo-check/systems=libvirt-freebsd-11/ws/bui…'> Making check in reference gmake[2]: Entering directory '/usr<https://ci.centos.org/job/libosinfo-check/systems=libvirt-freebsd-11/ws/bui…'> gmake[2]: Nothing to be done for 'check'. gmake[2]: Leaving directory '/usr<https://ci.centos.org/job/libosinfo-check/systems=libvirt-freebsd-11/ws/bui…'> gmake[2]: Entering directory '/usr<https://ci.centos.org/job/libosinfo-check/systems=libvirt-freebsd-11/ws/bui…'> gmake[2]: Nothing to be done for 'check-am'. gmake[2]: Leaving directory '/usr<https://ci.centos.org/job/libosinfo-check/systems=libvirt-freebsd-11/ws/bui…'> gmake[1]: Leaving directory '/usr<https://ci.centos.org/job/libosinfo-check/systems=libvirt-freebsd-11/ws/bui…'> Making check in po gmake[1]: Entering directory '/usr<https://ci.centos.org/job/libosinfo-check/systems=libvirt-freebsd-11/ws/bui…'> INTLTOOL_EXTRACT="/usr/local/bin/intltool-extract" XGETTEXT="/usr/local/bin/xgettext" srcdir=../../po /usr/local/bin/intltool-update --gettext-package libosinfo --pot rm -f missing notexist srcdir=../../po /usr/local/bin/intltool-update -m if [ -r missing -o -r notexist ]; then \ exit 1; \ fi gmake[1]: Leaving directory '/usr<https://ci.centos.org/job/libosinfo-check/systems=libvirt-freebsd-11/ws/bui…'> Making check in examples gmake[1]: Entering directory '/usr<https://ci.centos.org/job/libosinfo-check/systems=libvirt-freebsd-11/ws/bui…'> gmake[1]: Nothing to be done for 'check'. gmake[1]: Leaving directory '/usr<https://ci.centos.org/job/libosinfo-check/systems=libvirt-freebsd-11/ws/bui…'> Making check in tests gmake[1]: Entering directory '/usr<https://ci.centos.org/job/libosinfo-check/systems=libvirt-freebsd-11/ws/bui…'> /usr/local/bin/gmake test-entity test-device test-list test-devicelist test-filter test-product test-os test-oslist test-productfilter test-platform test-platformlist test-db test-loader test-isodetect test-install-script test-os-resources test-mediauris test-treeuris gmake[2]: Entering directory '/usr<https://ci.centos.org/job/libosinfo-check/systems=libvirt-freebsd-11/ws/bui…'> CC test_entity-test-entity.o CC test_device-test-device.o CC test_list-test-list.o CC test_devicelist-test-devicelist.o CC test_filter-test-filter.o CC test_product-test-product.o CC test_os-test-os.o CC test_oslist-test-oslist.o CC test_productfilter-test-productfilter.o CC test_platform-test-platform.o CC test_platformlist-test-platformlist.o CC test_db-test-db.o CC test_loader-test-loader.o CC test_isodetect-test-isodetect.o CC test_install_script-test-install-script.o CC test_os_resources-test-os-resources.o CC test_mediauris-test-mediauris.o CC test_treeuris-test-treeuris.o CCLD test-entity CCLD test-device CCLD test-list CCLD test-devicelist CCLD test-filter CCLD test-product CCLD test-os CCLD test-oslist CCLD test-productfilter CCLD test-platform CCLD test-platformlist CCLD test-db CCLD test-loader CCLD test-isodetect CCLD test-install-script CCLD test-os-resources CCLD test-mediauris CCLD test-treeuris gmake[2]: Leaving directory '/usr<https://ci.centos.org/job/libosinfo-check/systems=libvirt-freebsd-11/ws/bui…'> /usr/local/bin/gmake check-TESTS gmake[2]: Entering directory '/usr<https://ci.centos.org/job/libosinfo-check/systems=libvirt-freebsd-11/ws/bui…'> gmake[3]: Entering directory '/usr<https://ci.centos.org/job/libosinfo-check/systems=libvirt-freebsd-11/ws/bui…'> PASS: test-device PASS: test-entity PASS: test-list PASS: test-filter PASS: test-devicelist PASS: test-product PASS: test-productfilter PASS: test-oslist PASS: test-platform PASS: test-os PASS: test-db PASS: test-platformlist PASS: test-install-script PASS: test-loader PASS: test-os-resources PASS: test-treeuris PASS: test-isodetect Abort trap (core dumped) FAIL: test-mediauris ============================================================================ Testsuite summary for libosinfo 1.3.0 ============================================================================ # TOTAL: 18 # PASS: 17 # SKIP: 0 # XFAIL: 0 # FAIL: 1 # XPASS: 0 # ERROR: 0 ============================================================================ See tests/test-suite.log Please report to libosinfo(a)redhat.com ============================================================================ gmake[3]: *** [Makefile:1313: test-suite.log] Error 1 gmake[3]: Leaving directory '/usr<https://ci.centos.org/job/libosinfo-check/systems=libvirt-freebsd-11/ws/bui…'> gmake[2]: *** [Makefile:1421: check-TESTS] Error 2 gmake[2]: Leaving directory '/usr<https://ci.centos.org/job/libosinfo-check/systems=libvirt-freebsd-11/ws/bui…'> gmake[1]: *** [Makefile:1614: check-am] Error 2 gmake[1]: Leaving directory '/usr<https://ci.centos.org/job/libosinfo-check/systems=libvirt-freebsd-11/ws/bui…'> gmake: *** [Makefile:594: check-recursive] Error 1 + cat tests/test-suite.log =========================================== libosinfo 1.3.0: tests/test-suite.log =========================================== # TOTAL: 18 # PASS: 17 # SKIP: 0 # XFAIL: 0 # FAIL: 1 # XPASS: 0 # ERROR: 0 .. contents:: :depth: 2 FAIL: test-mediauris ==================== /mediauris/uris: ** ERROR:../../tests/test-mediauris.c:50:test_media: assertion failed (res == CURLE_OK): (28 == 0) FAIL test-mediauris (exit status: 134) + exit 1 Build step 'Execute shell' marked build as failure
1 1
0 0
[Libvirt-ci] Build failed in Jenkins: virt-manager-check » libvirt-fedora-27 #131
by ci@centos.org 13 Oct '18

13 Oct '18
See <https://ci.centos.org/job/virt-manager-check/systems=libvirt-fedora-27/131/…> ------------------------------------------ Started by upstream project "virt-manager-check" build number 131 originally caused by: Started by upstream project "virt-manager-build" build number 132 originally caused by: Started by an SCM change [EnvInject] - Loading node environment variables. Building remotely on libvirt-fedora-27 (libvirt) in workspace <https://ci.centos.org/job/virt-manager-check/systems=libvirt-fedora-27/ws/> [virt-manager] $ /bin/sh -xe /tmp/jenkins1026206685701677496.sh + /usr/bin/python3 ./setup.py test running test .....................................................................................................................................................................................................................................................s.....F.........................................................................................................................................................................................s ====================================================================== FAIL: testCLI0129virt_install_kvm_centos7 (tests.clitest.CLITests) ---------------------------------------------------------------------- Traceback (most recent call last): File "<https://ci.centos.org/job/virt-manager-check/systems=libvirt-fedora-27/ws/t…",> line 1074, in <lambda> return lambda s: cmdtemplate(s, cmd) File "<https://ci.centos.org/job/virt-manager-check/systems=libvirt-fedora-27/ws/t…",> line 1073, in cmdtemplate _cmdobj.run(self) File "<https://ci.centos.org/job/virt-manager-check/systems=libvirt-fedora-27/ws/t…",> line 237, in run tests.fail(err) AssertionError: ./virt-install --name foobar --ram 64 --print-step all --connect __virtinst_test__test://<https://ci.centos.org/job/virt-manager-check/systems=libvirt-fedora-27/ws/t…> --noautoconsole --disk /dev/default-pool/testvol1.img --pxe --os-variant centos7.0 Conversion outputs did not match. --- tests/cli-test-xml/compare/virt-install-kvm-centos7.xml +++ Generated Output @@ -10,7 +10,7 @@ <currentMemory>65536</currentMemory> <vcpu>1</vcpu> <os> - <type arch="x86_64" machine="pc">hvm</type> + <type arch="x86_64" machine="q35">hvm</type> <boot dev="network"/> <boot dev="hd"/> </os> @@ -55,7 +55,7 @@ <graphics type="spice" port="-1" tlsPort="-1" autoport="yes"> <image compression="off"/> </graphics> - <sound model="ich6"/> + <sound model="ich9"/> <video> <model type="qxl"/> </video> @@ -78,7 +78,7 @@ <currentMemory>65536</currentMemory> <vcpu>1</vcpu> <os> - <type arch="x86_64" machine="pc">hvm</type> + <type arch="x86_64" machine="q35">hvm</type> <boot dev="hd"/> </os> <features> @@ -121,7 +121,7 @@ <graphics type="spice" port="-1" tlsPort="-1" autoport="yes"> <image compression="off"/> </graphics> - <sound model="ich6"/> + <sound model="ich9"/> <video> <model type="qxl"/> </video> ---------------------------------------------------------------------- Ran 438 tests in 36.043s FAILED (failures=1, skipped=2) Build step 'Execute shell' marked build as failure
1 1
0 0
[Libvirt-ci] Build failed in Jenkins: virt-manager-check » libvirt-fedora-28 #131
by ci@centos.org 13 Oct '18

13 Oct '18
See <https://ci.centos.org/job/virt-manager-check/systems=libvirt-fedora-28/131/…> ------------------------------------------ Started by upstream project "virt-manager-check" build number 131 originally caused by: Started by upstream project "virt-manager-build" build number 132 originally caused by: Started by an SCM change [EnvInject] - Loading node environment variables. Building remotely on libvirt-fedora-28 (libvirt) in workspace <https://ci.centos.org/job/virt-manager-check/systems=libvirt-fedora-28/ws/> [virt-manager] $ /bin/sh -xe /tmp/jenkins757023215447964825.sh + /usr/bin/python3 ./setup.py test running test .....................................................................................................................................................................................................................................................s.....F.........................................................................................................................................................................................s ====================================================================== FAIL: testCLI0129virt_install_kvm_centos7 (tests.clitest.CLITests) ---------------------------------------------------------------------- Traceback (most recent call last): File "<https://ci.centos.org/job/virt-manager-check/systems=libvirt-fedora-28/ws/t…",> line 1074, in <lambda> return lambda s: cmdtemplate(s, cmd) File "<https://ci.centos.org/job/virt-manager-check/systems=libvirt-fedora-28/ws/t…",> line 1073, in cmdtemplate _cmdobj.run(self) File "<https://ci.centos.org/job/virt-manager-check/systems=libvirt-fedora-28/ws/t…",> line 237, in run tests.fail(err) AssertionError: ./virt-install --name foobar --ram 64 --print-step all --connect __virtinst_test__test://<https://ci.centos.org/job/virt-manager-check/systems=libvirt-fedora-28/ws/t…> --noautoconsole --disk /dev/default-pool/testvol1.img --pxe --os-variant centos7.0 Conversion outputs did not match. --- tests/cli-test-xml/compare/virt-install-kvm-centos7.xml +++ Generated Output @@ -10,7 +10,7 @@ <currentMemory>65536</currentMemory> <vcpu>1</vcpu> <os> - <type arch="x86_64" machine="pc">hvm</type> + <type arch="x86_64" machine="q35">hvm</type> <boot dev="network"/> <boot dev="hd"/> </os> @@ -55,7 +55,7 @@ <graphics type="spice" port="-1" tlsPort="-1" autoport="yes"> <image compression="off"/> </graphics> - <sound model="ich6"/> + <sound model="ich9"/> <video> <model type="qxl"/> </video> @@ -78,7 +78,7 @@ <currentMemory>65536</currentMemory> <vcpu>1</vcpu> <os> - <type arch="x86_64" machine="pc">hvm</type> + <type arch="x86_64" machine="q35">hvm</type> <boot dev="hd"/> </os> <features> @@ -121,7 +121,7 @@ <graphics type="spice" port="-1" tlsPort="-1" autoport="yes"> <image compression="off"/> </graphics> - <sound model="ich6"/> + <sound model="ich9"/> <video> <model type="qxl"/> </video> ---------------------------------------------------------------------- Ran 438 tests in 34.561s FAILED (failures=1, skipped=2) Build step 'Execute shell' marked build as failure
1 1
0 0
[Libvirt-ci] Build failed in Jenkins: virt-manager-check » libvirt-debian-9 #131
by ci@centos.org 13 Oct '18

13 Oct '18
See <https://ci.centos.org/job/virt-manager-check/systems=libvirt-debian-9/131/d…> ------------------------------------------ Started by upstream project "virt-manager-check" build number 131 originally caused by: Started by upstream project "virt-manager-build" build number 132 originally caused by: Started by an SCM change [EnvInject] - Loading node environment variables. Building remotely on libvirt-debian-9 (libvirt) in workspace <https://ci.centos.org/job/virt-manager-check/systems=libvirt-debian-9/ws/> [virt-manager] $ /bin/sh -xe /tmp/jenkins1523132351597785264.sh + /usr/bin/python3 ./setup.py test running test .....................................................................................................................................................................................................................................................s.....F.........................................................................................................................................................................................s ====================================================================== FAIL: testCLI0129virt_install_kvm_centos7 (tests.clitest.CLITests) ---------------------------------------------------------------------- Traceback (most recent call last): File "<https://ci.centos.org/job/virt-manager-check/systems=libvirt-debian-9/ws/te…",> line 1074, in <lambda> return lambda s: cmdtemplate(s, cmd) File "<https://ci.centos.org/job/virt-manager-check/systems=libvirt-debian-9/ws/te…",> line 1073, in cmdtemplate _cmdobj.run(self) File "<https://ci.centos.org/job/virt-manager-check/systems=libvirt-debian-9/ws/te…",> line 237, in run tests.fail(err) AssertionError: ./virt-install --name foobar --ram 64 --print-step all --connect __virtinst_test__test://<https://ci.centos.org/job/virt-manager-check/systems=libvirt-debian-9/ws/te…> --noautoconsole --disk /dev/default-pool/testvol1.img --pxe --os-variant centos7.0 Conversion outputs did not match. --- tests/cli-test-xml/compare/virt-install-kvm-centos7.xml +++ Generated Output @@ -10,7 +10,7 @@ <currentMemory>65536</currentMemory> <vcpu>1</vcpu> <os> - <type arch="x86_64" machine="pc">hvm</type> + <type arch="x86_64" machine="q35">hvm</type> <boot dev="network"/> <boot dev="hd"/> </os> @@ -55,7 +55,7 @@ <graphics type="spice" port="-1" tlsPort="-1" autoport="yes"> <image compression="off"/> </graphics> - <sound model="ich6"/> + <sound model="ich9"/> <video> <model type="qxl"/> </video> @@ -78,7 +78,7 @@ <currentMemory>65536</currentMemory> <vcpu>1</vcpu> <os> - <type arch="x86_64" machine="pc">hvm</type> + <type arch="x86_64" machine="q35">hvm</type> <boot dev="hd"/> </os> <features> @@ -121,7 +121,7 @@ <graphics type="spice" port="-1" tlsPort="-1" autoport="yes"> <image compression="off"/> </graphics> - <sound model="ich6"/> + <sound model="ich9"/> <video> <model type="qxl"/> </video> ---------------------------------------------------------------------- Ran 438 tests in 34.041s FAILED (failures=1, skipped=2) Build step 'Execute shell' marked build as failure
1 1
0 0
[Libvirt-ci] Build failed in Jenkins: virt-manager-check » libvirt-fedora-rawhide #131
by ci@centos.org 13 Oct '18

13 Oct '18
See <https://ci.centos.org/job/virt-manager-check/systems=libvirt-fedora-rawhide…> ------------------------------------------ Started by upstream project "virt-manager-check" build number 131 originally caused by: Started by upstream project "virt-manager-build" build number 132 originally caused by: Started by an SCM change [EnvInject] - Loading node environment variables. Building remotely on libvirt-fedora-rawhide (libvirt) in workspace <https://ci.centos.org/job/virt-manager-check/systems=libvirt-fedora-rawhide…> [virt-manager] $ /bin/sh -xe /tmp/jenkins4343655653852541334.sh + /usr/bin/python3 ./setup.py test running test .....................................................................................................................................................................................................................................................s.....F.........................................................................................................................................................................................s ====================================================================== FAIL: testCLI0129virt_install_kvm_centos7 (tests.clitest.CLITests) ---------------------------------------------------------------------- Traceback (most recent call last): File "<https://ci.centos.org/job/virt-manager-check/systems=libvirt-fedora-rawhide…",> line 1074, in <lambda> return lambda s: cmdtemplate(s, cmd) File "<https://ci.centos.org/job/virt-manager-check/systems=libvirt-fedora-rawhide…",> line 1073, in cmdtemplate _cmdobj.run(self) File "<https://ci.centos.org/job/virt-manager-check/systems=libvirt-fedora-rawhide…",> line 237, in run tests.fail(err) AssertionError: ./virt-install --name foobar --ram 64 --print-step all --connect __virtinst_test__test://<https://ci.centos.org/job/virt-manager-check/systems=libvirt-fedora-rawhide…> --noautoconsole --disk /dev/default-pool/testvol1.img --pxe --os-variant centos7.0 Conversion outputs did not match. --- tests/cli-test-xml/compare/virt-install-kvm-centos7.xml +++ Generated Output @@ -10,7 +10,7 @@ <currentMemory>65536</currentMemory> <vcpu>1</vcpu> <os> - <type arch="x86_64" machine="pc">hvm</type> + <type arch="x86_64" machine="q35">hvm</type> <boot dev="network"/> <boot dev="hd"/> </os> @@ -55,7 +55,7 @@ <graphics type="spice" port="-1" tlsPort="-1" autoport="yes"> <image compression="off"/> </graphics> - <sound model="ich6"/> + <sound model="ich9"/> <video> <model type="qxl"/> </video> @@ -78,7 +78,7 @@ <currentMemory>65536</currentMemory> <vcpu>1</vcpu> <os> - <type arch="x86_64" machine="pc">hvm</type> + <type arch="x86_64" machine="q35">hvm</type> <boot dev="hd"/> </os> <features> @@ -121,7 +121,7 @@ <graphics type="spice" port="-1" tlsPort="-1" autoport="yes"> <image compression="off"/> </graphics> - <sound model="ich6"/> + <sound model="ich9"/> <video> <model type="qxl"/> </video> ---------------------------------------------------------------------- Ran 438 tests in 32.823s FAILED (failures=1, skipped=2) Build step 'Execute shell' marked build as failure
1 1
0 0
  • ← Newer
  • 1
  • ...
  • 822
  • 823
  • 824
  • 825
  • 826
  • 827
  • 828
  • ...
  • 1022
  • Older →

HyperKitty Powered by HyperKitty version 1.3.12.