libvirt List Archives
Sign In Sign Up
Manage this list Sign In Sign Up

Keyboard Shortcuts

Thread View

  • j: Next unread message
  • k: Previous unread message
  • j a: Jump to all threads
  • j l: Jump to MailingList overview

CI

Thread Start a new thread
Download
Threads by month
  • ----- 2026 -----
  • September
  • August
  • July
  • June
  • May
  • April
  • March
  • February
  • January
  • ----- 2025 -----
  • December
  • November
  • October
  • September
  • August
  • July
  • June
  • May
  • April
  • March
  • February
  • January
  • ----- 2024 -----
  • December
  • November
  • October
  • September
  • August
  • July
  • June
  • May
  • April
  • March
  • February
  • January
  • ----- 2023 -----
  • December
  • November
  • October
  • September
  • August
  • July
  • June
  • May
  • April
  • March
  • February
  • January
  • ----- 2022 -----
  • December
  • November
  • October
  • September
  • August
  • July
  • June
  • May
  • April
  • March
  • February
  • January
  • ----- 2021 -----
  • December
  • November
  • October
  • September
  • August
  • July
  • June
  • May
  • April
  • March
  • February
  • January
  • ----- 2020 -----
  • December
  • November
  • October
  • September
  • August
  • July
  • June
  • May
  • April
  • March
  • February
  • January
  • ----- 2019 -----
  • December
  • November
  • October
  • September
  • August
  • July
  • June
  • May
  • April
  • March
  • February
  • January
  • ----- 2018 -----
  • December
  • November
  • October
  • September
  • August
  • July
  • June
  • May
  • April
  • March
  • February
  • January
  • ----- 2017 -----
  • December
  • November
  • October
  • September
  • August
  • July
  • June
  • May
  • April
  • March
  • February
  • January
  • ----- 2016 -----
  • December
  • November
  • October
  • September
  • August
  • July
ci@lists.libvirt.org

  • 2 participants
  • 10211 discussions
[Libvirt-ci] Build failed in Jenkins: libvirt-ocaml-build » libvirt-freebsd-10 #1
by ci@centos.org 05 Nov '18

05 Nov '18
See <https://ci.centos.org/job/libvirt-ocaml-build/systems=libvirt-freebsd-10/1/…> ------------------------------------------ Started by upstream project "libvirt-ocaml-build" build number 1 originally caused by: Started by user Libvirt [EnvInject] - Loading node environment variables. Building remotely on libvirt-freebsd-10 (libvirt) in workspace <https://ci.centos.org/job/libvirt-ocaml-build/systems=libvirt-freebsd-10/ws/> > git rev-parse --is-inside-work-tree # timeout=10 Fetching changes from the remote Git repository > git config remote.origin.url https://github.com/libvirt/libvirt-ocaml.git # timeout=10 Fetching upstream changes from https://github.com/libvirt/libvirt-ocaml.git > git --version # timeout=10 > git fetch --tags --progress https://github.com/libvirt/libvirt-ocaml.git +refs/heads/*:refs/remotes/origin/* Checking out Revision 4f58df00fe6f19d3935aacb2c0c8c39de1f2c385 (refs/remotes/origin/master) > git config core.sparsecheckout # timeout=10 > git checkout -f 4f58df00fe6f19d3935aacb2c0c8c39de1f2c385 Commit message: "doc: invoke ocamldoc with -colorize-code" First time build. Skipping changelog. Cleaning workspace > git rev-parse --verify HEAD # timeout=10 Resetting working tree > git reset --hard # timeout=10 > git clean -fdx # timeout=10 [libvirt-ocaml] $ /bin/sh -xe /tmp/jenkins2303206506507097086.sh + autoreconf -vfi autoreconf-2.69: Entering directory `.' autoreconf-2.69: configure.ac: not using Gettext autoreconf-2.69: running: aclocal --force autoreconf-2.69: configure.ac: tracing autoreconf-2.69: configure.ac: not using Libtool autoreconf-2.69: running: /usr/local/bin/autoconf-2.69 --force autoreconf-2.69: running: /usr/local/bin/autoheader-2.69 --force autoreconf-2.69: configure.ac: not using Automake autoreconf-2.69: Leaving directory `.' + ./configure --prefix=/home/jenkins/build/libvirt checking for gcc... no checking for cc... cc checking whether the C compiler works... yes checking for C compiler default output file name... a.out checking for suffix of executables... checking whether we are cross compiling... no checking for suffix of object files... o checking whether we are using the GNU C compiler... yes checking whether cc accepts -g... yes checking for cc option to accept ISO C89... none needed checking for a BSD-compatible install... /usr/bin/install -c checking how to run the C preprocessor... cc -E checking for function prototypes... yes checking whether cc understands -c and -o together... yes checking build system type... x86_64-unknown-freebsd10.4 checking host system type... x86_64-unknown-freebsd10.4 checking for perl... perl checking for pkg-config... /usr/local/bin/pkg-config checking pkg-config is at least version 0.9.0... yes checking for LIBVIRT... yes checking for ocamlc... ocamlc OCaml version is 4.02.3 OCaml library path is /usr/local/lib/ocaml checking for ocamlopt... ocamlopt checking for ocamlc.opt... ocamlc.opt checking for ocamlopt.opt... ocamlopt.opt checking for ocamldep... ocamldep checking for ocamlmktop... ocamlmktop checking for ocamlmklib... ocamlmklib checking for ocamldoc... ocamldoc checking for ocamlbuild... ocamlbuild checking for ocamlfind... ocamlfind checking for OCaml findlib package unix... found ------------------------------------------------------------ Thanks for downloading ocaml-libvirt 0.6.1.4 ------------------------------------------------------------ configure: creating ./config.status config.status: creating META config.status: creating libvirt/libvirt_version.ml config.status: creating Makefile config.status: creating Make.rules config.status: creating libvirt/Makefile config.status: creating examples/Makefile config.status: creating config.h + /usr/local/bin/gmake for d in libvirt examples; do \ /usr/local/bin/gmake -C $d all; \ if [ $? -ne 0 ]; then exit 1; fi; \ done gmake[1]: Entering directory '/usr<https://ci.centos.org/job/libvirt-ocaml-build/systems=libvirt-freebsd-10/ws…'> rm -f .depend ocamlfind ocamldep -package unix libvirt.mli libvirt_version.mli libvirt.ml libvirt_version.ml > .depend perl -w generator.pl ocamlfind ocamlc -g -warn-error CDEFLMPSUVYZX-3 -safe-string -package unix -c libvirt.mli generator.pl: written libvirt_c.c ocamlfind ocamlc -g -warn-error CDEFLMPSUVYZX-3 -safe-string -package unix -c libvirt_version.mli cc -g -O2 -I.. -I"/usr/local/lib/ocaml" -g -Wall -Werror -fPIC -c -o libvirt_c.o libvirt_c.c ocamlfind ocamlc -g -warn-error CDEFLMPSUVYZX-3 -safe-string -package unix -c libvirt_version.ml ocamlfind ocamlc -g -warn-error CDEFLMPSUVYZX-3 -safe-string -package unix -c libvirt.ml In file included from libvirt_c.c:2362: ./libvirt_c_epilogue.c:156:9: error: comparison of 0 <= unsigned enum expression is always true [-Werror,-Wtautological-compare] if (0 <= code && code <= MAX_VIR_CODE) ~ ^ ~~~~ ./libvirt_c_epilogue.c:172:9: error: comparison of 0 <= unsigned enum expression is always true [-Werror,-Wtautological-compare] if (0 <= code && code <= MAX_VIR_DOMAIN) ~ ^ ~~~~ ./libvirt_c_epilogue.c:188:9: error: comparison of 0 <= unsigned enum expression is always true [-Werror,-Wtautological-compare] if (0 <= code && code <= MAX_VIR_LEVEL) ~ ^ ~~~~ 3 errors generated. gmake[1]: *** [<builtin>: libvirt_c.o] Error 1 gmake[1]: Leaving directory '/usr<https://ci.centos.org/job/libvirt-ocaml-build/systems=libvirt-freebsd-10/ws…'> gmake: *** [Makefile:31: all] Error 1 Build step 'Execute shell' marked build as failure
1 4
0 0
[Libvirt-ci] Build failed in Jenkins: libosinfo-check » libvirt-debian-8 #29
by ci@centos.org 05 Nov '18

05 Nov '18
See <https://ci.centos.org/job/libosinfo-check/systems=libvirt-debian-8/29/displ…> ------------------------------------------ [...truncated 2.97 KB...] Making check in tools make[1]: Entering directory '<https://ci.centos.org/job/libosinfo-check/systems=libvirt-debian-8/ws/build…'> make[1]: Nothing to be done for 'check'. make[1]: Leaving directory '<https://ci.centos.org/job/libosinfo-check/systems=libvirt-debian-8/ws/build…'> Making check in docs make[1]: Entering directory '<https://ci.centos.org/job/libosinfo-check/systems=libvirt-debian-8/ws/build…'> Making check in reference make[2]: Entering directory '<https://ci.centos.org/job/libosinfo-check/systems=libvirt-debian-8/ws/build…'> make[2]: Nothing to be done for 'check'. make[2]: Leaving directory '<https://ci.centos.org/job/libosinfo-check/systems=libvirt-debian-8/ws/build…'> make[2]: Entering directory '<https://ci.centos.org/job/libosinfo-check/systems=libvirt-debian-8/ws/build…'> make[2]: Nothing to be done for 'check-am'. make[2]: Leaving directory '<https://ci.centos.org/job/libosinfo-check/systems=libvirt-debian-8/ws/build…'> make[1]: Leaving directory '<https://ci.centos.org/job/libosinfo-check/systems=libvirt-debian-8/ws/build…'> Making check in po make[1]: Entering directory '<https://ci.centos.org/job/libosinfo-check/systems=libvirt-debian-8/ws/build…'> INTLTOOL_EXTRACT="/usr/bin/intltool-extract" XGETTEXT="/usr/bin/xgettext" srcdir=../../po /usr/bin/intltool-update --gettext-package libosinfo --pot rm -f missing notexist srcdir=../../po /usr/bin/intltool-update -m if [ -r missing -o -r notexist ]; then \ exit 1; \ fi make[1]: Leaving directory '<https://ci.centos.org/job/libosinfo-check/systems=libvirt-debian-8/ws/build…'> Making check in examples make[1]: Entering directory '<https://ci.centos.org/job/libosinfo-check/systems=libvirt-debian-8/ws/build…'> make[1]: Nothing to be done for 'check'. make[1]: Leaving directory '<https://ci.centos.org/job/libosinfo-check/systems=libvirt-debian-8/ws/build…'> Making check in tests make[1]: Entering directory '<https://ci.centos.org/job/libosinfo-check/systems=libvirt-debian-8/ws/build…'> /usr/bin/make test-entity test-device test-list test-devicelist test-filter test-product test-os test-oslist test-productfilter test-platform test-platformlist test-db test-loader test-isodetect test-install-script test-os-resources test-mediauris test-treeuris make[2]: Entering directory '<https://ci.centos.org/job/libosinfo-check/systems=libvirt-debian-8/ws/build…'> CC test_entity-test-entity.o CC test_list-test-list.o CC test_device-test-device.o CC test_devicelist-test-devicelist.o CC test_filter-test-filter.o CC test_product-test-product.o CC test_os-test-os.o CC test_oslist-test-oslist.o CC test_productfilter-test-productfilter.o CC test_platform-test-platform.o CC test_platformlist-test-platformlist.o CC test_db-test-db.o CC test_loader-test-loader.o CC test_isodetect-test-isodetect.o CC test_install_script-test-install-script.o CC test_mediauris-test-mediauris.o CC test_os_resources-test-os-resources.o CC test_treeuris-test-treeuris.o CCLD test-entity CCLD test-device CCLD test-list CCLD test-devicelist CCLD test-filter CCLD test-product CCLD test-os CCLD test-oslist CCLD test-productfilter CCLD test-platform CCLD test-platformlist CCLD test-db CCLD test-loader CCLD test-isodetect CCLD test-install-script CCLD test-mediauris CCLD test-os-resources CCLD test-treeuris make[2]: Leaving directory '<https://ci.centos.org/job/libosinfo-check/systems=libvirt-debian-8/ws/build…'> /usr/bin/make check-TESTS make[2]: Entering directory '<https://ci.centos.org/job/libosinfo-check/systems=libvirt-debian-8/ws/build…'> make[3]: Entering directory '<https://ci.centos.org/job/libosinfo-check/systems=libvirt-debian-8/ws/build…'> PASS: test-list PASS: test-device PASS: test-entity PASS: test-devicelist PASS: test-filter PASS: test-os PASS: test-product PASS: test-oslist PASS: test-productfilter PASS: test-platform PASS: test-platformlist PASS: test-db PASS: test-install-script PASS: test-loader PASS: test-os-resources PASS: test-treeuris FAIL: test-isodetect ../../build-aux/test-driver: line 107: 5295 Aborted "$@" > $log_file 2>&1 FAIL: test-mediauris make[4]: Entering directory '<https://ci.centos.org/job/libosinfo-check/systems=libvirt-debian-8/ws/build…'> make[4]: Nothing to be done for 'all'. make[4]: Leaving directory '<https://ci.centos.org/job/libosinfo-check/systems=libvirt-debian-8/ws/build…'> ============================================================================ Testsuite summary for libosinfo 1.3.0 ============================================================================ # TOTAL: 18 # PASS: 16 # SKIP: 0 # XFAIL: 0 # FAIL: 2 # XPASS: 0 # ERROR: 0 ============================================================================ See tests/test-suite.log Please report to libosinfo(a)redhat.com ============================================================================ Makefile:1278: recipe for target 'test-suite.log' failed make[3]: *** [test-suite.log] Error 1 make[3]: Leaving directory '<https://ci.centos.org/job/libosinfo-check/systems=libvirt-debian-8/ws/build…'> Makefile:1384: recipe for target 'check-TESTS' failed make[2]: *** [check-TESTS] Error 2 make[2]: Leaving directory '<https://ci.centos.org/job/libosinfo-check/systems=libvirt-debian-8/ws/build…'> Makefile:1576: recipe for target 'check-am' failed make[1]: *** [check-am] Error 2 make[1]: Leaving directory '<https://ci.centos.org/job/libosinfo-check/systems=libvirt-debian-8/ws/build…'> Makefile:584: recipe for target 'check-recursive' failed make: *** [check-recursive] Error 1 + cat tests/test-suite.log =========================================== libosinfo 1.3.0: tests/test-suite.log =========================================== # TOTAL: 18 # PASS: 16 # SKIP: 0 # XFAIL: 0 # FAIL: 2 # XPASS: 0 # ERROR: 0 .. contents:: :depth: 2 FAIL: test-isodetect ==================== /isodetect/haiku: OK /isodetect/dragonflybsd: OK /isodetect/windows: OK /isodetect/ubuntu: OK /isodetect/sles: OK /isodetect/sled: OK /isodetect/rhel: OK /isodetect/popos: OK /isodetect/opensuse: OK /isodetect/openbsd: OK /isodetect/netbsd: OK /isodetect/mageia: OK /isodetect/gnome: OK /isodetect/freedos: OK /isodetect/freebsd: OK /isodetect/fedora: OK /isodetect/debian: OK /isodetect/centos: OK /isodetect/asianux: OK /isodetect/altlinux: ISO alt-p8-builder-20180912-i586.iso.txt was not matched by OS alt.p8 /isodetect/altlinux: ISO alt-p8-builder-20180912-x86_64.iso.txt was not matched by OS alt.p8 /isodetect/altlinux: ISO alt-p8-cinnamon-20180912-i586.iso.txt was not matched by OS alt.p8 /isodetect/altlinux: ISO alt-p8-cinnamon-20180912-x86_64.iso.txt was not matched by OS alt.p8 /isodetect/altlinux: ISO alt-p8-enlightenment-20180912-i586.iso.txt was not matched by OS alt.p8 /isodetect/altlinux: ISO alt-p8-enlightenment-20180912-x86_64.iso.txt was not matched by OS alt.p8 /isodetect/altlinux: ISO alt-p8-gnome3-20180912-i586.iso.txt was not matched by OS alt.p8 /isodetect/altlinux: ISO alt-p8-gnome3-20180912-x86_64.iso.txt was not matched by OS alt.p8 /isodetect/altlinux: ISO alt-p8-gnustep-20180912-i586.iso.txt was not matched by OS alt.p8 /isodetect/altlinux: ISO alt-p8-gnustep-20180912-x86_64.iso.txt was not matched by OS alt.p8 /isodetect/altlinux: ISO alt-p8-icewm-20180912-i586.iso.txt was not matched by OS alt.p8 /isodetect/altlinux: ISO alt-p8-icewm-20180912-x86_64.iso.txt was not matched by OS alt.p8 /isodetect/altlinux: ISO alt-p8-jeos-20180912-i586.iso.txt was not matched by OS alt.p8 /isodetect/altlinux: ISO alt-p8-jeos-20180912-x86_64.iso.txt was not matched by OS alt.p8 /isodetect/altlinux: ISO alt-p8-kde4-20180912-i586.iso.txt was not matched by OS alt.p8 /isodetect/altlinux: ISO alt-p8-kde4-20180912-x86_64.iso.txt was not matched by OS alt.p8 /isodetect/altlinux: ISO alt-p8-kde5-20180912-i586.iso.txt was not matched by OS alt.p8 /isodetect/altlinux: ISO alt-p8-kde5-20180912-x86_64.iso.txt was not matched by OS alt.p8 /isodetect/altlinux: ISO alt-p8-lxde-20180912-i586.iso.txt was not matched by OS alt.p8 /isodetect/altlinux: ISO alt-p8-lxde-20180912-x86_64.iso.txt was not matched by OS alt.p8 /isodetect/altlinux: ISO alt-p8-lxqt-20180912-i586.iso.txt was not matched by OS alt.p8 /isodetect/altlinux: ISO alt-p8-lxqt-20180912-x86_64.iso.txt was not matched by OS alt.p8 /isodetect/altlinux: ISO alt-p8-mate-20180913-i586.iso.txt was not matched by OS alt.p8 /isodetect/altlinux: ISO alt-p8-mate-20180913-x86_64.iso.txt was not matched by OS alt.p8 /isodetect/altlinux: ISO alt-p8-rescue-20180912-i586.iso.txt was not matched by OS alt.p8 /isodetect/altlinux: ISO alt-p8-rescue-20180912-x86_64.iso.txt was not matched by OS alt.p8 /isodetect/altlinux: ISO alt-p8-server-20180913-i586.iso.txt was not matched by OS alt.p8 /isodetect/altlinux: ISO alt-p8-server-20180913-x86_64.iso.txt was not matched by OS alt.p8 /isodetect/altlinux: ISO alt-p8-server-pve-20180912-x86_64.iso.txt was not matched by OS alt.p8 /isodetect/altlinux: ISO alt-p8-sysv-tde-20180912-i586.iso.txt was not matched by OS alt.p8 /isodetect/altlinux: ISO alt-p8-sysv-tde-20180912-x86_64.iso.txt was not matched by OS alt.p8 /isodetect/altlinux: ISO alt-p8-sysv-xfce-20180912-i586.iso.txt was not matched by OS alt.p8 /isodetect/altlinux: ISO alt-p8-sysv-xfce-20180912-x86_64.iso.txt was not matched by OS alt.p8 /isodetect/altlinux: ISO alt-p8-wmaker-20180912-i586.iso.txt was not matched by OS alt.p8 /isodetect/altlinux: ISO alt-p8-wmaker-20180912-x86_64.iso.txt was not matched by OS alt.p8 /isodetect/altlinux: ISO alt-p8-xfce-20180912-i586.iso.txt was not matched by OS alt.p8 /isodetect/altlinux: ISO alt-p8-xfce-20180912-x86_64.iso.txt was not matched by OS alt.p8 /isodetect/altlinux: ISO regular-cinnamon-20181017-i586.iso.txt was not matched by OS alt.sisyphus /isodetect/altlinux: ISO regular-cinnamon-20181017-x86_64.iso.txt was not matched by OS alt.sisyphus /isodetect/altlinux: ISO regular-enlightenment-20181017-i586.iso.txt was not matched by OS alt.sisyphus /isodetect/altlinux: ISO regular-enlightenment-20181017-x86_64.iso.txt was not matched by OS alt.sisyphus /isodetect/altlinux: ISO regular-gnome3-20181017-i586.iso.txt was not matched by OS alt.sisyphus /isodetect/altlinux: ISO regular-gnome3-20181017-x86_64.iso.txt was not matched by OS alt.sisyphus /isodetect/altlinux: ISO regular-gnustep-20181017-i586.iso.txt was not matched by OS alt.sisyphus /isodetect/altlinux: ISO regular-gnustep-20181017-x86_64.iso.txt was not matched by OS alt.sisyphus /isodetect/altlinux: ISO regular-icewm-20181017-i586.iso.txt was not matched by OS alt.sisyphus /isodetect/altlinux: ISO regular-icewm-20181017-x86_64.iso.txt was not matched by OS alt.sisyphus /isodetect/altlinux: ISO regular-jeos-20181017-i586.iso.txt was not matched by OS alt.sisyphus /isodetect/altlinux: ISO regular-jeos-20181017-x86_64.iso.txt was not matched by OS alt.sisyphus /isodetect/altlinux: ISO regular-kde5-20181017-i586.iso.txt was not matched by OS alt.sisyphus /isodetect/altlinux: ISO regular-kde5-20181017-x86_64.iso.txt was not matched by OS alt.sisyphus /isodetect/altlinux: ISO regular-lxde-20181017-i586.iso.txt was not matched by OS alt.sisyphus /isodetect/altlinux: ISO regular-lxde-20181017-x86_64.iso.txt was not matched by OS alt.sisyphus /isodetect/altlinux: ISO regular-lxqt-20181017-i586.iso.txt was not matched by OS alt.sisyphus /isodetect/altlinux: ISO regular-lxqt-20181017-x86_64.iso.txt was not matched by OS alt.sisyphus /isodetect/altlinux: ISO regular-mate-20181017-i586.iso.txt was not matched by OS alt.sisyphus /isodetect/altlinux: ISO regular-mate-20181017-x86_64.iso.txt was not matched by OS alt.sisyphus /isodetect/altlinux: ISO regular-rescue-20181017-i586.iso.txt was not matched by OS alt.sisyphus /isodetect/altlinux: ISO regular-rescue-20181017-x86_64.iso.txt was not matched by OS alt.sisyphus /isodetect/altlinux: ISO regular-wmaker-20181017-i586.iso.txt was not matched by OS alt.sisyphus /isodetect/altlinux: ISO regular-wmaker-20181017-x86_64.iso.txt was not matched by OS alt.sisyphus /isodetect/altlinux: ISO regular-xfce-20181017-i586.iso.txt was not matched by OS alt.sisyphus /isodetect/altlinux: ISO regular-xfce-20181017-x86_64.iso.txt was not matched by OS alt.sisyphus /isodetect/altlinux: ISO alt-education-8.0-i586.iso.txt was not matched by OS alt8.0 /isodetect/altlinux: ISO alt-education-8.0-x86_64.iso.txt was not matched by OS alt8.0 /isodetect/altlinux: ISO alt-kworkstation-8.1-install-i586.iso.txt was not matched by OS alt8.1 /isodetect/altlinux: ISO alt-kworkstation-8.1-install-x86_64.iso.txt was not matched by OS alt8.1 /isodetect/altlinux: ISO alt-kworkstation-8.1-live-i586.iso.txt was not matched by OS alt8.1 /isodetect/altlinux: ISO alt-kworkstation-8.1-live-x86_64.iso.txt was not matched by OS alt8.1 /isodetect/altlinux: ISO alt-workstation-8.1-i586.iso.txt was not matched by OS alt8.1 /isodetect/altlinux: ISO alt-workstation-8.1-x86_64.iso.txt was not matched by OS alt8.1 /isodetect/altlinux: ISO alt-kworkstation-8.2-install-i586.iso.txt was not matched by OS alt8.2 /isodetect/altlinux: ISO alt-kworkstation-8.2-install-x86_64.iso.txt was not matched by OS alt8.2 /isodetect/altlinux: ISO alt-kworkstation-8.2-live-i586.iso.txt was not matched by OS alt8.2 /isodetect/altlinux: ISO alt-kworkstation-8.2-live-x86_64.iso.txt was not matched by OS alt8.2 /isodetect/altlinux: ISO alt-server-8.2-i586.iso.txt was not matched by OS alt8.2 /isodetect/altlinux: ISO alt-server-8.2-x86_64.iso.txt was not matched by OS alt8.2 /isodetect/altlinux: ISO alt-simply-8.2.0-i586.iso.txt was not matched by OS alt8.2 /isodetect/altlinux: ISO alt-simply-8.2.0-live-i586.iso.txt was not matched by OS alt8.2 /isodetect/altlinux: ISO alt-simply-8.2.0-live-x86_64.iso.txt was not matched by OS alt8.2 /isodetect/altlinux: ISO alt-simply-8.2.0-x86_64.iso.txt was not matched by OS alt8.2 /isodetect/altlinux: ISO alt-workstation-8.2-i586.iso.txt was not matched by OS alt8.2 /isodetect/altlinux: ISO alt-workstation-8.2-x86_64.iso.txt was not matched by OS alt8.2 /isodetect/altlinux: FAIL /isodetect/alpinelinux: OK FAIL: test-mediauris ==================== /mediauris/uris: ** ERROR:../../tests/test-mediauris.c:49:test_media: assertion failed (res == CURLE_OK): (28 == 0) + exit 1 Build step 'Execute shell' marked build as failure
1 3
0 0
[Libvirt-ci] Errored: libvirt/libvirt-python#14 (master - 65d63bc)
by Travis CI 04 Nov '18

04 Nov '18
Build Update for libvirt/libvirt-python ------------------------------------- Build: #14 Status: Errored Duration: 16 mins and 30 secs Commit: 65d63bc (master) Author: Daniel Veillard Message: Release of libvirt-python 4.9.0 * setup.py: update for new release Signed-off-by: Daniel Veillard <veillard(a)redhat.com> View the changeset: https://github.com/libvirt/libvirt-python/compare/9af6f1a5d3cf...65d63bca20… View the full build log and details: https://travis-ci.org/libvirt/libvirt-python/builds/450535793?utm_medium=no… -- You can unsubscribe from build emails from the libvirt/libvirt-python repository going to https://travis-ci.org/account/preferences/unsubscribe?repository=4872050&ut…. Or unsubscribe from *all* email updating your settings at https://travis-ci.org/account/preferences/unsubscribe?utm_medium=notificati…. Or configure specific recipients for build notifications in your .travis.yml file. See https://docs.travis-ci.com/user/notifications.
1 0
0 0
[Libvirt-ci] Errored: libvirt/libvirt-python#13 (v4.9.0 - 65d63bc)
by Travis CI 04 Nov '18

04 Nov '18
Build Update for libvirt/libvirt-python ------------------------------------- Build: #13 Status: Errored Duration: 20 mins and 21 secs Commit: 65d63bc (v4.9.0) Author: Daniel Veillard Message: Release of libvirt-python 4.9.0 * setup.py: update for new release Signed-off-by: Daniel Veillard <veillard(a)redhat.com> View the changeset: https://github.com/libvirt/libvirt-python/compare/v4.9.0 View the full build log and details: https://travis-ci.org/libvirt/libvirt-python/builds/450535774?utm_medium=no… -- You can unsubscribe from build emails from the libvirt/libvirt-python repository going to https://travis-ci.org/account/preferences/unsubscribe?repository=4872050&ut…. Or unsubscribe from *all* email updating your settings at https://travis-ci.org/account/preferences/unsubscribe?utm_medium=notificati…. Or configure specific recipients for build notifications in your .travis.yml file. See https://docs.travis-ci.com/user/notifications.
1 0
0 0
[Libvirt-ci] Passed: libvirt/libvirt#1777 (v4.9.0 - 7a10a6a)
by Travis CI 04 Nov '18

04 Nov '18
Build Update for libvirt/libvirt ------------------------------------- Build: #1777 Status: Passed Duration: 43 mins and 10 secs Commit: 7a10a6a (v4.9.0) Author: Daniel Veillard Message: Libvirt release 4.9.0 * docs/news.xml: updated for release Signed-off-by: Daniel Veillard <veillard(a)redhat.com> View the changeset: https://github.com/libvirt/libvirt/compare/v4.9.0 View the full build log and details: https://travis-ci.org/libvirt/libvirt/builds/450535682?utm_medium=notificat… -- You can unsubscribe from build emails from the libvirt/libvirt repository going to https://travis-ci.org/account/preferences/unsubscribe?repository=4872032&ut…. Or unsubscribe from *all* email updating your settings at https://travis-ci.org/account/preferences/unsubscribe?utm_medium=notificati…. Or configure specific recipients for build notifications in your .travis.yml file. See https://docs.travis-ci.com/user/notifications.
1 0
0 0
[Libvirt-ci] Build failed in Jenkins: libosinfo-check » libvirt-centos-7 #28
by ci@centos.org 01 Nov '18

01 Nov '18
See <https://ci.centos.org/job/libosinfo-check/systems=libvirt-centos-7/28/displ…> ------------------------------------------ Started by upstream project "libosinfo-check" build number 28 originally caused by: Started by upstream project "libosinfo-syntax-check" build number 28 originally caused by: Started by upstream project "libosinfo-build" build number 28 originally caused by: Started by upstream project "osinfo-db-build" build number 19 originally caused by: Started by an SCM change [EnvInject] - Loading node environment variables. Building remotely on libvirt-centos-7 (libvirt) in workspace <https://ci.centos.org/job/libosinfo-check/systems=libvirt-centos-7/ws/> [libosinfo] $ /bin/sh -xe /tmp/jenkins4402050778179826392.sh + export LIBOSINFO_NETWORK_TESTS=1 + LIBOSINFO_NETWORK_TESTS=1 + cd build + /usr/bin/gmake check GEN public-submodule-commit Making check in osinfo gmake[1]: Entering directory `<https://ci.centos.org/job/libosinfo-check/systems=libvirt-centos-7/ws/build…'> /usr/bin/gmake check-am gmake[2]: Entering directory `<https://ci.centos.org/job/libosinfo-check/systems=libvirt-centos-7/ws/build…'> /usr/bin/gmake check-local gmake[3]: Entering directory `<https://ci.centos.org/job/libosinfo-check/systems=libvirt-centos-7/ws/build…'> GEN check-symfile GEN check-symsorting gmake[3]: Leaving directory `<https://ci.centos.org/job/libosinfo-check/systems=libvirt-centos-7/ws/build…'> gmake[2]: Leaving directory `<https://ci.centos.org/job/libosinfo-check/systems=libvirt-centos-7/ws/build…'> gmake[1]: Leaving directory `<https://ci.centos.org/job/libosinfo-check/systems=libvirt-centos-7/ws/build…'> Making check in tools gmake[1]: Entering directory `<https://ci.centos.org/job/libosinfo-check/systems=libvirt-centos-7/ws/build…'> gmake[1]: Nothing to be done for `check'. gmake[1]: Leaving directory `<https://ci.centos.org/job/libosinfo-check/systems=libvirt-centos-7/ws/build…'> Making check in docs gmake[1]: Entering directory `<https://ci.centos.org/job/libosinfo-check/systems=libvirt-centos-7/ws/build…'> Making check in reference gmake[2]: Entering directory `<https://ci.centos.org/job/libosinfo-check/systems=libvirt-centos-7/ws/build…'> gmake[2]: Nothing to be done for `check'. gmake[2]: Leaving directory `<https://ci.centos.org/job/libosinfo-check/systems=libvirt-centos-7/ws/build…'> gmake[2]: Entering directory `<https://ci.centos.org/job/libosinfo-check/systems=libvirt-centos-7/ws/build…'> gmake[2]: Nothing to be done for `check-am'. gmake[2]: Leaving directory `<https://ci.centos.org/job/libosinfo-check/systems=libvirt-centos-7/ws/build…'> gmake[1]: Leaving directory `<https://ci.centos.org/job/libosinfo-check/systems=libvirt-centos-7/ws/build…'> Making check in po gmake[1]: Entering directory `<https://ci.centos.org/job/libosinfo-check/systems=libvirt-centos-7/ws/build…'> INTLTOOL_EXTRACT="/usr/bin/intltool-extract" XGETTEXT="/usr/bin/xgettext" srcdir=../../po /usr/bin/intltool-update --gettext-package libosinfo --pot rm -f missing notexist srcdir=../../po /usr/bin/intltool-update -m if [ -r missing -o -r notexist ]; then \ exit 1; \ fi gmake[1]: Leaving directory `<https://ci.centos.org/job/libosinfo-check/systems=libvirt-centos-7/ws/build…'> Making check in examples gmake[1]: Entering directory `<https://ci.centos.org/job/libosinfo-check/systems=libvirt-centos-7/ws/build…'> gmake[1]: Nothing to be done for `check'. gmake[1]: Leaving directory `<https://ci.centos.org/job/libosinfo-check/systems=libvirt-centos-7/ws/build…'> Making check in tests gmake[1]: Entering directory `<https://ci.centos.org/job/libosinfo-check/systems=libvirt-centos-7/ws/build…'> /usr/bin/gmake test-entity test-device test-list test-devicelist test-filter test-product test-os test-oslist test-productfilter test-platform test-platformlist test-db test-loader test-isodetect test-install-script test-os-resources test-mediauris test-treeuris gmake[2]: Entering directory `<https://ci.centos.org/job/libosinfo-check/systems=libvirt-centos-7/ws/build…'> CC test_entity-test-entity.o CC test_device-test-device.o CC test_list-test-list.o CC test_devicelist-test-devicelist.o CC test_filter-test-filter.o CC test_product-test-product.o CC test_os-test-os.o CC test_oslist-test-oslist.o CC test_productfilter-test-productfilter.o CC test_platform-test-platform.o CC test_platformlist-test-platformlist.o CC test_db-test-db.o CC test_loader-test-loader.o CC test_isodetect-test-isodetect.o CC test_install_script-test-install-script.o CC test_os_resources-test-os-resources.o CC test_mediauris-test-mediauris.o CC test_treeuris-test-treeuris.o CCLD test-entity CCLD test-device CCLD test-list CCLD test-devicelist CCLD test-filter CCLD test-product CCLD test-os CCLD test-oslist CCLD test-productfilter CCLD test-platform CCLD test-platformlist CCLD test-db CCLD test-loader CCLD test-isodetect CCLD test-install-script CCLD test-os-resources CCLD test-mediauris CCLD test-treeuris gmake[2]: Leaving directory `<https://ci.centos.org/job/libosinfo-check/systems=libvirt-centos-7/ws/build…'> /usr/bin/gmake check-TESTS gmake[2]: Entering directory `<https://ci.centos.org/job/libosinfo-check/systems=libvirt-centos-7/ws/build…'> gmake[3]: Entering directory `<https://ci.centos.org/job/libosinfo-check/systems=libvirt-centos-7/ws/build…'> PASS: test-list PASS: test-entity PASS: test-device PASS: test-product PASS: test-devicelist PASS: test-filter PASS: test-os PASS: test-oslist PASS: test-productfilter PASS: test-platform PASS: test-platformlist PASS: test-db PASS: test-install-script PASS: test-loader PASS: test-os-resources PASS: test-treeuris ../../build-aux/test-driver: line 95: 24956 Aborted "$@" > $log_file 2>&1 FAIL: test-mediauris PASS: test-isodetect gmake[4]: Entering directory `<https://ci.centos.org/job/libosinfo-check/systems=libvirt-centos-7/ws/build…'> gmake[4]: Nothing to be done for `all'. gmake[4]: Leaving directory `<https://ci.centos.org/job/libosinfo-check/systems=libvirt-centos-7/ws/build…'> ============================================================================ Testsuite summary for libosinfo 1.3.0 ============================================================================ # TOTAL: 18 # PASS: 17 # SKIP: 0 # XFAIL: 0 # FAIL: 1 # XPASS: 0 # ERROR: 0 ============================================================================ See tests/test-suite.log Please report to libosinfo(a)redhat.com ============================================================================ gmake[3]: *** [test-suite.log] Error 1 gmake[3]: Leaving directory `<https://ci.centos.org/job/libosinfo-check/systems=libvirt-centos-7/ws/build…'> gmake[2]: *** [check-TESTS] Error 2 gmake[2]: Leaving directory `<https://ci.centos.org/job/libosinfo-check/systems=libvirt-centos-7/ws/build…'> gmake[1]: *** [check-am] Error 2 gmake[1]: Leaving directory `<https://ci.centos.org/job/libosinfo-check/systems=libvirt-centos-7/ws/build…'> gmake: *** [check-recursive] Error 1 + cat tests/test-suite.log =========================================== libosinfo 1.3.0: tests/test-suite.log =========================================== # TOTAL: 18 # PASS: 17 # SKIP: 0 # XFAIL: 0 # FAIL: 1 # XPASS: 0 # ERROR: 0 .. contents:: :depth: 2 FAIL: test-mediauris ==================== /mediauris/uris: ** ERROR:../../tests/test-mediauris.c:49:test_media: assertion failed (res == CURLE_OK): (52 == 0) + exit 1 Build step 'Execute shell' marked build as failure
1 3
0 0
[Libvirt-ci] Build failed in Jenkins: libosinfo-check » libvirt-fedora-28 #26
by ci@centos.org 01 Nov '18

01 Nov '18
See <https://ci.centos.org/job/libosinfo-check/systems=libvirt-fedora-28/26/disp…> ------------------------------------------ Started by upstream project "libosinfo-check" build number 26 originally caused by: Started by upstream project "libosinfo-syntax-check" build number 26 originally caused by: Started by upstream project "libosinfo-build" build number 26 originally caused by: Started by an SCM change [EnvInject] - Loading node environment variables. Building remotely on libvirt-fedora-28 (libvirt) in workspace <https://ci.centos.org/job/libosinfo-check/systems=libvirt-fedora-28/ws/> [libosinfo] $ /bin/sh -xe /tmp/jenkins5430027326056751570.sh + export LIBOSINFO_NETWORK_TESTS=1 + LIBOSINFO_NETWORK_TESTS=1 + cd build + /usr/bin/gmake check GEN public-submodule-commit Making check in osinfo gmake[1]: Entering directory '<https://ci.centos.org/job/libosinfo-check/systems=libvirt-fedora-28/ws/buil…'> /usr/bin/gmake check-am gmake[2]: Entering directory '<https://ci.centos.org/job/libosinfo-check/systems=libvirt-fedora-28/ws/buil…'> /usr/bin/gmake check-local gmake[3]: Entering directory '<https://ci.centos.org/job/libosinfo-check/systems=libvirt-fedora-28/ws/buil…'> GEN check-symfile GEN check-symsorting gmake[3]: Leaving directory '<https://ci.centos.org/job/libosinfo-check/systems=libvirt-fedora-28/ws/buil…'> gmake[2]: Leaving directory '<https://ci.centos.org/job/libosinfo-check/systems=libvirt-fedora-28/ws/buil…'> gmake[1]: Leaving directory '<https://ci.centos.org/job/libosinfo-check/systems=libvirt-fedora-28/ws/buil…'> Making check in tools gmake[1]: Entering directory '<https://ci.centos.org/job/libosinfo-check/systems=libvirt-fedora-28/ws/buil…'> gmake[1]: Nothing to be done for 'check'. gmake[1]: Leaving directory '<https://ci.centos.org/job/libosinfo-check/systems=libvirt-fedora-28/ws/buil…'> Making check in docs gmake[1]: Entering directory '<https://ci.centos.org/job/libosinfo-check/systems=libvirt-fedora-28/ws/buil…'> Making check in reference gmake[2]: Entering directory '<https://ci.centos.org/job/libosinfo-check/systems=libvirt-fedora-28/ws/buil…'> gmake[2]: Nothing to be done for 'check'. gmake[2]: Leaving directory '<https://ci.centos.org/job/libosinfo-check/systems=libvirt-fedora-28/ws/buil…'> gmake[2]: Entering directory '<https://ci.centos.org/job/libosinfo-check/systems=libvirt-fedora-28/ws/buil…'> gmake[2]: Nothing to be done for 'check-am'. gmake[2]: Leaving directory '<https://ci.centos.org/job/libosinfo-check/systems=libvirt-fedora-28/ws/buil…'> gmake[1]: Leaving directory '<https://ci.centos.org/job/libosinfo-check/systems=libvirt-fedora-28/ws/buil…'> Making check in po gmake[1]: Entering directory '<https://ci.centos.org/job/libosinfo-check/systems=libvirt-fedora-28/ws/buil…'> INTLTOOL_EXTRACT="/usr/bin/intltool-extract" XGETTEXT="/usr/bin/xgettext" srcdir=../../po /usr/bin/intltool-update --gettext-package libosinfo --pot rm -f missing notexist srcdir=../../po /usr/bin/intltool-update -m if [ -r missing -o -r notexist ]; then \ exit 1; \ fi gmake[1]: Leaving directory '<https://ci.centos.org/job/libosinfo-check/systems=libvirt-fedora-28/ws/buil…'> Making check in examples gmake[1]: Entering directory '<https://ci.centos.org/job/libosinfo-check/systems=libvirt-fedora-28/ws/buil…'> gmake[1]: Nothing to be done for 'check'. gmake[1]: Leaving directory '<https://ci.centos.org/job/libosinfo-check/systems=libvirt-fedora-28/ws/buil…'> Making check in tests gmake[1]: Entering directory '<https://ci.centos.org/job/libosinfo-check/systems=libvirt-fedora-28/ws/buil…'> /usr/bin/gmake test-entity test-device test-list test-devicelist test-filter test-product test-os test-oslist test-productfilter test-platform test-platformlist test-db test-loader test-isodetect test-install-script test-os-resources test-mediauris test-treeuris gmake[2]: Entering directory '<https://ci.centos.org/job/libosinfo-check/systems=libvirt-fedora-28/ws/buil…'> CC test_entity-test-entity.o CC test_device-test-device.o CC test_list-test-list.o CC test_devicelist-test-devicelist.o CC test_filter-test-filter.o CC test_product-test-product.o CC test_os-test-os.o CC test_oslist-test-oslist.o CC test_productfilter-test-productfilter.o CC test_platform-test-platform.o CC test_platformlist-test-platformlist.o CC test_db-test-db.o CC test_loader-test-loader.o CC test_isodetect-test-isodetect.o CC test_install_script-test-install-script.o CC test_os_resources-test-os-resources.o CC test_mediauris-test-mediauris.o CC test_treeuris-test-treeuris.o CCLD test-entity CCLD test-device CCLD test-list CCLD test-devicelist CCLD test-filter CCLD test-product CCLD test-os CCLD test-oslist CCLD test-productfilter CCLD test-platform CCLD test-platformlist CCLD test-db CCLD test-loader CCLD test-isodetect CCLD test-install-script CCLD test-os-resources CCLD test-mediauris CCLD test-treeuris gmake[2]: Leaving directory '<https://ci.centos.org/job/libosinfo-check/systems=libvirt-fedora-28/ws/buil…'> /usr/bin/gmake check-TESTS gmake[2]: Entering directory '<https://ci.centos.org/job/libosinfo-check/systems=libvirt-fedora-28/ws/buil…'> gmake[3]: Entering directory '<https://ci.centos.org/job/libosinfo-check/systems=libvirt-fedora-28/ws/buil…'> PASS: test-device PASS: test-entity PASS: test-list PASS: test-devicelist PASS: test-filter PASS: test-product PASS: test-os PASS: test-oslist PASS: test-productfilter PASS: test-platform PASS: test-platformlist PASS: test-db PASS: test-install-script PASS: test-loader PASS: test-os-resources PASS: test-treeuris ../../build-aux/test-driver: line 107: 9557 Aborted (core dumped) "$@" > $log_file 2>&1 FAIL: test-mediauris PASS: test-isodetect ============================================================================ Testsuite summary for libosinfo 1.3.0 ============================================================================ # TOTAL: 18 # PASS: 17 # SKIP: 0 # XFAIL: 0 # FAIL: 1 # XPASS: 0 # ERROR: 0 ============================================================================ See tests/test-suite.log Please report to libosinfo(a)redhat.com ============================================================================ gmake[3]: *** [Makefile:1289: test-suite.log] Error 1 gmake[3]: Leaving directory '<https://ci.centos.org/job/libosinfo-check/systems=libvirt-fedora-28/ws/buil…'> gmake[2]: *** [Makefile:1397: check-TESTS] Error 2 gmake[2]: Leaving directory '<https://ci.centos.org/job/libosinfo-check/systems=libvirt-fedora-28/ws/buil…'> gmake[1]: *** [Makefile:1587: check-am] Error 2 gmake[1]: Leaving directory '<https://ci.centos.org/job/libosinfo-check/systems=libvirt-fedora-28/ws/buil…'> gmake: *** [Makefile:594: check-recursive] Error 1 + cat tests/test-suite.log =========================================== libosinfo 1.3.0: tests/test-suite.log =========================================== # TOTAL: 18 # PASS: 17 # SKIP: 0 # XFAIL: 0 # FAIL: 1 # XPASS: 0 # ERROR: 0 .. contents:: :depth: 2 FAIL: test-mediauris ==================== /mediauris/uris: ** ERROR:../../tests/test-mediauris.c:49:test_media: assertion failed (res == CURLE_OK): (22 == 0) FAIL test-mediauris (exit status: 134) + exit 1 Build step 'Execute shell' marked build as failure
1 5
0 0
[Libvirt-ci] Build failed in Jenkins: libosinfo-check » libvirt-debian-9 #28
by ci@centos.org 01 Nov '18

01 Nov '18
See <https://ci.centos.org/job/libosinfo-check/systems=libvirt-debian-9/28/displ…> ------------------------------------------ Started by upstream project "libosinfo-check" build number 28 originally caused by: Started by upstream project "libosinfo-syntax-check" build number 28 originally caused by: Started by upstream project "libosinfo-build" build number 28 originally caused by: Started by upstream project "osinfo-db-build" build number 19 originally caused by: Started by an SCM change [EnvInject] - Loading node environment variables. Building remotely on libvirt-debian-9 (libvirt) in workspace <https://ci.centos.org/job/libosinfo-check/systems=libvirt-debian-9/ws/> [libosinfo] $ /bin/sh -xe /tmp/jenkins7401002587045962189.sh + export LIBOSINFO_NETWORK_TESTS=1 + cd build + /usr/bin/make check GEN public-submodule-commit Making check in osinfo make[1]: Entering directory '<https://ci.centos.org/job/libosinfo-check/systems=libvirt-debian-9/ws/build…'> /usr/bin/make check-am make[2]: Entering directory '<https://ci.centos.org/job/libosinfo-check/systems=libvirt-debian-9/ws/build…'> /usr/bin/make check-local make[3]: Entering directory '<https://ci.centos.org/job/libosinfo-check/systems=libvirt-debian-9/ws/build…'> GEN check-symsorting GEN check-symfile make[3]: Leaving directory '<https://ci.centos.org/job/libosinfo-check/systems=libvirt-debian-9/ws/build…'> make[2]: Leaving directory '<https://ci.centos.org/job/libosinfo-check/systems=libvirt-debian-9/ws/build…'> make[1]: Leaving directory '<https://ci.centos.org/job/libosinfo-check/systems=libvirt-debian-9/ws/build…'> Making check in tools make[1]: Entering directory '<https://ci.centos.org/job/libosinfo-check/systems=libvirt-debian-9/ws/build…'> make[1]: Nothing to be done for 'check'. make[1]: Leaving directory '<https://ci.centos.org/job/libosinfo-check/systems=libvirt-debian-9/ws/build…'> Making check in docs make[1]: Entering directory '<https://ci.centos.org/job/libosinfo-check/systems=libvirt-debian-9/ws/build…'> Making check in reference make[2]: Entering directory '<https://ci.centos.org/job/libosinfo-check/systems=libvirt-debian-9/ws/build…'> make[2]: Nothing to be done for 'check'. make[2]: Leaving directory '<https://ci.centos.org/job/libosinfo-check/systems=libvirt-debian-9/ws/build…'> make[2]: Entering directory '<https://ci.centos.org/job/libosinfo-check/systems=libvirt-debian-9/ws/build…'> make[2]: Nothing to be done for 'check-am'. make[2]: Leaving directory '<https://ci.centos.org/job/libosinfo-check/systems=libvirt-debian-9/ws/build…'> make[1]: Leaving directory '<https://ci.centos.org/job/libosinfo-check/systems=libvirt-debian-9/ws/build…'> Making check in po make[1]: Entering directory '<https://ci.centos.org/job/libosinfo-check/systems=libvirt-debian-9/ws/build…'> INTLTOOL_EXTRACT="/usr/bin/intltool-extract" XGETTEXT="/usr/bin/xgettext" srcdir=../../po /usr/bin/intltool-update --gettext-package libosinfo --pot rm -f missing notexist srcdir=../../po /usr/bin/intltool-update -m Unescaped left brace in regex is deprecated, passed through in regex; marked by <-- HERE in m/\${ <-- HERE ?PACKAGE_NAME}?/ at /usr/bin/intltool-update line 1071, <CONF> line 295. if [ -r missing -o -r notexist ]; then \ exit 1; \ fi make[1]: Leaving directory '<https://ci.centos.org/job/libosinfo-check/systems=libvirt-debian-9/ws/build…'> Making check in examples make[1]: Entering directory '<https://ci.centos.org/job/libosinfo-check/systems=libvirt-debian-9/ws/build…'> make[1]: Nothing to be done for 'check'. make[1]: Leaving directory '<https://ci.centos.org/job/libosinfo-check/systems=libvirt-debian-9/ws/build…'> Making check in tests make[1]: Entering directory '<https://ci.centos.org/job/libosinfo-check/systems=libvirt-debian-9/ws/build…'> /usr/bin/make test-entity test-device test-list test-devicelist test-filter test-product test-os test-oslist test-productfilter test-platform test-platformlist test-db test-loader test-isodetect test-install-script test-os-resources test-mediauris test-treeuris make[2]: Entering directory '<https://ci.centos.org/job/libosinfo-check/systems=libvirt-debian-9/ws/build…'> CC test_device-test-device.o CC test_list-test-list.o CC test_entity-test-entity.o CC test_devicelist-test-devicelist.o CC test_filter-test-filter.o CC test_product-test-product.o CC test_os-test-os.o CC test_oslist-test-oslist.o CC test_productfilter-test-productfilter.o CC test_platform-test-platform.o CC test_platformlist-test-platformlist.o CC test_db-test-db.o CC test_loader-test-loader.o CC test_isodetect-test-isodetect.o CC test_install_script-test-install-script.o CC test_os_resources-test-os-resources.o CC test_mediauris-test-mediauris.o CC test_treeuris-test-treeuris.o CCLD test-device CCLD test-entity CCLD test-list CCLD test-devicelist CCLD test-filter CCLD test-product CCLD test-os CCLD test-oslist CCLD test-productfilter CCLD test-platform CCLD test-platformlist CCLD test-db CCLD test-loader CCLD test-isodetect CCLD test-install-script CCLD test-os-resources CCLD test-mediauris CCLD test-treeuris make[2]: Leaving directory '<https://ci.centos.org/job/libosinfo-check/systems=libvirt-debian-9/ws/build…'> /usr/bin/make check-TESTS make[2]: Entering directory '<https://ci.centos.org/job/libosinfo-check/systems=libvirt-debian-9/ws/build…'> make[3]: Entering directory '<https://ci.centos.org/job/libosinfo-check/systems=libvirt-debian-9/ws/build…'> PASS: test-list PASS: test-entity PASS: test-device PASS: test-devicelist PASS: test-filter PASS: test-product PASS: test-os PASS: test-oslist PASS: test-productfilter PASS: test-platformlist PASS: test-platform PASS: test-db PASS: test-install-script PASS: test-loader PASS: test-os-resources PASS: test-treeuris PASS: test-isodetect ../../build-aux/test-driver: line 107: 16189 Aborted "$@" > $log_file 2>&1 FAIL: test-mediauris ============================================================================ Testsuite summary for libosinfo 1.3.0 ============================================================================ # TOTAL: 18 # PASS: 17 # SKIP: 0 # XFAIL: 0 # FAIL: 1 # XPASS: 0 # ERROR: 0 ============================================================================ See tests/test-suite.log Please report to libosinfo(a)redhat.com ============================================================================ Makefile:1289: recipe for target 'test-suite.log' failed make[3]: *** [test-suite.log] Error 1 make[3]: Leaving directory '<https://ci.centos.org/job/libosinfo-check/systems=libvirt-debian-9/ws/build…'> Makefile:1395: recipe for target 'check-TESTS' failed make[2]: *** [check-TESTS] Error 2 make[2]: Leaving directory '<https://ci.centos.org/job/libosinfo-check/systems=libvirt-debian-9/ws/build…'> Makefile:1587: recipe for target 'check-am' failed make[1]: *** [check-am] Error 2 make[1]: Leaving directory '<https://ci.centos.org/job/libosinfo-check/systems=libvirt-debian-9/ws/build…'> Makefile:595: recipe for target 'check-recursive' failed make: *** [check-recursive] Error 1 + cat tests/test-suite.log =========================================== libosinfo 1.3.0: tests/test-suite.log =========================================== # TOTAL: 18 # PASS: 17 # SKIP: 0 # XFAIL: 0 # FAIL: 1 # XPASS: 0 # ERROR: 0 .. contents:: :depth: 2 FAIL: test-mediauris ==================== /mediauris/uris: ** ERROR:../../tests/test-mediauris.c:49:test_media: assertion failed (res == CURLE_OK): (28 == 0) FAIL test-mediauris (exit status: 134) + exit 1 Build step 'Execute shell' marked build as failure
1 3
0 0
[Libvirt-ci] Build failed in Jenkins: libosinfo-check » libvirt-fedora-27 #27
by ci@centos.org 01 Nov '18

01 Nov '18
See <https://ci.centos.org/job/libosinfo-check/systems=libvirt-fedora-27/27/disp…> ------------------------------------------ Started by upstream project "libosinfo-check" build number 27 originally caused by: Started by upstream project "libosinfo-syntax-check" build number 27 originally caused by: Started by upstream project "libosinfo-build" build number 27 originally caused by: Started by an SCM change [EnvInject] - Loading node environment variables. Building remotely on libvirt-fedora-27 (libvirt) in workspace <https://ci.centos.org/job/libosinfo-check/systems=libvirt-fedora-27/ws/> [libosinfo] $ /bin/sh -xe /tmp/jenkins7496366245189762890.sh + export LIBOSINFO_NETWORK_TESTS=1 + LIBOSINFO_NETWORK_TESTS=1 + cd build + /usr/bin/gmake check Making check in osinfo GEN public-submodule-commit gmake[1]: Entering directory '<https://ci.centos.org/job/libosinfo-check/systems=libvirt-fedora-27/ws/buil…'> /usr/bin/gmake check-am gmake[2]: Entering directory '<https://ci.centos.org/job/libosinfo-check/systems=libvirt-fedora-27/ws/buil…'> /usr/bin/gmake check-local gmake[3]: Entering directory '<https://ci.centos.org/job/libosinfo-check/systems=libvirt-fedora-27/ws/buil…'> GEN check-symfile GEN check-symsorting gmake[3]: Leaving directory '<https://ci.centos.org/job/libosinfo-check/systems=libvirt-fedora-27/ws/buil…'> gmake[2]: Leaving directory '<https://ci.centos.org/job/libosinfo-check/systems=libvirt-fedora-27/ws/buil…'> gmake[1]: Leaving directory '<https://ci.centos.org/job/libosinfo-check/systems=libvirt-fedora-27/ws/buil…'> Making check in tools gmake[1]: Entering directory '<https://ci.centos.org/job/libosinfo-check/systems=libvirt-fedora-27/ws/buil…'> gmake[1]: Nothing to be done for 'check'. gmake[1]: Leaving directory '<https://ci.centos.org/job/libosinfo-check/systems=libvirt-fedora-27/ws/buil…'> Making check in docs gmake[1]: Entering directory '<https://ci.centos.org/job/libosinfo-check/systems=libvirt-fedora-27/ws/buil…'> Making check in reference gmake[2]: Entering directory '<https://ci.centos.org/job/libosinfo-check/systems=libvirt-fedora-27/ws/buil…'> gmake[2]: Nothing to be done for 'check'. gmake[2]: Leaving directory '<https://ci.centos.org/job/libosinfo-check/systems=libvirt-fedora-27/ws/buil…'> gmake[2]: Entering directory '<https://ci.centos.org/job/libosinfo-check/systems=libvirt-fedora-27/ws/buil…'> gmake[2]: Nothing to be done for 'check-am'. gmake[2]: Leaving directory '<https://ci.centos.org/job/libosinfo-check/systems=libvirt-fedora-27/ws/buil…'> gmake[1]: Leaving directory '<https://ci.centos.org/job/libosinfo-check/systems=libvirt-fedora-27/ws/buil…'> Making check in po gmake[1]: Entering directory '<https://ci.centos.org/job/libosinfo-check/systems=libvirt-fedora-27/ws/buil…'> INTLTOOL_EXTRACT="/usr/bin/intltool-extract" XGETTEXT="/usr/bin/xgettext" srcdir=../../po /usr/bin/intltool-update --gettext-package libosinfo --pot rm -f missing notexist srcdir=../../po /usr/bin/intltool-update -m if [ -r missing -o -r notexist ]; then \ exit 1; \ fi gmake[1]: Leaving directory '<https://ci.centos.org/job/libosinfo-check/systems=libvirt-fedora-27/ws/buil…'> Making check in examples gmake[1]: Entering directory '<https://ci.centos.org/job/libosinfo-check/systems=libvirt-fedora-27/ws/buil…'> gmake[1]: Nothing to be done for 'check'. gmake[1]: Leaving directory '<https://ci.centos.org/job/libosinfo-check/systems=libvirt-fedora-27/ws/buil…'> Making check in tests gmake[1]: Entering directory '<https://ci.centos.org/job/libosinfo-check/systems=libvirt-fedora-27/ws/buil…'> /usr/bin/gmake test-entity test-device test-list test-devicelist test-filter test-product test-os test-oslist test-productfilter test-platform test-platformlist test-db test-loader test-isodetect test-install-script test-os-resources test-mediauris test-treeuris gmake[2]: Entering directory '<https://ci.centos.org/job/libosinfo-check/systems=libvirt-fedora-27/ws/buil…'> CC test_entity-test-entity.o CC test_device-test-device.o CC test_list-test-list.o CC test_devicelist-test-devicelist.o CC test_filter-test-filter.o CC test_product-test-product.o CC test_os-test-os.o CC test_oslist-test-oslist.o CC test_productfilter-test-productfilter.o CC test_platform-test-platform.o CC test_platformlist-test-platformlist.o CC test_db-test-db.o CC test_loader-test-loader.o CC test_isodetect-test-isodetect.o CC test_install_script-test-install-script.o CC test_os_resources-test-os-resources.o CC test_mediauris-test-mediauris.o CC test_treeuris-test-treeuris.o CCLD test-entity CCLD test-device CCLD test-list CCLD test-devicelist CCLD test-filter CCLD test-product CCLD test-os CCLD test-oslist CCLD test-productfilter CCLD test-platform CCLD test-platformlist CCLD test-db CCLD test-loader CCLD test-isodetect CCLD test-install-script CCLD test-os-resources CCLD test-mediauris CCLD test-treeuris gmake[2]: Leaving directory '<https://ci.centos.org/job/libosinfo-check/systems=libvirt-fedora-27/ws/buil…'> /usr/bin/gmake check-TESTS gmake[2]: Entering directory '<https://ci.centos.org/job/libosinfo-check/systems=libvirt-fedora-27/ws/buil…'> gmake[3]: Entering directory '<https://ci.centos.org/job/libosinfo-check/systems=libvirt-fedora-27/ws/buil…'> PASS: test-entity PASS: test-device PASS: test-list PASS: test-devicelist PASS: test-filter PASS: test-product PASS: test-os PASS: test-oslist PASS: test-platform PASS: test-productfilter PASS: test-platformlist PASS: test-db PASS: test-install-script PASS: test-loader PASS: test-os-resources PASS: test-treeuris PASS: test-isodetect ../../build-aux/test-driver: line 107: 4240 Aborted (core dumped) "$@" > $log_file 2>&1 FAIL: test-mediauris ============================================================================ Testsuite summary for libosinfo 1.3.0 ============================================================================ # TOTAL: 18 # PASS: 17 # SKIP: 0 # XFAIL: 0 # FAIL: 1 # XPASS: 0 # ERROR: 0 ============================================================================ See tests/test-suite.log Please report to libosinfo(a)redhat.com ============================================================================ gmake[3]: *** [Makefile:1289: test-suite.log] Error 1 gmake[3]: Leaving directory '<https://ci.centos.org/job/libosinfo-check/systems=libvirt-fedora-27/ws/buil…'> gmake[2]: *** [Makefile:1397: check-TESTS] Error 2 gmake[2]: Leaving directory '<https://ci.centos.org/job/libosinfo-check/systems=libvirt-fedora-27/ws/buil…'> gmake[1]: *** [Makefile:1587: check-am] Error 2 gmake[1]: Leaving directory '<https://ci.centos.org/job/libosinfo-check/systems=libvirt-fedora-27/ws/buil…'> gmake: *** [Makefile:594: check-recursive] Error 1 + cat tests/test-suite.log =========================================== libosinfo 1.3.0: tests/test-suite.log =========================================== # TOTAL: 18 # PASS: 17 # SKIP: 0 # XFAIL: 0 # FAIL: 1 # XPASS: 0 # ERROR: 0 .. contents:: :depth: 2 FAIL: test-mediauris ==================== /mediauris/uris: ** ERROR:../../tests/test-mediauris.c:49:test_media: assertion failed (res == CURLE_OK): (28 == 0) FAIL test-mediauris (exit status: 134) + exit 1 Build step 'Execute shell' marked build as failure
1 4
0 0
[Libvirt-ci] Build failed in Jenkins: libosinfo-check » libvirt-freebsd-11 #29
by ci@centos.org 01 Nov '18

01 Nov '18
See <https://ci.centos.org/job/libosinfo-check/systems=libvirt-freebsd-11/29/dis…> ------------------------------------------ [...truncated 2.73 KB...] gmake[3]: Entering directory '/usr<https://ci.centos.org/job/libosinfo-check/systems=libvirt-freebsd-11/ws/bui…'> GEN check-symsorting gmake[3]: Leaving directory '/usr<https://ci.centos.org/job/libosinfo-check/systems=libvirt-freebsd-11/ws/bui…'> gmake[2]: Leaving directory '/usr<https://ci.centos.org/job/libosinfo-check/systems=libvirt-freebsd-11/ws/bui…'> gmake[1]: Leaving directory '/usr<https://ci.centos.org/job/libosinfo-check/systems=libvirt-freebsd-11/ws/bui…'> Making check in tools gmake[1]: Entering directory '/usr<https://ci.centos.org/job/libosinfo-check/systems=libvirt-freebsd-11/ws/bui…'> gmake[1]: Nothing to be done for 'check'. gmake[1]: Leaving directory '/usr<https://ci.centos.org/job/libosinfo-check/systems=libvirt-freebsd-11/ws/bui…'> Making check in docs gmake[1]: Entering directory '/usr<https://ci.centos.org/job/libosinfo-check/systems=libvirt-freebsd-11/ws/bui…'> Making check in reference gmake[2]: Entering directory '/usr<https://ci.centos.org/job/libosinfo-check/systems=libvirt-freebsd-11/ws/bui…'> gmake[2]: Nothing to be done for 'check'. gmake[2]: Leaving directory '/usr<https://ci.centos.org/job/libosinfo-check/systems=libvirt-freebsd-11/ws/bui…'> gmake[2]: Entering directory '/usr<https://ci.centos.org/job/libosinfo-check/systems=libvirt-freebsd-11/ws/bui…'> gmake[2]: Nothing to be done for 'check-am'. gmake[2]: Leaving directory '/usr<https://ci.centos.org/job/libosinfo-check/systems=libvirt-freebsd-11/ws/bui…'> gmake[1]: Leaving directory '/usr<https://ci.centos.org/job/libosinfo-check/systems=libvirt-freebsd-11/ws/bui…'> Making check in po gmake[1]: Entering directory '/usr<https://ci.centos.org/job/libosinfo-check/systems=libvirt-freebsd-11/ws/bui…'> INTLTOOL_EXTRACT="/usr/local/bin/intltool-extract" XGETTEXT="/usr/local/bin/xgettext" srcdir=../../po /usr/local/bin/intltool-update --gettext-package libosinfo --pot rm -f missing notexist srcdir=../../po /usr/local/bin/intltool-update -m if [ -r missing -o -r notexist ]; then \ exit 1; \ fi gmake[1]: Leaving directory '/usr<https://ci.centos.org/job/libosinfo-check/systems=libvirt-freebsd-11/ws/bui…'> Making check in examples gmake[1]: Entering directory '/usr<https://ci.centos.org/job/libosinfo-check/systems=libvirt-freebsd-11/ws/bui…'> gmake[1]: Nothing to be done for 'check'. gmake[1]: Leaving directory '/usr<https://ci.centos.org/job/libosinfo-check/systems=libvirt-freebsd-11/ws/bui…'> Making check in tests gmake[1]: Entering directory '/usr<https://ci.centos.org/job/libosinfo-check/systems=libvirt-freebsd-11/ws/bui…'> /usr/local/bin/gmake test-entity test-device test-list test-devicelist test-filter test-product test-os test-oslist test-productfilter test-platform test-platformlist test-db test-loader test-isodetect test-install-script test-os-resources test-mediauris test-treeuris gmake[2]: Entering directory '/usr<https://ci.centos.org/job/libosinfo-check/systems=libvirt-freebsd-11/ws/bui…'> CC test_entity-test-entity.o CC test_device-test-device.o CC test_list-test-list.o CC test_devicelist-test-devicelist.o CC test_filter-test-filter.o CC test_product-test-product.o CC test_os-test-os.o CC test_oslist-test-oslist.o CC test_productfilter-test-productfilter.o CC test_platform-test-platform.o CC test_platformlist-test-platformlist.o CC test_db-test-db.o CC test_loader-test-loader.o CC test_isodetect-test-isodetect.o CC test_install_script-test-install-script.o CC test_os_resources-test-os-resources.o CC test_mediauris-test-mediauris.o CC test_treeuris-test-treeuris.o CCLD test-entity CCLD test-device CCLD test-list CCLD test-devicelist CCLD test-filter CCLD test-product CCLD test-os CCLD test-oslist CCLD test-productfilter CCLD test-platform CCLD test-platformlist CCLD test-db CCLD test-loader CCLD test-isodetect CCLD test-install-script CCLD test-os-resources CCLD test-mediauris CCLD test-treeuris gmake[2]: Leaving directory '/usr<https://ci.centos.org/job/libosinfo-check/systems=libvirt-freebsd-11/ws/bui…'> /usr/local/bin/gmake check-TESTS gmake[2]: Entering directory '/usr<https://ci.centos.org/job/libosinfo-check/systems=libvirt-freebsd-11/ws/bui…'> gmake[3]: Entering directory '/usr<https://ci.centos.org/job/libosinfo-check/systems=libvirt-freebsd-11/ws/bui…'> PASS: test-device PASS: test-list PASS: test-entity PASS: test-devicelist PASS: test-filter PASS: test-product PASS: test-oslist PASS: test-os PASS: test-productfilter PASS: test-platformlist PASS: test-db PASS: test-platform PASS: test-install-script PASS: test-loader PASS: test-os-resources PASS: test-treeuris FAIL: test-isodetect Abort trap (core dumped) FAIL: test-mediauris ============================================================================ Testsuite summary for libosinfo 1.3.0 ============================================================================ # TOTAL: 18 # PASS: 16 # SKIP: 0 # XFAIL: 0 # FAIL: 2 # XPASS: 0 # ERROR: 0 ============================================================================ See tests/test-suite.log Please report to libosinfo(a)redhat.com ============================================================================ gmake[3]: *** [Makefile:1313: test-suite.log] Error 1 gmake[3]: Leaving directory '/usr<https://ci.centos.org/job/libosinfo-check/systems=libvirt-freebsd-11/ws/bui…'> gmake[2]: *** [Makefile:1421: check-TESTS] Error 2 gmake[2]: Leaving directory '/usr<https://ci.centos.org/job/libosinfo-check/systems=libvirt-freebsd-11/ws/bui…'> gmake[1]: *** [Makefile:1614: check-am] Error 2 gmake[1]: Leaving directory '/usr<https://ci.centos.org/job/libosinfo-check/systems=libvirt-freebsd-11/ws/bui…'> gmake: *** [Makefile:594: check-recursive] Error 1 + cat tests/test-suite.log =========================================== libosinfo 1.3.0: tests/test-suite.log =========================================== # TOTAL: 18 # PASS: 16 # SKIP: 0 # XFAIL: 0 # FAIL: 2 # XPASS: 0 # ERROR: 0 .. contents:: :depth: 2 FAIL: test-isodetect ==================== /isodetect/windows: OK /isodetect/ubuntu: OK /isodetect/sles: OK /isodetect/sled: OK /isodetect/rhel: OK /isodetect/popos: OK /isodetect/opensuse: OK /isodetect/openbsd: OK /isodetect/netbsd: OK /isodetect/mageia: OK /isodetect/haiku: OK /isodetect/gnome: OK /isodetect/freedos: OK /isodetect/freebsd: OK /isodetect/fedora: OK /isodetect/dragonflybsd: OK /isodetect/debian: OK /isodetect/centos: OK /isodetect/asianux: OK /isodetect/altlinux: ISO alt-p8-builder-20180912-i586.iso.txt was not matched by OS alt.p8 /isodetect/altlinux: ISO alt-p8-builder-20180912-x86_64.iso.txt was not matched by OS alt.p8 /isodetect/altlinux: ISO alt-p8-cinnamon-20180912-i586.iso.txt was not matched by OS alt.p8 /isodetect/altlinux: ISO alt-p8-cinnamon-20180912-x86_64.iso.txt was not matched by OS alt.p8 /isodetect/altlinux: ISO alt-p8-enlightenment-20180912-i586.iso.txt was not matched by OS alt.p8 /isodetect/altlinux: ISO alt-p8-enlightenment-20180912-x86_64.iso.txt was not matched by OS alt.p8 /isodetect/altlinux: ISO alt-p8-gnome3-20180912-i586.iso.txt was not matched by OS alt.p8 /isodetect/altlinux: ISO alt-p8-gnome3-20180912-x86_64.iso.txt was not matched by OS alt.p8 /isodetect/altlinux: ISO alt-p8-gnustep-20180912-i586.iso.txt was not matched by OS alt.p8 /isodetect/altlinux: ISO alt-p8-gnustep-20180912-x86_64.iso.txt was not matched by OS alt.p8 /isodetect/altlinux: ISO alt-p8-icewm-20180912-i586.iso.txt was not matched by OS alt.p8 /isodetect/altlinux: ISO alt-p8-icewm-20180912-x86_64.iso.txt was not matched by OS alt.p8 /isodetect/altlinux: ISO alt-p8-jeos-20180912-i586.iso.txt was not matched by OS alt.p8 /isodetect/altlinux: ISO alt-p8-jeos-20180912-x86_64.iso.txt was not matched by OS alt.p8 /isodetect/altlinux: ISO alt-p8-kde4-20180912-i586.iso.txt was not matched by OS alt.p8 /isodetect/altlinux: ISO alt-p8-kde4-20180912-x86_64.iso.txt was not matched by OS alt.p8 /isodetect/altlinux: ISO alt-p8-kde5-20180912-i586.iso.txt was not matched by OS alt.p8 /isodetect/altlinux: ISO alt-p8-kde5-20180912-x86_64.iso.txt was not matched by OS alt.p8 /isodetect/altlinux: ISO alt-p8-lxde-20180912-i586.iso.txt was not matched by OS alt.p8 /isodetect/altlinux: ISO alt-p8-lxde-20180912-x86_64.iso.txt was not matched by OS alt.p8 /isodetect/altlinux: ISO alt-p8-lxqt-20180912-i586.iso.txt was not matched by OS alt.p8 /isodetect/altlinux: ISO alt-p8-lxqt-20180912-x86_64.iso.txt was not matched by OS alt.p8 /isodetect/altlinux: ISO alt-p8-mate-20180913-i586.iso.txt was not matched by OS alt.p8 /isodetect/altlinux: ISO alt-p8-mate-20180913-x86_64.iso.txt was not matched by OS alt.p8 /isodetect/altlinux: ISO alt-p8-rescue-20180912-i586.iso.txt was not matched by OS alt.p8 /isodetect/altlinux: ISO alt-p8-rescue-20180912-x86_64.iso.txt was not matched by OS alt.p8 /isodetect/altlinux: ISO alt-p8-server-20180913-i586.iso.txt was not matched by OS alt.p8 /isodetect/altlinux: ISO alt-p8-server-20180913-x86_64.iso.txt was not matched by OS alt.p8 /isodetect/altlinux: ISO alt-p8-server-pve-20180912-x86_64.iso.txt was not matched by OS alt.p8 /isodetect/altlinux: ISO alt-p8-sysv-tde-20180912-i586.iso.txt was not matched by OS alt.p8 /isodetect/altlinux: ISO alt-p8-sysv-tde-20180912-x86_64.iso.txt was not matched by OS alt.p8 /isodetect/altlinux: ISO alt-p8-sysv-xfce-20180912-i586.iso.txt was not matched by OS alt.p8 /isodetect/altlinux: ISO alt-p8-sysv-xfce-20180912-x86_64.iso.txt was not matched by OS alt.p8 /isodetect/altlinux: ISO alt-p8-wmaker-20180912-i586.iso.txt was not matched by OS alt.p8 /isodetect/altlinux: ISO alt-p8-wmaker-20180912-x86_64.iso.txt was not matched by OS alt.p8 /isodetect/altlinux: ISO alt-p8-xfce-20180912-i586.iso.txt was not matched by OS alt.p8 /isodetect/altlinux: ISO alt-p8-xfce-20180912-x86_64.iso.txt was not matched by OS alt.p8 /isodetect/altlinux: ISO regular-cinnamon-20181017-i586.iso.txt was not matched by OS alt.sisyphus /isodetect/altlinux: ISO regular-cinnamon-20181017-x86_64.iso.txt was not matched by OS alt.sisyphus /isodetect/altlinux: ISO regular-enlightenment-20181017-i586.iso.txt was not matched by OS alt.sisyphus /isodetect/altlinux: ISO regular-enlightenment-20181017-x86_64.iso.txt was not matched by OS alt.sisyphus /isodetect/altlinux: ISO regular-gnome3-20181017-i586.iso.txt was not matched by OS alt.sisyphus /isodetect/altlinux: ISO regular-gnome3-20181017-x86_64.iso.txt was not matched by OS alt.sisyphus /isodetect/altlinux: ISO regular-gnustep-20181017-i586.iso.txt was not matched by OS alt.sisyphus /isodetect/altlinux: ISO regular-gnustep-20181017-x86_64.iso.txt was not matched by OS alt.sisyphus /isodetect/altlinux: ISO regular-icewm-20181017-i586.iso.txt was not matched by OS alt.sisyphus /isodetect/altlinux: ISO regular-icewm-20181017-x86_64.iso.txt was not matched by OS alt.sisyphus /isodetect/altlinux: ISO regular-jeos-20181017-i586.iso.txt was not matched by OS alt.sisyphus /isodetect/altlinux: ISO regular-jeos-20181017-x86_64.iso.txt was not matched by OS alt.sisyphus /isodetect/altlinux: ISO regular-kde5-20181017-i586.iso.txt was not matched by OS alt.sisyphus /isodetect/altlinux: ISO regular-kde5-20181017-x86_64.iso.txt was not matched by OS alt.sisyphus /isodetect/altlinux: ISO regular-lxde-20181017-i586.iso.txt was not matched by OS alt.sisyphus /isodetect/altlinux: ISO regular-lxde-20181017-x86_64.iso.txt was not matched by OS alt.sisyphus /isodetect/altlinux: ISO regular-lxqt-20181017-i586.iso.txt was not matched by OS alt.sisyphus /isodetect/altlinux: ISO regular-lxqt-20181017-x86_64.iso.txt was not matched by OS alt.sisyphus /isodetect/altlinux: ISO regular-mate-20181017-i586.iso.txt was not matched by OS alt.sisyphus /isodetect/altlinux: ISO regular-mate-20181017-x86_64.iso.txt was not matched by OS alt.sisyphus /isodetect/altlinux: ISO regular-rescue-20181017-i586.iso.txt was not matched by OS alt.sisyphus /isodetect/altlinux: ISO regular-rescue-20181017-x86_64.iso.txt was not matched by OS alt.sisyphus /isodetect/altlinux: ISO regular-wmaker-20181017-i586.iso.txt was not matched by OS alt.sisyphus /isodetect/altlinux: ISO regular-wmaker-20181017-x86_64.iso.txt was not matched by OS alt.sisyphus /isodetect/altlinux: ISO regular-xfce-20181017-i586.iso.txt was not matched by OS alt.sisyphus /isodetect/altlinux: ISO regular-xfce-20181017-x86_64.iso.txt was not matched by OS alt.sisyphus /isodetect/altlinux: ISO alt-education-8.0-i586.iso.txt was not matched by OS alt8.0 /isodetect/altlinux: ISO alt-education-8.0-x86_64.iso.txt was not matched by OS alt8.0 /isodetect/altlinux: ISO alt-kworkstation-8.1-install-i586.iso.txt was not matched by OS alt8.1 /isodetect/altlinux: ISO alt-kworkstation-8.1-install-x86_64.iso.txt was not matched by OS alt8.1 /isodetect/altlinux: ISO alt-kworkstation-8.1-live-i586.iso.txt was not matched by OS alt8.1 /isodetect/altlinux: ISO alt-kworkstation-8.1-live-x86_64.iso.txt was not matched by OS alt8.1 /isodetect/altlinux: ISO alt-workstation-8.1-i586.iso.txt was not matched by OS alt8.1 /isodetect/altlinux: ISO alt-workstation-8.1-x86_64.iso.txt was not matched by OS alt8.1 /isodetect/altlinux: ISO alt-kworkstation-8.2-install-i586.iso.txt was not matched by OS alt8.2 /isodetect/altlinux: ISO alt-kworkstation-8.2-install-x86_64.iso.txt was not matched by OS alt8.2 /isodetect/altlinux: ISO alt-kworkstation-8.2-live-i586.iso.txt was not matched by OS alt8.2 /isodetect/altlinux: ISO alt-kworkstation-8.2-live-x86_64.iso.txt was not matched by OS alt8.2 /isodetect/altlinux: ISO alt-server-8.2-i586.iso.txt was not matched by OS alt8.2 /isodetect/altlinux: ISO alt-server-8.2-x86_64.iso.txt was not matched by OS alt8.2 /isodetect/altlinux: ISO alt-simply-8.2.0-i586.iso.txt was not matched by OS alt8.2 /isodetect/altlinux: ISO alt-simply-8.2.0-live-i586.iso.txt was not matched by OS alt8.2 /isodetect/altlinux: ISO alt-simply-8.2.0-live-x86_64.iso.txt was not matched by OS alt8.2 /isodetect/altlinux: ISO alt-simply-8.2.0-x86_64.iso.txt was not matched by OS alt8.2 /isodetect/altlinux: ISO alt-workstation-8.2-i586.iso.txt was not matched by OS alt8.2 /isodetect/altlinux: ISO alt-workstation-8.2-x86_64.iso.txt was not matched by OS alt8.2 /isodetect/altlinux: FAIL /isodetect/alpinelinux: OK FAIL test-isodetect (exit status: 1) FAIL: test-mediauris ==================== /mediauris/uris: ** ERROR:../../tests/test-mediauris.c:49:test_media: assertion failed (res == CURLE_OK): (28 == 0) FAIL test-mediauris (exit status: 134) + exit 1 Build step 'Execute shell' marked build as failure
1 2
0 0
  • ← Newer
  • 1
  • ...
  • 820
  • 821
  • 822
  • 823
  • 824
  • 825
  • 826
  • ...
  • 1022
  • Older →

HyperKitty Powered by HyperKitty version 1.3.12.