libvirt List Archives
Sign In Sign Up
Manage this list Sign In Sign Up

Keyboard Shortcuts

Thread View

  • j: Next unread message
  • k: Previous unread message
  • j a: Jump to all threads
  • j l: Jump to MailingList overview

CI

Thread Start a new thread
Download
Threads by month
  • ----- 2026 -----
  • September
  • August
  • July
  • June
  • May
  • April
  • March
  • February
  • January
  • ----- 2025 -----
  • December
  • November
  • October
  • September
  • August
  • July
  • June
  • May
  • April
  • March
  • February
  • January
  • ----- 2024 -----
  • December
  • November
  • October
  • September
  • August
  • July
  • June
  • May
  • April
  • March
  • February
  • January
  • ----- 2023 -----
  • December
  • November
  • October
  • September
  • August
  • July
  • June
  • May
  • April
  • March
  • February
  • January
  • ----- 2022 -----
  • December
  • November
  • October
  • September
  • August
  • July
  • June
  • May
  • April
  • March
  • February
  • January
  • ----- 2021 -----
  • December
  • November
  • October
  • September
  • August
  • July
  • June
  • May
  • April
  • March
  • February
  • January
  • ----- 2020 -----
  • December
  • November
  • October
  • September
  • August
  • July
  • June
  • May
  • April
  • March
  • February
  • January
  • ----- 2019 -----
  • December
  • November
  • October
  • September
  • August
  • July
  • June
  • May
  • April
  • March
  • February
  • January
  • ----- 2018 -----
  • December
  • November
  • October
  • September
  • August
  • July
  • June
  • May
  • April
  • March
  • February
  • January
  • ----- 2017 -----
  • December
  • November
  • October
  • September
  • August
  • July
  • June
  • May
  • April
  • March
  • February
  • January
  • ----- 2016 -----
  • December
  • November
  • October
  • September
  • August
  • July
ci@lists.libvirt.org

  • 2 participants
  • 10211 discussions
[Libvirt-ci] Build failed in Jenkins: libvirt-dbus-check » libvirt-freebsd-10 #69
by ci@centos.org 16 Nov '18

16 Nov '18
See <https://ci.centos.org/job/libvirt-dbus-check/systems=libvirt-freebsd-10/69/…> ------------------------------------------ Started by upstream project "libvirt-dbus-check" build number 69 originally caused by: Started by upstream project "libvirt-dbus-syntax-check" build number 112 originally caused by: Started by upstream project "libvirt-dbus-build" build number 118 originally caused by: Started by upstream project "libvirt-glib-build" build number 116 originally caused by: Started by upstream project "libvirt-build" build number 139 originally caused by: Started by an SCM change Started by an SCM change Started by an SCM change Started by an SCM change Started by an SCM change Started by an SCM change Started by an SCM change [EnvInject] - Loading node environment variables. Building remotely on libvirt-freebsd-10 (libvirt) in workspace <https://ci.centos.org/job/libvirt-dbus-check/systems=libvirt-freebsd-10/ws/> [libvirt-dbus] $ /bin/sh -xe /tmp/jenkins2181228384511820209.sh + cd build + /usr/local/bin/gmake check Making check in data gmake[1]: Entering directory '/usr<https://ci.centos.org/job/libvirt-dbus-check/systems=libvirt-freebsd-10/ws/…'> gmake[1]: Nothing to be done for 'check'. gmake[1]: Leaving directory '/usr<https://ci.centos.org/job/libvirt-dbus-check/systems=libvirt-freebsd-10/ws/…'> Making check in docs gmake[1]: Entering directory '/usr<https://ci.centos.org/job/libvirt-dbus-check/systems=libvirt-freebsd-10/ws/…'> gmake[1]: Nothing to be done for 'check'. gmake[1]: Leaving directory '/usr<https://ci.centos.org/job/libvirt-dbus-check/systems=libvirt-freebsd-10/ws/…'> Making check in src gmake[1]: Entering directory '/usr<https://ci.centos.org/job/libvirt-dbus-check/systems=libvirt-freebsd-10/ws/…'> gmake[1]: Nothing to be done for 'check'. gmake[1]: Leaving directory '/usr<https://ci.centos.org/job/libvirt-dbus-check/systems=libvirt-freebsd-10/ws/…'> Making check in tests gmake[1]: Entering directory '/usr<https://ci.centos.org/job/libvirt-dbus-check/systems=libvirt-freebsd-10/ws/…'> /usr/local/bin/gmake test_util gmake[2]: Entering directory '/usr<https://ci.centos.org/job/libvirt-dbus-check/systems=libvirt-freebsd-10/ws/…'> CC test_util-test_util.o CCLD test_util gmake[2]: Leaving directory '/usr<https://ci.centos.org/job/libvirt-dbus-check/systems=libvirt-freebsd-10/ws/…'> /usr/local/bin/gmake check-TESTS gmake[2]: Entering directory '/usr<https://ci.centos.org/job/libvirt-dbus-check/systems=libvirt-freebsd-10/ws/…'> gmake[3]: Entering directory '/usr<https://ci.centos.org/job/libvirt-dbus-check/systems=libvirt-freebsd-10/ws/…'> PASS: test_util PASS: test_interface.py PASS: test_domain.py FAIL: test_network.py PASS: test_nodedev.py PASS: test_connect.py PASS: test_storage.py ============================================================================ Testsuite summary for libvirt-dbus 1.3.0 ============================================================================ # TOTAL: 7 # PASS: 6 # SKIP: 0 # XFAIL: 0 # FAIL: 1 # XPASS: 0 # ERROR: 0 ============================================================================ See tests/test-suite.log Please report to libvir-list(a)redhat.com ============================================================================ gmake[3]: *** [Makefile:766: test-suite.log] Error 1 gmake[3]: Leaving directory '/usr<https://ci.centos.org/job/libvirt-dbus-check/systems=libvirt-freebsd-10/ws/…'> gmake[2]: *** [Makefile:874: check-TESTS] Error 2 gmake[2]: Leaving directory '/usr<https://ci.centos.org/job/libvirt-dbus-check/systems=libvirt-freebsd-10/ws/…'> gmake[1]: *** [Makefile:990: check-am] Error 2 gmake[1]: Leaving directory '/usr<https://ci.centos.org/job/libvirt-dbus-check/systems=libvirt-freebsd-10/ws/…'> gmake: *** [Makefile:460: check-recursive] Error 1 + cat tests/test-suite.log ============================================== libvirt-dbus 1.3.0: tests/test-suite.log ============================================== # TOTAL: 7 # PASS: 6 # SKIP: 0 # XFAIL: 0 # FAIL: 1 # XPASS: 0 # ERROR: 0 .. contents:: :depth: 2 FAIL: test_network.py ===================== ============================= test session starts ============================== platform freebsd10 -- Python 3.6.6, pytest-3.6.4, py-1.6.0, pluggy-0.6.0 rootdir: /usr<https://ci.centos.org/job/libvirt-dbus-check/systems=libvirt-freebsd-10/ws/,> inifile: collected 7 items ../../tests/test_network.py ......E [100%] ==================================== ERRORS ==================================== ERROR at setup of TestNetwork.test_network_update[4-4-0-\n <host mac='00:16:3e:77:e2:ed' name='foo.example.com' ip='192.168.122.10'/>\n -0] self = <test_network.TestNetwork object at 0x8095f9978> request = <SubRequest 'libvirt_dbus_setup' for <Function "test_network_update[4-4-0-\\n <host mac='00:16:3e:77:e2:ed' name='foo.example.com' ip='192.168.122.10'/>\\n -0]">> @pytest.fixture(autouse=True) def libvirt_dbus_setup(self, request): """Start libvirt-dbus for each test function """ os.environ['LIBVIRT_DEBUG'] = '3' self.libvirt_dbus = subprocess.Popen([exe, '--session']) self.bus = dbus.SessionBus() for i in range(10): if self.bus.name_has_owner('org.libvirt'): break time.sleep(0.1) else: > raise TimeoutError('error starting libvirt-dbus') E TimeoutError: error starting libvirt-dbus ../../tests/libvirttest.py:44: TimeoutError ====================== 6 passed, 1 error in 7.00 seconds ======================= FAIL test_network.py (exit status: 1) + exit 1 Build step 'Execute shell' marked build as failure
1 1
0 0
[Libvirt-ci] Build failed in Jenkins: libosinfo-check » libvirt-fedora-28 #45
by ci@centos.org 16 Nov '18

16 Nov '18
See <https://ci.centos.org/job/libosinfo-check/systems=libvirt-fedora-28/45/disp…> ------------------------------------------ Started by upstream project "libosinfo-check" build number 45 originally caused by: Started by upstream project "libosinfo-syntax-check" build number 45 originally caused by: Started by upstream project "libosinfo-build" build number 45 originally caused by: Started by upstream project "osinfo-db-build" build number 29 originally caused by: Started by an SCM change [EnvInject] - Loading node environment variables. Building remotely on libvirt-fedora-28 (libvirt) in workspace <https://ci.centos.org/job/libosinfo-check/systems=libvirt-fedora-28/ws/> [libosinfo] $ /bin/sh -xe /tmp/jenkins7985771891225783761.sh + export LIBOSINFO_NETWORK_TESTS=1 + LIBOSINFO_NETWORK_TESTS=1 + cd build + /usr/bin/gmake check GEN public-submodule-commit Making check in osinfo gmake[1]: Entering directory '<https://ci.centos.org/job/libosinfo-check/systems=libvirt-fedora-28/ws/buil…'> /usr/bin/gmake check-am gmake[2]: Entering directory '<https://ci.centos.org/job/libosinfo-check/systems=libvirt-fedora-28/ws/buil…'> /usr/bin/gmake check-local gmake[3]: Entering directory '<https://ci.centos.org/job/libosinfo-check/systems=libvirt-fedora-28/ws/buil…'> GEN check-symfile GEN check-symsorting gmake[3]: Leaving directory '<https://ci.centos.org/job/libosinfo-check/systems=libvirt-fedora-28/ws/buil…'> gmake[2]: Leaving directory '<https://ci.centos.org/job/libosinfo-check/systems=libvirt-fedora-28/ws/buil…'> gmake[1]: Leaving directory '<https://ci.centos.org/job/libosinfo-check/systems=libvirt-fedora-28/ws/buil…'> Making check in tools gmake[1]: Entering directory '<https://ci.centos.org/job/libosinfo-check/systems=libvirt-fedora-28/ws/buil…'> gmake[1]: Nothing to be done for 'check'. gmake[1]: Leaving directory '<https://ci.centos.org/job/libosinfo-check/systems=libvirt-fedora-28/ws/buil…'> Making check in docs gmake[1]: Entering directory '<https://ci.centos.org/job/libosinfo-check/systems=libvirt-fedora-28/ws/buil…'> Making check in reference gmake[2]: Entering directory '<https://ci.centos.org/job/libosinfo-check/systems=libvirt-fedora-28/ws/buil…'> gmake[2]: Nothing to be done for 'check'. gmake[2]: Leaving directory '<https://ci.centos.org/job/libosinfo-check/systems=libvirt-fedora-28/ws/buil…'> gmake[2]: Entering directory '<https://ci.centos.org/job/libosinfo-check/systems=libvirt-fedora-28/ws/buil…'> gmake[2]: Nothing to be done for 'check-am'. gmake[2]: Leaving directory '<https://ci.centos.org/job/libosinfo-check/systems=libvirt-fedora-28/ws/buil…'> gmake[1]: Leaving directory '<https://ci.centos.org/job/libosinfo-check/systems=libvirt-fedora-28/ws/buil…'> Making check in po gmake[1]: Entering directory '<https://ci.centos.org/job/libosinfo-check/systems=libvirt-fedora-28/ws/buil…'> INTLTOOL_EXTRACT="/usr/bin/intltool-extract" XGETTEXT="/usr/bin/xgettext" srcdir=../../po /usr/bin/intltool-update --gettext-package libosinfo --pot rm -f missing notexist srcdir=../../po /usr/bin/intltool-update -m if [ -r missing -o -r notexist ]; then \ exit 1; \ fi gmake[1]: Leaving directory '<https://ci.centos.org/job/libosinfo-check/systems=libvirt-fedora-28/ws/buil…'> Making check in examples gmake[1]: Entering directory '<https://ci.centos.org/job/libosinfo-check/systems=libvirt-fedora-28/ws/buil…'> gmake[1]: Nothing to be done for 'check'. gmake[1]: Leaving directory '<https://ci.centos.org/job/libosinfo-check/systems=libvirt-fedora-28/ws/buil…'> Making check in tests gmake[1]: Entering directory '<https://ci.centos.org/job/libosinfo-check/systems=libvirt-fedora-28/ws/buil…'> /usr/bin/gmake test-entity test-device test-list test-devicelist test-filter test-product test-os test-oslist test-productfilter test-platform test-platformlist test-db test-loader test-isodetect test-install-script test-mediauris test-treeuris gmake[2]: Entering directory '<https://ci.centos.org/job/libosinfo-check/systems=libvirt-fedora-28/ws/buil…'> CC test_device-test-device.o CC test_list-test-list.o CC test_entity-test-entity.o CC test_devicelist-test-devicelist.o CC test_filter-test-filter.o CC test_product-test-product.o CC test_os-test-os.o CC test_oslist-test-oslist.o CC test_productfilter-test-productfilter.o CC test_platform-test-platform.o CC test_platformlist-test-platformlist.o CC test_db-test-db.o CC test_isodetect-test-isodetect.o CC test_loader-test-loader.o CC test_install_script-test-install-script.o CC test_mediauris-test-mediauris.o CC test_treeuris-test-treeuris.o CCLD test-entity CCLD test-device CCLD test-list CCLD test-devicelist CCLD test-filter CCLD test-product CCLD test-os CCLD test-oslist CCLD test-productfilter CCLD test-platform CCLD test-platformlist CCLD test-db CCLD test-loader CCLD test-isodetect CCLD test-install-script CCLD test-mediauris CCLD test-treeuris gmake[2]: Leaving directory '<https://ci.centos.org/job/libosinfo-check/systems=libvirt-fedora-28/ws/buil…'> /usr/bin/gmake check-TESTS gmake[2]: Entering directory '<https://ci.centos.org/job/libosinfo-check/systems=libvirt-fedora-28/ws/buil…'> gmake[3]: Entering directory '<https://ci.centos.org/job/libosinfo-check/systems=libvirt-fedora-28/ws/buil…'> PASS: test-list PASS: test-device PASS: test-entity PASS: test-filter PASS: test-devicelist PASS: test-product PASS: test-oslist PASS: test-productfilter PASS: test-platform PASS: test-platformlist PASS: test-db PASS: test-os PASS: test-install-script PASS: test-loader PASS: test-treeuris PASS: test-isodetect FAIL: test-mediauris ============================================================================ Testsuite summary for libosinfo 1.3.0 ============================================================================ # TOTAL: 17 # PASS: 16 # SKIP: 0 # XFAIL: 0 # FAIL: 1 # XPASS: 0 # ERROR: 0 ============================================================================ See tests/test-suite.log Please report to libosinfo(a)redhat.com ============================================================================ gmake[3]: *** [Makefile:1257: test-suite.log] Error 1 gmake[3]: Leaving directory '<https://ci.centos.org/job/libosinfo-check/systems=libvirt-fedora-28/ws/buil…'> gmake[2]: *** [Makefile:1365: check-TESTS] Error 2 gmake[2]: Leaving directory '<https://ci.centos.org/job/libosinfo-check/systems=libvirt-fedora-28/ws/buil…'> gmake[1]: *** [Makefile:1548: check-am] Error 2 gmake[1]: Leaving directory '<https://ci.centos.org/job/libosinfo-check/systems=libvirt-fedora-28/ws/buil…'> gmake: *** [Makefile:594: check-recursive] Error 1 + cat tests/test-suite.log =========================================== libosinfo 1.3.0: tests/test-suite.log =========================================== # TOTAL: 17 # PASS: 16 # SKIP: 0 # XFAIL: 0 # FAIL: 1 # XPASS: 0 # ERROR: 0 .. contents:: :depth: 2 FAIL: test-mediauris ==================== /mediauris/uris: ** ERROR:../../tests/test-mediauris.c:49:test_media: assertion failed (res == CURLE_OK): (7 == 0) FAIL FAIL test-mediauris (exit status: 1) + exit 1 Build step 'Execute shell' marked build as failure
1 1
0 0
[Libvirt-ci] Build failed in Jenkins: libosinfo-check » libvirt-debian-8 #36
by ci@centos.org 16 Nov '18

16 Nov '18
See <https://ci.centos.org/job/libosinfo-check/systems=libvirt-debian-8/36/displ…> ------------------------------------------ Started by upstream project "libosinfo-check" build number 36 originally caused by: Started by upstream project "libosinfo-syntax-check" build number 36 originally caused by: Started by upstream project "libosinfo-build" build number 36 originally caused by: Started by upstream project "osinfo-db-build" build number 23 originally caused by: Started by an SCM change [EnvInject] - Loading node environment variables. Building remotely on libvirt-debian-8 (libvirt) in workspace <https://ci.centos.org/job/libosinfo-check/systems=libvirt-debian-8/ws/> [libosinfo] $ /bin/sh -xe /tmp/jenkins1163545527749578876.sh + export LIBOSINFO_NETWORK_TESTS=1 + cd build + /usr/bin/make check GEN public-submodule-commit Making check in osinfo make[1]: Entering directory '<https://ci.centos.org/job/libosinfo-check/systems=libvirt-debian-8/ws/build…'> /usr/bin/make check-am make[2]: Entering directory '<https://ci.centos.org/job/libosinfo-check/systems=libvirt-debian-8/ws/build…'> /usr/bin/make check-local make[3]: Entering directory '<https://ci.centos.org/job/libosinfo-check/systems=libvirt-debian-8/ws/build…'> GEN check-symfile GEN check-symsorting make[3]: Leaving directory '<https://ci.centos.org/job/libosinfo-check/systems=libvirt-debian-8/ws/build…'> make[2]: Leaving directory '<https://ci.centos.org/job/libosinfo-check/systems=libvirt-debian-8/ws/build…'> make[1]: Leaving directory '<https://ci.centos.org/job/libosinfo-check/systems=libvirt-debian-8/ws/build…'> Making check in tools make[1]: Entering directory '<https://ci.centos.org/job/libosinfo-check/systems=libvirt-debian-8/ws/build…'> make[1]: Nothing to be done for 'check'. make[1]: Leaving directory '<https://ci.centos.org/job/libosinfo-check/systems=libvirt-debian-8/ws/build…'> Making check in docs make[1]: Entering directory '<https://ci.centos.org/job/libosinfo-check/systems=libvirt-debian-8/ws/build…'> Making check in reference make[2]: Entering directory '<https://ci.centos.org/job/libosinfo-check/systems=libvirt-debian-8/ws/build…'> make[2]: Nothing to be done for 'check'. make[2]: Leaving directory '<https://ci.centos.org/job/libosinfo-check/systems=libvirt-debian-8/ws/build…'> make[2]: Entering directory '<https://ci.centos.org/job/libosinfo-check/systems=libvirt-debian-8/ws/build…'> make[2]: Nothing to be done for 'check-am'. make[2]: Leaving directory '<https://ci.centos.org/job/libosinfo-check/systems=libvirt-debian-8/ws/build…'> make[1]: Leaving directory '<https://ci.centos.org/job/libosinfo-check/systems=libvirt-debian-8/ws/build…'> Making check in po make[1]: Entering directory '<https://ci.centos.org/job/libosinfo-check/systems=libvirt-debian-8/ws/build…'> INTLTOOL_EXTRACT="/usr/bin/intltool-extract" XGETTEXT="/usr/bin/xgettext" srcdir=../../po /usr/bin/intltool-update --gettext-package libosinfo --pot rm -f missing notexist srcdir=../../po /usr/bin/intltool-update -m if [ -r missing -o -r notexist ]; then \ exit 1; \ fi make[1]: Leaving directory '<https://ci.centos.org/job/libosinfo-check/systems=libvirt-debian-8/ws/build…'> Making check in examples make[1]: Entering directory '<https://ci.centos.org/job/libosinfo-check/systems=libvirt-debian-8/ws/build…'> make[1]: Nothing to be done for 'check'. make[1]: Leaving directory '<https://ci.centos.org/job/libosinfo-check/systems=libvirt-debian-8/ws/build…'> Making check in tests make[1]: Entering directory '<https://ci.centos.org/job/libosinfo-check/systems=libvirt-debian-8/ws/build…'> /usr/bin/make test-entity test-device test-list test-devicelist test-filter test-product test-os test-oslist test-productfilter test-platform test-platformlist test-db test-loader test-isodetect test-install-script test-os-resources test-mediauris test-treeuris make[2]: Entering directory '<https://ci.centos.org/job/libosinfo-check/systems=libvirt-debian-8/ws/build…'> CC test_list-test-list.o CC test_entity-test-entity.o CC test_device-test-device.o CC test_filter-test-filter.o CC test_devicelist-test-devicelist.o CC test_product-test-product.o CC test_os-test-os.o CC test_oslist-test-oslist.o CC test_productfilter-test-productfilter.o CC test_platform-test-platform.o CC test_platformlist-test-platformlist.o CC test_db-test-db.o CC test_isodetect-test-isodetect.o CC test_loader-test-loader.o CC test_install_script-test-install-script.o CC test_os_resources-test-os-resources.o CC test_mediauris-test-mediauris.o CC test_treeuris-test-treeuris.o CCLD test-entity CCLD test-device CCLD test-list CCLD test-devicelist CCLD test-filter CCLD test-product CCLD test-os CCLD test-oslist CCLD test-productfilter CCLD test-platform CCLD test-platformlist CCLD test-db CCLD test-loader CCLD test-isodetect CCLD test-install-script CCLD test-os-resources CCLD test-mediauris CCLD test-treeuris make[2]: Leaving directory '<https://ci.centos.org/job/libosinfo-check/systems=libvirt-debian-8/ws/build…'> /usr/bin/make check-TESTS make[2]: Entering directory '<https://ci.centos.org/job/libosinfo-check/systems=libvirt-debian-8/ws/build…'> make[3]: Entering directory '<https://ci.centos.org/job/libosinfo-check/systems=libvirt-debian-8/ws/build…'> PASS: test-list PASS: test-device PASS: test-entity PASS: test-filter PASS: test-devicelist PASS: test-os PASS: test-product PASS: test-productfilter PASS: test-oslist PASS: test-platform PASS: test-platformlist PASS: test-db PASS: test-install-script PASS: test-loader PASS: test-os-resources PASS: test-treeuris PASS: test-isodetect FAIL: test-mediauris make[4]: Entering directory '<https://ci.centos.org/job/libosinfo-check/systems=libvirt-debian-8/ws/build…'> make[4]: Nothing to be done for 'all'. make[4]: Leaving directory '<https://ci.centos.org/job/libosinfo-check/systems=libvirt-debian-8/ws/build…'> ============================================================================ Testsuite summary for libosinfo 1.3.0 ============================================================================ # TOTAL: 18 # PASS: 17 # SKIP: 0 # XFAIL: 0 # FAIL: 1 # XPASS: 0 # ERROR: 0 ============================================================================ See tests/test-suite.log Please report to libosinfo(a)redhat.com ============================================================================ Makefile:1279: recipe for target 'test-suite.log' failed make[3]: *** [test-suite.log] Error 1 make[3]: Leaving directory '<https://ci.centos.org/job/libosinfo-check/systems=libvirt-debian-8/ws/build…'> Makefile:1385: recipe for target 'check-TESTS' failed make[2]: *** [check-TESTS] Error 2 make[2]: Leaving directory '<https://ci.centos.org/job/libosinfo-check/systems=libvirt-debian-8/ws/build…'> Makefile:1577: recipe for target 'check-am' failed make[1]: *** [check-am] Error 2 make[1]: Leaving directory '<https://ci.centos.org/job/libosinfo-check/systems=libvirt-debian-8/ws/build…'> Makefile:585: recipe for target 'check-recursive' failed make: *** [check-recursive] Error 1 + cat tests/test-suite.log =========================================== libosinfo 1.3.0: tests/test-suite.log =========================================== # TOTAL: 18 # PASS: 17 # SKIP: 0 # XFAIL: 0 # FAIL: 1 # XPASS: 0 # ERROR: 0 .. contents:: :depth: 2 FAIL: test-mediauris ==================== /mediauris/uris: ** ERROR:../../tests/test-mediauris.c:49:test_media: assertion failed (res == CURLE_OK): (22 == 0) ** ERROR:../../tests/test-mediauris.c:49:test_media: assertion failed (res == CURLE_OK): (22 == 0) ** ERROR:../../tests/test-mediauris.c:49:test_media: assertion failed (res == CURLE_OK): (22 == 0) ** ERROR:../../tests/test-mediauris.c:49:test_media: assertion failed (res == CURLE_OK): (22 == 0) ** ERROR:../../tests/test-mediauris.c:49:test_media: assertion failed (res == CURLE_OK): (22 == 0) FAIL + exit 1 Build step 'Execute shell' marked build as failure
1 9
0 0
[Libvirt-ci] Build failed in Jenkins: libosinfo-check » libvirt-debian-9 #36
by ci@centos.org 16 Nov '18

16 Nov '18
See <https://ci.centos.org/job/libosinfo-check/systems=libvirt-debian-9/36/displ…> ------------------------------------------ Started by upstream project "libosinfo-check" build number 36 originally caused by: Started by upstream project "libosinfo-syntax-check" build number 36 originally caused by: Started by upstream project "libosinfo-build" build number 36 originally caused by: Started by upstream project "osinfo-db-build" build number 23 originally caused by: Started by an SCM change [EnvInject] - Loading node environment variables. Building remotely on libvirt-debian-9 (libvirt) in workspace <https://ci.centos.org/job/libosinfo-check/systems=libvirt-debian-9/ws/> [libosinfo] $ /bin/sh -xe /tmp/jenkins8690606813150493904.sh + export LIBOSINFO_NETWORK_TESTS=1 + cd build + /usr/bin/make check GEN public-submodule-commit Making check in osinfo make[1]: Entering directory '<https://ci.centos.org/job/libosinfo-check/systems=libvirt-debian-9/ws/build…'> /usr/bin/make check-am make[2]: Entering directory '<https://ci.centos.org/job/libosinfo-check/systems=libvirt-debian-9/ws/build…'> /usr/bin/make check-local make[3]: Entering directory '<https://ci.centos.org/job/libosinfo-check/systems=libvirt-debian-9/ws/build…'> GEN check-symfile GEN check-symsorting make[3]: Leaving directory '<https://ci.centos.org/job/libosinfo-check/systems=libvirt-debian-9/ws/build…'> make[2]: Leaving directory '<https://ci.centos.org/job/libosinfo-check/systems=libvirt-debian-9/ws/build…'> make[1]: Leaving directory '<https://ci.centos.org/job/libosinfo-check/systems=libvirt-debian-9/ws/build…'> Making check in tools make[1]: Entering directory '<https://ci.centos.org/job/libosinfo-check/systems=libvirt-debian-9/ws/build…'> make[1]: Nothing to be done for 'check'. make[1]: Leaving directory '<https://ci.centos.org/job/libosinfo-check/systems=libvirt-debian-9/ws/build…'> Making check in docs make[1]: Entering directory '<https://ci.centos.org/job/libosinfo-check/systems=libvirt-debian-9/ws/build…'> Making check in reference make[2]: Entering directory '<https://ci.centos.org/job/libosinfo-check/systems=libvirt-debian-9/ws/build…'> make[2]: Nothing to be done for 'check'. make[2]: Leaving directory '<https://ci.centos.org/job/libosinfo-check/systems=libvirt-debian-9/ws/build…'> make[2]: Entering directory '<https://ci.centos.org/job/libosinfo-check/systems=libvirt-debian-9/ws/build…'> make[2]: Nothing to be done for 'check-am'. make[2]: Leaving directory '<https://ci.centos.org/job/libosinfo-check/systems=libvirt-debian-9/ws/build…'> make[1]: Leaving directory '<https://ci.centos.org/job/libosinfo-check/systems=libvirt-debian-9/ws/build…'> Making check in po make[1]: Entering directory '<https://ci.centos.org/job/libosinfo-check/systems=libvirt-debian-9/ws/build…'> INTLTOOL_EXTRACT="/usr/bin/intltool-extract" XGETTEXT="/usr/bin/xgettext" srcdir=../../po /usr/bin/intltool-update --gettext-package libosinfo --pot rm -f missing notexist srcdir=../../po /usr/bin/intltool-update -m Unescaped left brace in regex is deprecated, passed through in regex; marked by <-- HERE in m/\${ <-- HERE ?PACKAGE_NAME}?/ at /usr/bin/intltool-update line 1071, <CONF> line 295. if [ -r missing -o -r notexist ]; then \ exit 1; \ fi make[1]: Leaving directory '<https://ci.centos.org/job/libosinfo-check/systems=libvirt-debian-9/ws/build…'> Making check in examples make[1]: Entering directory '<https://ci.centos.org/job/libosinfo-check/systems=libvirt-debian-9/ws/build…'> make[1]: Nothing to be done for 'check'. make[1]: Leaving directory '<https://ci.centos.org/job/libosinfo-check/systems=libvirt-debian-9/ws/build…'> Making check in tests make[1]: Entering directory '<https://ci.centos.org/job/libosinfo-check/systems=libvirt-debian-9/ws/build…'> /usr/bin/make test-entity test-device test-list test-devicelist test-filter test-product test-os test-oslist test-productfilter test-platform test-platformlist test-db test-loader test-isodetect test-install-script test-os-resources test-mediauris test-treeuris make[2]: Entering directory '<https://ci.centos.org/job/libosinfo-check/systems=libvirt-debian-9/ws/build…'> CC test_list-test-list.o CC test_device-test-device.o CC test_entity-test-entity.o CC test_devicelist-test-devicelist.o CC test_filter-test-filter.o CC test_product-test-product.o CC test_os-test-os.o CC test_oslist-test-oslist.o CC test_productfilter-test-productfilter.o CC test_platform-test-platform.o CC test_platformlist-test-platformlist.o CC test_loader-test-loader.o CC test_db-test-db.o CC test_isodetect-test-isodetect.o CC test_install_script-test-install-script.o CC test_os_resources-test-os-resources.o CC test_mediauris-test-mediauris.o CC test_treeuris-test-treeuris.o CCLD test-entity CCLD test-device CCLD test-list CCLD test-devicelist CCLD test-filter CCLD test-product CCLD test-os CCLD test-oslist CCLD test-productfilter CCLD test-platform CCLD test-platformlist CCLD test-db CCLD test-loader CCLD test-isodetect CCLD test-install-script CCLD test-os-resources CCLD test-mediauris CCLD test-treeuris make[2]: Leaving directory '<https://ci.centos.org/job/libosinfo-check/systems=libvirt-debian-9/ws/build…'> /usr/bin/make check-TESTS make[2]: Entering directory '<https://ci.centos.org/job/libosinfo-check/systems=libvirt-debian-9/ws/build…'> make[3]: Entering directory '<https://ci.centos.org/job/libosinfo-check/systems=libvirt-debian-9/ws/build…'> PASS: test-entity PASS: test-list PASS: test-devicelist PASS: test-device PASS: test-filter PASS: test-product PASS: test-os PASS: test-productfilter PASS: test-oslist PASS: test-platform PASS: test-platformlist PASS: test-db PASS: test-install-script PASS: test-loader PASS: test-os-resources PASS: test-treeuris PASS: test-isodetect FAIL: test-mediauris ============================================================================ Testsuite summary for libosinfo 1.3.0 ============================================================================ # TOTAL: 18 # PASS: 17 # SKIP: 0 # XFAIL: 0 # FAIL: 1 # XPASS: 0 # ERROR: 0 ============================================================================ See tests/test-suite.log Please report to libosinfo(a)redhat.com ============================================================================ Makefile:1289: recipe for target 'test-suite.log' failed make[3]: *** [test-suite.log] Error 1 make[3]: Leaving directory '<https://ci.centos.org/job/libosinfo-check/systems=libvirt-debian-9/ws/build…'> Makefile:1395: recipe for target 'check-TESTS' failed make[2]: *** [check-TESTS] Error 2 make[2]: Leaving directory '<https://ci.centos.org/job/libosinfo-check/systems=libvirt-debian-9/ws/build…'> Makefile:1587: recipe for target 'check-am' failed make[1]: *** [check-am] Error 2 make[1]: Leaving directory '<https://ci.centos.org/job/libosinfo-check/systems=libvirt-debian-9/ws/build…'> Makefile:595: recipe for target 'check-recursive' failed make: *** [check-recursive] Error 1 + cat tests/test-suite.log =========================================== libosinfo 1.3.0: tests/test-suite.log =========================================== # TOTAL: 18 # PASS: 17 # SKIP: 0 # XFAIL: 0 # FAIL: 1 # XPASS: 0 # ERROR: 0 .. contents:: :depth: 2 FAIL: test-mediauris ==================== /mediauris/uris: ** ERROR:../../tests/test-mediauris.c:49:test_media: assertion failed (res == CURLE_OK): (22 == 0) ** ERROR:../../tests/test-mediauris.c:49:test_media: assertion failed (res == CURLE_OK): (22 == 0) ** ERROR:../../tests/test-mediauris.c:49:test_media: assertion failed (res == CURLE_OK): (22 == 0) ** ERROR:../../tests/test-mediauris.c:49:test_media: assertion failed (res == CURLE_OK): (22 == 0) ** ERROR:../../tests/test-mediauris.c:49:test_media: assertion failed (res == CURLE_OK): (22 == 0) FAIL FAIL test-mediauris (exit status: 1) + exit 1 Build step 'Execute shell' marked build as failure
1 8
0 0
[Libvirt-ci] Build failed in Jenkins: libosinfo-check » libvirt-fedora-rawhide #36
by ci@centos.org 16 Nov '18

16 Nov '18
See <https://ci.centos.org/job/libosinfo-check/systems=libvirt-fedora-rawhide/36…> ------------------------------------------ Started by upstream project "libosinfo-check" build number 36 originally caused by: Started by upstream project "libosinfo-syntax-check" build number 36 originally caused by: Started by upstream project "libosinfo-build" build number 36 originally caused by: Started by upstream project "osinfo-db-build" build number 23 originally caused by: Started by an SCM change [EnvInject] - Loading node environment variables. Building remotely on libvirt-fedora-rawhide (libvirt) in workspace <https://ci.centos.org/job/libosinfo-check/systems=libvirt-fedora-rawhide/ws/> [libosinfo] $ /bin/sh -xe /tmp/jenkins7027878283437556790.sh + export LIBOSINFO_NETWORK_TESTS=1 + LIBOSINFO_NETWORK_TESTS=1 + cd build + /usr/bin/gmake check GEN public-submodule-commit Making check in osinfo gmake[1]: Entering directory '<https://ci.centos.org/job/libosinfo-check/systems=libvirt-fedora-rawhide/ws…'> /usr/bin/gmake check-am gmake[2]: Entering directory '<https://ci.centos.org/job/libosinfo-check/systems=libvirt-fedora-rawhide/ws…'> /usr/bin/gmake check-local gmake[3]: Entering directory '<https://ci.centos.org/job/libosinfo-check/systems=libvirt-fedora-rawhide/ws…'> GEN check-symfile GEN check-symsorting gmake[3]: Leaving directory '<https://ci.centos.org/job/libosinfo-check/systems=libvirt-fedora-rawhide/ws…'> gmake[2]: Leaving directory '<https://ci.centos.org/job/libosinfo-check/systems=libvirt-fedora-rawhide/ws…'> gmake[1]: Leaving directory '<https://ci.centos.org/job/libosinfo-check/systems=libvirt-fedora-rawhide/ws…'> Making check in tools gmake[1]: Entering directory '<https://ci.centos.org/job/libosinfo-check/systems=libvirt-fedora-rawhide/ws…'> gmake[1]: Nothing to be done for 'check'. gmake[1]: Leaving directory '<https://ci.centos.org/job/libosinfo-check/systems=libvirt-fedora-rawhide/ws…'> Making check in docs gmake[1]: Entering directory '<https://ci.centos.org/job/libosinfo-check/systems=libvirt-fedora-rawhide/ws…'> Making check in reference gmake[2]: Entering directory '<https://ci.centos.org/job/libosinfo-check/systems=libvirt-fedora-rawhide/ws…'> gmake[2]: Nothing to be done for 'check'. gmake[2]: Leaving directory '<https://ci.centos.org/job/libosinfo-check/systems=libvirt-fedora-rawhide/ws…'> gmake[2]: Entering directory '<https://ci.centos.org/job/libosinfo-check/systems=libvirt-fedora-rawhide/ws…'> gmake[2]: Nothing to be done for 'check-am'. gmake[2]: Leaving directory '<https://ci.centos.org/job/libosinfo-check/systems=libvirt-fedora-rawhide/ws…'> gmake[1]: Leaving directory '<https://ci.centos.org/job/libosinfo-check/systems=libvirt-fedora-rawhide/ws…'> Making check in po gmake[1]: Entering directory '<https://ci.centos.org/job/libosinfo-check/systems=libvirt-fedora-rawhide/ws…'> INTLTOOL_EXTRACT="/usr/bin/intltool-extract" XGETTEXT="/usr/bin/xgettext" srcdir=../../po /usr/bin/intltool-update --gettext-package libosinfo --pot rm -f missing notexist srcdir=../../po /usr/bin/intltool-update -m if [ -r missing -o -r notexist ]; then \ exit 1; \ fi gmake[1]: Leaving directory '<https://ci.centos.org/job/libosinfo-check/systems=libvirt-fedora-rawhide/ws…'> Making check in examples gmake[1]: Entering directory '<https://ci.centos.org/job/libosinfo-check/systems=libvirt-fedora-rawhide/ws…'> gmake[1]: Nothing to be done for 'check'. gmake[1]: Leaving directory '<https://ci.centos.org/job/libosinfo-check/systems=libvirt-fedora-rawhide/ws…'> Making check in tests gmake[1]: Entering directory '<https://ci.centos.org/job/libosinfo-check/systems=libvirt-fedora-rawhide/ws…'> /usr/bin/gmake test-entity test-device test-list test-devicelist test-filter test-product test-os test-oslist test-productfilter test-platform test-platformlist test-db test-loader test-isodetect test-install-script test-os-resources test-mediauris test-treeuris gmake[2]: Entering directory '<https://ci.centos.org/job/libosinfo-check/systems=libvirt-fedora-rawhide/ws…'> CC test_device-test-device.o CC test_entity-test-entity.o CC test_list-test-list.o CC test_devicelist-test-devicelist.o CC test_filter-test-filter.o CC test_product-test-product.o CC test_os-test-os.o CC test_oslist-test-oslist.o CC test_productfilter-test-productfilter.o CC test_platformlist-test-platformlist.o CC test_platform-test-platform.o CC test_db-test-db.o CC test_loader-test-loader.o CC test_isodetect-test-isodetect.o CC test_install_script-test-install-script.o CC test_os_resources-test-os-resources.o CC test_mediauris-test-mediauris.o CC test_treeuris-test-treeuris.o CCLD test-entity CCLD test-device CCLD test-list CCLD test-devicelist CCLD test-filter CCLD test-product CCLD test-os CCLD test-oslist CCLD test-productfilter CCLD test-platform CCLD test-platformlist CCLD test-db CCLD test-loader CCLD test-isodetect CCLD test-install-script CCLD test-os-resources CCLD test-mediauris CCLD test-treeuris gmake[2]: Leaving directory '<https://ci.centos.org/job/libosinfo-check/systems=libvirt-fedora-rawhide/ws…'> /usr/bin/gmake check-TESTS gmake[2]: Entering directory '<https://ci.centos.org/job/libosinfo-check/systems=libvirt-fedora-rawhide/ws…'> gmake[3]: Entering directory '<https://ci.centos.org/job/libosinfo-check/systems=libvirt-fedora-rawhide/ws…'> PASS: test-entity PASS: test-list PASS: test-devicelist PASS: test-device PASS: test-filter PASS: test-product PASS: test-os PASS: test-oslist PASS: test-productfilter PASS: test-platform PASS: test-platformlist PASS: test-db PASS: test-install-script PASS: test-loader PASS: test-os-resources PASS: test-treeuris PASS: test-isodetect FAIL: test-mediauris ============================================================================ Testsuite summary for libosinfo 1.3.0 ============================================================================ # TOTAL: 18 # PASS: 17 # SKIP: 0 # XFAIL: 0 # FAIL: 1 # XPASS: 0 # ERROR: 0 ============================================================================ See tests/test-suite.log Please report to libosinfo(a)redhat.com ============================================================================ gmake[3]: *** [Makefile:1313: test-suite.log] Error 1 gmake[3]: Leaving directory '<https://ci.centos.org/job/libosinfo-check/systems=libvirt-fedora-rawhide/ws…'> gmake[2]: *** [Makefile:1421: check-TESTS] Error 2 gmake[2]: Leaving directory '<https://ci.centos.org/job/libosinfo-check/systems=libvirt-fedora-rawhide/ws…'> gmake[1]: *** [Makefile:1614: check-am] Error 2 gmake[1]: Leaving directory '<https://ci.centos.org/job/libosinfo-check/systems=libvirt-fedora-rawhide/ws…'> gmake: *** [Makefile:594: check-recursive] Error 1 + cat tests/test-suite.log =========================================== libosinfo 1.3.0: tests/test-suite.log =========================================== # TOTAL: 18 # PASS: 17 # SKIP: 0 # XFAIL: 0 # FAIL: 1 # XPASS: 0 # ERROR: 0 .. contents:: :depth: 2 FAIL: test-mediauris ==================== /mediauris/uris: ** ERROR:../../tests/test-mediauris.c:49:test_media: assertion failed (res == CURLE_OK): (22 == 0) ** ERROR:../../tests/test-mediauris.c:49:test_media: assertion failed (res == CURLE_OK): (22 == 0) ** ERROR:../../tests/test-mediauris.c:49:test_media: assertion failed (res == CURLE_OK): (22 == 0) ** ERROR:../../tests/test-mediauris.c:49:test_media: assertion failed (res == CURLE_OK): (22 == 0) ** ERROR:../../tests/test-mediauris.c:49:test_media: assertion failed (res == CURLE_OK): (22 == 0) FAIL FAIL test-mediauris (exit status: 1) + exit 1 Build step 'Execute shell' marked build as failure
1 8
0 0
[Libvirt-ci] Build failed in Jenkins: libosinfo-check » libvirt-fedora-29 #41
by ci@centos.org 16 Nov '18

16 Nov '18
See <https://ci.centos.org/job/libosinfo-check/systems=libvirt-fedora-29/41/disp…> ------------------------------------------ Started by upstream project "libosinfo-check" build number 41 originally caused by: Started by upstream project "libosinfo-syntax-check" build number 41 originally caused by: Started by upstream project "libosinfo-build" build number 41 originally caused by: Started by an SCM change [EnvInject] - Loading node environment variables. Building remotely on libvirt-fedora-29 (libvirt) in workspace <https://ci.centos.org/job/libosinfo-check/systems=libvirt-fedora-29/ws/> [libosinfo] $ /bin/sh -xe /tmp/jenkins3243873929818850744.sh + export LIBOSINFO_NETWORK_TESTS=1 + LIBOSINFO_NETWORK_TESTS=1 + cd build + /usr/bin/gmake check GEN public-submodule-commit Making check in osinfo gmake[1]: Entering directory '<https://ci.centos.org/job/libosinfo-check/systems=libvirt-fedora-29/ws/buil…'> /usr/bin/gmake check-am gmake[2]: Entering directory '<https://ci.centos.org/job/libosinfo-check/systems=libvirt-fedora-29/ws/buil…'> /usr/bin/gmake check-local gmake[3]: Entering directory '<https://ci.centos.org/job/libosinfo-check/systems=libvirt-fedora-29/ws/buil…'> GEN check-symfile GEN check-symsorting gmake[3]: Leaving directory '<https://ci.centos.org/job/libosinfo-check/systems=libvirt-fedora-29/ws/buil…'> gmake[2]: Leaving directory '<https://ci.centos.org/job/libosinfo-check/systems=libvirt-fedora-29/ws/buil…'> gmake[1]: Leaving directory '<https://ci.centos.org/job/libosinfo-check/systems=libvirt-fedora-29/ws/buil…'> Making check in tools gmake[1]: Entering directory '<https://ci.centos.org/job/libosinfo-check/systems=libvirt-fedora-29/ws/buil…'> gmake[1]: Nothing to be done for 'check'. gmake[1]: Leaving directory '<https://ci.centos.org/job/libosinfo-check/systems=libvirt-fedora-29/ws/buil…'> Making check in docs gmake[1]: Entering directory '<https://ci.centos.org/job/libosinfo-check/systems=libvirt-fedora-29/ws/buil…'> Making check in reference gmake[2]: Entering directory '<https://ci.centos.org/job/libosinfo-check/systems=libvirt-fedora-29/ws/buil…'> gmake[2]: Nothing to be done for 'check'. gmake[2]: Leaving directory '<https://ci.centos.org/job/libosinfo-check/systems=libvirt-fedora-29/ws/buil…'> gmake[2]: Entering directory '<https://ci.centos.org/job/libosinfo-check/systems=libvirt-fedora-29/ws/buil…'> gmake[2]: Nothing to be done for 'check-am'. gmake[2]: Leaving directory '<https://ci.centos.org/job/libosinfo-check/systems=libvirt-fedora-29/ws/buil…'> gmake[1]: Leaving directory '<https://ci.centos.org/job/libosinfo-check/systems=libvirt-fedora-29/ws/buil…'> Making check in po gmake[1]: Entering directory '<https://ci.centos.org/job/libosinfo-check/systems=libvirt-fedora-29/ws/buil…'> INTLTOOL_EXTRACT="/usr/bin/intltool-extract" XGETTEXT="/usr/bin/xgettext" srcdir=../../po /usr/bin/intltool-update --gettext-package libosinfo --pot rm -f missing notexist srcdir=../../po /usr/bin/intltool-update -m if [ -r missing -o -r notexist ]; then \ exit 1; \ fi gmake[1]: Leaving directory '<https://ci.centos.org/job/libosinfo-check/systems=libvirt-fedora-29/ws/buil…'> Making check in examples gmake[1]: Entering directory '<https://ci.centos.org/job/libosinfo-check/systems=libvirt-fedora-29/ws/buil…'> gmake[1]: Nothing to be done for 'check'. gmake[1]: Leaving directory '<https://ci.centos.org/job/libosinfo-check/systems=libvirt-fedora-29/ws/buil…'> Making check in tests gmake[1]: Entering directory '<https://ci.centos.org/job/libosinfo-check/systems=libvirt-fedora-29/ws/buil…'> /usr/bin/gmake test-entity test-device test-list test-devicelist test-filter test-product test-os test-oslist test-productfilter test-platform test-platformlist test-db test-loader test-isodetect test-install-script test-os-resources test-mediauris test-treeuris gmake[2]: Entering directory '<https://ci.centos.org/job/libosinfo-check/systems=libvirt-fedora-29/ws/buil…'> CC test_entity-test-entity.o CC test_device-test-device.o CC test_list-test-list.o CC test_devicelist-test-devicelist.o CC test_filter-test-filter.o CC test_product-test-product.o CC test_os-test-os.o CC test_oslist-test-oslist.o CC test_productfilter-test-productfilter.o CC test_platform-test-platform.o CC test_platformlist-test-platformlist.o CC test_db-test-db.o CC test_loader-test-loader.o CC test_isodetect-test-isodetect.o CC test_install_script-test-install-script.o CC test_os_resources-test-os-resources.o CC test_mediauris-test-mediauris.o CC test_treeuris-test-treeuris.o CCLD test-entity CCLD test-device CCLD test-list CCLD test-devicelist CCLD test-filter CCLD test-product CCLD test-os CCLD test-oslist CCLD test-productfilter CCLD test-platform CCLD test-platformlist CCLD test-db CCLD test-loader CCLD test-isodetect CCLD test-install-script CCLD test-os-resources CCLD test-mediauris CCLD test-treeuris gmake[2]: Leaving directory '<https://ci.centos.org/job/libosinfo-check/systems=libvirt-fedora-29/ws/buil…'> /usr/bin/gmake check-TESTS gmake[2]: Entering directory '<https://ci.centos.org/job/libosinfo-check/systems=libvirt-fedora-29/ws/buil…'> gmake[3]: Entering directory '<https://ci.centos.org/job/libosinfo-check/systems=libvirt-fedora-29/ws/buil…'> PASS: test-device PASS: test-entity PASS: test-list PASS: test-devicelist PASS: test-product PASS: test-filter PASS: test-os PASS: test-oslist PASS: test-productfilter PASS: test-platformlist PASS: test-platform PASS: test-db PASS: test-install-script PASS: test-loader PASS: test-os-resources PASS: test-treeuris FAIL: test-isodetect PASS: test-mediauris ============================================================================ Testsuite summary for libosinfo 1.3.0 ============================================================================ # TOTAL: 18 # PASS: 17 # SKIP: 0 # XFAIL: 0 # FAIL: 1 # XPASS: 0 # ERROR: 0 ============================================================================ See tests/test-suite.log Please report to libosinfo(a)redhat.com ============================================================================ gmake[3]: *** [Makefile:1313: test-suite.log] Error 1 gmake[3]: Leaving directory '<https://ci.centos.org/job/libosinfo-check/systems=libvirt-fedora-29/ws/buil…'> gmake[2]: *** [Makefile:1421: check-TESTS] Error 2 gmake[2]: Leaving directory '<https://ci.centos.org/job/libosinfo-check/systems=libvirt-fedora-29/ws/buil…'> gmake[1]: *** [Makefile:1614: check-am] Error 2 gmake[1]: Leaving directory '<https://ci.centos.org/job/libosinfo-check/systems=libvirt-fedora-29/ws/buil…'> gmake: *** [Makefile:594: check-recursive] Error 1 + cat tests/test-suite.log =========================================== libosinfo 1.3.0: tests/test-suite.log =========================================== # TOTAL: 18 # PASS: 17 # SKIP: 0 # XFAIL: 0 # FAIL: 1 # XPASS: 0 # ERROR: 0 .. contents:: :depth: 2 FAIL: test-isodetect ==================== /isodetect/windows: OK /isodetect/ubuntu: ISO disco-desktop-amd64.iso.txt was not matched by OS ubuntu19.04 /isodetect/ubuntu: ISO disco-server-amd64.iso.txt was not matched by OS ubuntu19.04 /isodetect/ubuntu: ISO disco-server-arm64.iso.txt was not matched by OS ubuntu19.04 /isodetect/ubuntu: ISO disco-server-s390x.iso.txt was not matched by OS ubuntu19.04 /isodetect/ubuntu: FAIL /isodetect/sles: OK /isodetect/sled: OK /isodetect/rhel: OK /isodetect/popos: OK /isodetect/opensuse: OK /isodetect/openbsd: OK /isodetect/netbsd: OK /isodetect/mageia: OK /isodetect/haiku: OK /isodetect/gnome: OK /isodetect/freedos: OK /isodetect/freebsd: OK /isodetect/fedora: OK /isodetect/dragonflybsd: OK /isodetect/debian: OK /isodetect/centos: OK /isodetect/asianux: OK /isodetect/altlinux: OK /isodetect/alpinelinux: OK FAIL test-isodetect (exit status: 1) + exit 1 Build step 'Execute shell' marked build as failure
1 3
0 0
[Libvirt-ci] Build failed in Jenkins: libosinfo-check » libvirt-freebsd-10 #41
by ci@centos.org 16 Nov '18

16 Nov '18
See <https://ci.centos.org/job/libosinfo-check/systems=libvirt-freebsd-10/41/dis…> ------------------------------------------ Started by upstream project "libosinfo-check" build number 41 originally caused by: Started by upstream project "libosinfo-syntax-check" build number 41 originally caused by: Started by upstream project "libosinfo-build" build number 41 originally caused by: Started by an SCM change [EnvInject] - Loading node environment variables. Building remotely on libvirt-freebsd-10 (libvirt) in workspace <https://ci.centos.org/job/libosinfo-check/systems=libvirt-freebsd-10/ws/> [libosinfo] $ /bin/sh -xe /tmp/jenkins6069056183732339620.sh + export LIBOSINFO_NETWORK_TESTS=1 + cd build + /usr/local/bin/gmake check Making check in osinfo GEN public-submodule-commit gmake[1]: Entering directory '/usr<https://ci.centos.org/job/libosinfo-check/systems=libvirt-freebsd-10/ws/bui…'> /usr/local/bin/gmake check-am gmake[2]: Entering directory '/usr<https://ci.centos.org/job/libosinfo-check/systems=libvirt-freebsd-10/ws/bui…'> /usr/local/bin/gmake check-local gmake[3]: Entering directory '/usr<https://ci.centos.org/job/libosinfo-check/systems=libvirt-freebsd-10/ws/bui…'> GEN check-symsorting gmake[3]: Leaving directory '/usr<https://ci.centos.org/job/libosinfo-check/systems=libvirt-freebsd-10/ws/bui…'> gmake[2]: Leaving directory '/usr<https://ci.centos.org/job/libosinfo-check/systems=libvirt-freebsd-10/ws/bui…'> gmake[1]: Leaving directory '/usr<https://ci.centos.org/job/libosinfo-check/systems=libvirt-freebsd-10/ws/bui…'> Making check in tools gmake[1]: Entering directory '/usr<https://ci.centos.org/job/libosinfo-check/systems=libvirt-freebsd-10/ws/bui…'> gmake[1]: Nothing to be done for 'check'. gmake[1]: Leaving directory '/usr<https://ci.centos.org/job/libosinfo-check/systems=libvirt-freebsd-10/ws/bui…'> Making check in docs gmake[1]: Entering directory '/usr<https://ci.centos.org/job/libosinfo-check/systems=libvirt-freebsd-10/ws/bui…'> Making check in reference gmake[2]: Entering directory '/usr<https://ci.centos.org/job/libosinfo-check/systems=libvirt-freebsd-10/ws/bui…'> gmake[2]: Nothing to be done for 'check'. gmake[2]: Leaving directory '/usr<https://ci.centos.org/job/libosinfo-check/systems=libvirt-freebsd-10/ws/bui…'> gmake[2]: Entering directory '/usr<https://ci.centos.org/job/libosinfo-check/systems=libvirt-freebsd-10/ws/bui…'> gmake[2]: Nothing to be done for 'check-am'. gmake[2]: Leaving directory '/usr<https://ci.centos.org/job/libosinfo-check/systems=libvirt-freebsd-10/ws/bui…'> gmake[1]: Leaving directory '/usr<https://ci.centos.org/job/libosinfo-check/systems=libvirt-freebsd-10/ws/bui…'> Making check in po gmake[1]: Entering directory '/usr<https://ci.centos.org/job/libosinfo-check/systems=libvirt-freebsd-10/ws/bui…'> INTLTOOL_EXTRACT="/usr/local/bin/intltool-extract" XGETTEXT="/usr/local/bin/xgettext" srcdir=../../po /usr/local/bin/intltool-update --gettext-package libosinfo --pot rm -f missing notexist srcdir=../../po /usr/local/bin/intltool-update -m if [ -r missing -o -r notexist ]; then \ exit 1; \ fi gmake[1]: Leaving directory '/usr<https://ci.centos.org/job/libosinfo-check/systems=libvirt-freebsd-10/ws/bui…'> Making check in examples gmake[1]: Entering directory '/usr<https://ci.centos.org/job/libosinfo-check/systems=libvirt-freebsd-10/ws/bui…'> gmake[1]: Nothing to be done for 'check'. gmake[1]: Leaving directory '/usr<https://ci.centos.org/job/libosinfo-check/systems=libvirt-freebsd-10/ws/bui…'> Making check in tests gmake[1]: Entering directory '/usr<https://ci.centos.org/job/libosinfo-check/systems=libvirt-freebsd-10/ws/bui…'> /usr/local/bin/gmake test-entity test-device test-list test-devicelist test-filter test-product test-os test-oslist test-productfilter test-platform test-platformlist test-db test-loader test-isodetect test-install-script test-os-resources test-mediauris test-treeuris gmake[2]: Entering directory '/usr<https://ci.centos.org/job/libosinfo-check/systems=libvirt-freebsd-10/ws/bui…'> CC test_entity-test-entity.o CC test_device-test-device.o CC test_list-test-list.o CC test_devicelist-test-devicelist.o CC test_filter-test-filter.o CC test_product-test-product.o CC test_os-test-os.o CC test_oslist-test-oslist.o CC test_productfilter-test-productfilter.o CC test_platform-test-platform.o CC test_platformlist-test-platformlist.o CC test_db-test-db.o CC test_loader-test-loader.o CC test_isodetect-test-isodetect.o CC test_install_script-test-install-script.o CC test_os_resources-test-os-resources.o CC test_treeuris-test-treeuris.o CC test_mediauris-test-mediauris.o CCLD test-entity CCLD test-device CCLD test-list CCLD test-devicelist CCLD test-filter CCLD test-product CCLD test-os CCLD test-oslist CCLD test-productfilter CCLD test-platform CCLD test-platformlist CCLD test-db CCLD test-loader CCLD test-isodetect CCLD test-install-script CCLD test-os-resources CCLD test-mediauris CCLD test-treeuris gmake[2]: Leaving directory '/usr<https://ci.centos.org/job/libosinfo-check/systems=libvirt-freebsd-10/ws/bui…'> /usr/local/bin/gmake check-TESTS gmake[2]: Entering directory '/usr<https://ci.centos.org/job/libosinfo-check/systems=libvirt-freebsd-10/ws/bui…'> gmake[3]: Entering directory '/usr<https://ci.centos.org/job/libosinfo-check/systems=libvirt-freebsd-10/ws/bui…'> PASS: test-entity PASS: test-device PASS: test-list PASS: test-filter PASS: test-product PASS: test-devicelist PASS: test-oslist PASS: test-productfilter PASS: test-os PASS: test-db PASS: test-platform PASS: test-platformlist PASS: test-install-script PASS: test-loader PASS: test-os-resources PASS: test-treeuris FAIL: test-isodetect FAIL: test-mediauris ============================================================================ Testsuite summary for libosinfo 1.3.0 ============================================================================ # TOTAL: 18 # PASS: 16 # SKIP: 0 # XFAIL: 0 # FAIL: 2 # XPASS: 0 # ERROR: 0 ============================================================================ See tests/test-suite.log Please report to libosinfo(a)redhat.com ============================================================================ gmake[3]: *** [Makefile:1313: test-suite.log] Error 1 gmake[3]: Leaving directory '/usr<https://ci.centos.org/job/libosinfo-check/systems=libvirt-freebsd-10/ws/bui…'> gmake[2]: *** [Makefile:1421: check-TESTS] Error 2 gmake[2]: Leaving directory '/usr<https://ci.centos.org/job/libosinfo-check/systems=libvirt-freebsd-10/ws/bui…'> gmake[1]: *** [Makefile:1614: check-am] Error 2 gmake[1]: Leaving directory '/usr<https://ci.centos.org/job/libosinfo-check/systems=libvirt-freebsd-10/ws/bui…'> gmake: *** [Makefile:594: check-recursive] Error 1 + cat tests/test-suite.log =========================================== libosinfo 1.3.0: tests/test-suite.log =========================================== # TOTAL: 18 # PASS: 16 # SKIP: 0 # XFAIL: 0 # FAIL: 2 # XPASS: 0 # ERROR: 0 .. contents:: :depth: 2 FAIL: test-isodetect ==================== /isodetect/windows: OK /isodetect/ubuntu: ISO disco-desktop-amd64.iso.txt was not matched by OS ubuntu19.04 /isodetect/ubuntu: ISO disco-server-amd64.iso.txt was not matched by OS ubuntu19.04 /isodetect/ubuntu: ISO disco-server-arm64.iso.txt was not matched by OS ubuntu19.04 /isodetect/ubuntu: ISO disco-server-s390x.iso.txt was not matched by OS ubuntu19.04 /isodetect/ubuntu: FAIL /isodetect/sles: OK /isodetect/sled: OK /isodetect/rhel: OK /isodetect/popos: OK /isodetect/opensuse: OK /isodetect/openbsd: OK /isodetect/netbsd: OK /isodetect/mageia: OK /isodetect/gnome: OK /isodetect/freedos: OK /isodetect/freebsd: OK /isodetect/fedora: OK /isodetect/debian: OK /isodetect/centos: OK /isodetect/asianux: OK /isodetect/altlinux: OK /isodetect/alpinelinux: OK /isodetect/dragonflybsd: OK /isodetect/haiku: OK FAIL test-isodetect (exit status: 1) FAIL: test-mediauris ==================== /mediauris/uris: ** ERROR:../../tests/test-mediauris.c:49:test_media: assertion failed (res == CURLE_OK): (22 == 0) FAIL FAIL test-mediauris (exit status: 1) + exit 1 Build step 'Execute shell' marked build as failure
1 3
0 0
[Libvirt-ci] Build failed in Jenkins: libosinfo-check » libvirt-fedora-28 #41
by ci@centos.org 16 Nov '18

16 Nov '18
See <https://ci.centos.org/job/libosinfo-check/systems=libvirt-fedora-28/41/disp…> ------------------------------------------ Started by upstream project "libosinfo-check" build number 41 originally caused by: Started by upstream project "libosinfo-syntax-check" build number 41 originally caused by: Started by upstream project "libosinfo-build" build number 41 originally caused by: Started by an SCM change [EnvInject] - Loading node environment variables. Building remotely on libvirt-fedora-28 (libvirt) in workspace <https://ci.centos.org/job/libosinfo-check/systems=libvirt-fedora-28/ws/> [libosinfo] $ /bin/sh -xe /tmp/jenkins372213965958793605.sh + export LIBOSINFO_NETWORK_TESTS=1 + LIBOSINFO_NETWORK_TESTS=1 + cd build + /usr/bin/gmake check GEN public-submodule-commit Making check in osinfo gmake[1]: Entering directory '<https://ci.centos.org/job/libosinfo-check/systems=libvirt-fedora-28/ws/buil…'> /usr/bin/gmake check-am gmake[2]: Entering directory '<https://ci.centos.org/job/libosinfo-check/systems=libvirt-fedora-28/ws/buil…'> /usr/bin/gmake check-local gmake[3]: Entering directory '<https://ci.centos.org/job/libosinfo-check/systems=libvirt-fedora-28/ws/buil…'> GEN check-symfile GEN check-symsorting gmake[3]: Leaving directory '<https://ci.centos.org/job/libosinfo-check/systems=libvirt-fedora-28/ws/buil…'> gmake[2]: Leaving directory '<https://ci.centos.org/job/libosinfo-check/systems=libvirt-fedora-28/ws/buil…'> gmake[1]: Leaving directory '<https://ci.centos.org/job/libosinfo-check/systems=libvirt-fedora-28/ws/buil…'> Making check in tools gmake[1]: Entering directory '<https://ci.centos.org/job/libosinfo-check/systems=libvirt-fedora-28/ws/buil…'> gmake[1]: Nothing to be done for 'check'. gmake[1]: Leaving directory '<https://ci.centos.org/job/libosinfo-check/systems=libvirt-fedora-28/ws/buil…'> Making check in docs gmake[1]: Entering directory '<https://ci.centos.org/job/libosinfo-check/systems=libvirt-fedora-28/ws/buil…'> Making check in reference gmake[2]: Entering directory '<https://ci.centos.org/job/libosinfo-check/systems=libvirt-fedora-28/ws/buil…'> gmake[2]: Nothing to be done for 'check'. gmake[2]: Leaving directory '<https://ci.centos.org/job/libosinfo-check/systems=libvirt-fedora-28/ws/buil…'> gmake[2]: Entering directory '<https://ci.centos.org/job/libosinfo-check/systems=libvirt-fedora-28/ws/buil…'> gmake[2]: Nothing to be done for 'check-am'. gmake[2]: Leaving directory '<https://ci.centos.org/job/libosinfo-check/systems=libvirt-fedora-28/ws/buil…'> gmake[1]: Leaving directory '<https://ci.centos.org/job/libosinfo-check/systems=libvirt-fedora-28/ws/buil…'> Making check in po gmake[1]: Entering directory '<https://ci.centos.org/job/libosinfo-check/systems=libvirt-fedora-28/ws/buil…'> INTLTOOL_EXTRACT="/usr/bin/intltool-extract" XGETTEXT="/usr/bin/xgettext" srcdir=../../po /usr/bin/intltool-update --gettext-package libosinfo --pot rm -f missing notexist srcdir=../../po /usr/bin/intltool-update -m if [ -r missing -o -r notexist ]; then \ exit 1; \ fi gmake[1]: Leaving directory '<https://ci.centos.org/job/libosinfo-check/systems=libvirt-fedora-28/ws/buil…'> Making check in examples gmake[1]: Entering directory '<https://ci.centos.org/job/libosinfo-check/systems=libvirt-fedora-28/ws/buil…'> gmake[1]: Nothing to be done for 'check'. gmake[1]: Leaving directory '<https://ci.centos.org/job/libosinfo-check/systems=libvirt-fedora-28/ws/buil…'> Making check in tests gmake[1]: Entering directory '<https://ci.centos.org/job/libosinfo-check/systems=libvirt-fedora-28/ws/buil…'> /usr/bin/gmake test-entity test-device test-list test-devicelist test-filter test-product test-os test-oslist test-productfilter test-platform test-platformlist test-db test-loader test-isodetect test-install-script test-os-resources test-mediauris test-treeuris gmake[2]: Entering directory '<https://ci.centos.org/job/libosinfo-check/systems=libvirt-fedora-28/ws/buil…'> CC test_entity-test-entity.o CC test_device-test-device.o CC test_list-test-list.o CC test_devicelist-test-devicelist.o CC test_filter-test-filter.o CC test_product-test-product.o CC test_os-test-os.o CC test_oslist-test-oslist.o CC test_productfilter-test-productfilter.o CC test_platform-test-platform.o CC test_platformlist-test-platformlist.o CC test_db-test-db.o CC test_loader-test-loader.o CC test_isodetect-test-isodetect.o CC test_install_script-test-install-script.o CC test_os_resources-test-os-resources.o CC test_mediauris-test-mediauris.o CC test_treeuris-test-treeuris.o CCLD test-entity CCLD test-device CCLD test-list CCLD test-devicelist CCLD test-filter CCLD test-product CCLD test-os CCLD test-oslist CCLD test-productfilter CCLD test-platform CCLD test-platformlist CCLD test-db CCLD test-loader CCLD test-isodetect CCLD test-install-script CCLD test-os-resources CCLD test-mediauris CCLD test-treeuris gmake[2]: Leaving directory '<https://ci.centos.org/job/libosinfo-check/systems=libvirt-fedora-28/ws/buil…'> /usr/bin/gmake check-TESTS gmake[2]: Entering directory '<https://ci.centos.org/job/libosinfo-check/systems=libvirt-fedora-28/ws/buil…'> gmake[3]: Entering directory '<https://ci.centos.org/job/libosinfo-check/systems=libvirt-fedora-28/ws/buil…'> PASS: test-device PASS: test-entity PASS: test-list PASS: test-devicelist PASS: test-filter PASS: test-product PASS: test-os PASS: test-productfilter PASS: test-oslist PASS: test-platform PASS: test-platformlist PASS: test-db PASS: test-install-script PASS: test-loader PASS: test-os-resources PASS: test-treeuris FAIL: test-isodetect PASS: test-mediauris ============================================================================ Testsuite summary for libosinfo 1.3.0 ============================================================================ # TOTAL: 18 # PASS: 17 # SKIP: 0 # XFAIL: 0 # FAIL: 1 # XPASS: 0 # ERROR: 0 ============================================================================ See tests/test-suite.log Please report to libosinfo(a)redhat.com ============================================================================ gmake[3]: *** [Makefile:1289: test-suite.log] Error 1 gmake[3]: Leaving directory '<https://ci.centos.org/job/libosinfo-check/systems=libvirt-fedora-28/ws/buil…'> gmake[2]: *** [Makefile:1397: check-TESTS] Error 2 gmake[2]: Leaving directory '<https://ci.centos.org/job/libosinfo-check/systems=libvirt-fedora-28/ws/buil…'> gmake[1]: *** [Makefile:1587: check-am] Error 2 gmake[1]: Leaving directory '<https://ci.centos.org/job/libosinfo-check/systems=libvirt-fedora-28/ws/buil…'> gmake: *** [Makefile:594: check-recursive] Error 1 + cat tests/test-suite.log =========================================== libosinfo 1.3.0: tests/test-suite.log =========================================== # TOTAL: 18 # PASS: 17 # SKIP: 0 # XFAIL: 0 # FAIL: 1 # XPASS: 0 # ERROR: 0 .. contents:: :depth: 2 FAIL: test-isodetect ==================== /isodetect/windows: OK /isodetect/ubuntu: ISO disco-desktop-amd64.iso.txt was not matched by OS ubuntu19.04 /isodetect/ubuntu: ISO disco-server-amd64.iso.txt was not matched by OS ubuntu19.04 /isodetect/ubuntu: ISO disco-server-arm64.iso.txt was not matched by OS ubuntu19.04 /isodetect/ubuntu: ISO disco-server-s390x.iso.txt was not matched by OS ubuntu19.04 /isodetect/ubuntu: FAIL /isodetect/sles: OK /isodetect/sled: OK /isodetect/rhel: OK /isodetect/popos: OK /isodetect/opensuse: OK /isodetect/openbsd: OK /isodetect/netbsd: OK /isodetect/mageia: OK /isodetect/gnome: OK /isodetect/freedos: OK /isodetect/freebsd: OK /isodetect/dragonflybsd: OK /isodetect/haiku: OK /isodetect/fedora: OK /isodetect/debian: OK /isodetect/centos: OK /isodetect/asianux: OK /isodetect/altlinux: OK /isodetect/alpinelinux: OK FAIL test-isodetect (exit status: 1) + exit 1 Build step 'Execute shell' marked build as failure
1 3
0 0
[Libvirt-ci] Build failed in Jenkins: libosinfo-check » libvirt-freebsd-11 #41
by ci@centos.org 16 Nov '18

16 Nov '18
See <https://ci.centos.org/job/libosinfo-check/systems=libvirt-freebsd-11/41/dis…> ------------------------------------------ Started by upstream project "libosinfo-check" build number 41 originally caused by: Started by upstream project "libosinfo-syntax-check" build number 41 originally caused by: Started by upstream project "libosinfo-build" build number 41 originally caused by: Started by an SCM change [EnvInject] - Loading node environment variables. Building remotely on libvirt-freebsd-11 (libvirt) in workspace <https://ci.centos.org/job/libosinfo-check/systems=libvirt-freebsd-11/ws/> [libosinfo] $ /bin/sh -xe /tmp/jenkins5531635556356462682.sh + export 'LIBOSINFO_NETWORK_TESTS=1' + cd build + /usr/local/bin/gmake check Making check in osinfo GEN public-submodule-commit gmake[1]: Entering directory '/usr<https://ci.centos.org/job/libosinfo-check/systems=libvirt-freebsd-11/ws/bui…'> /usr/local/bin/gmake check-am gmake[2]: Entering directory '/usr<https://ci.centos.org/job/libosinfo-check/systems=libvirt-freebsd-11/ws/bui…'> /usr/local/bin/gmake check-local gmake[3]: Entering directory '/usr<https://ci.centos.org/job/libosinfo-check/systems=libvirt-freebsd-11/ws/bui…'> GEN check-symsorting gmake[3]: Leaving directory '/usr<https://ci.centos.org/job/libosinfo-check/systems=libvirt-freebsd-11/ws/bui…'> gmake[2]: Leaving directory '/usr<https://ci.centos.org/job/libosinfo-check/systems=libvirt-freebsd-11/ws/bui…'> gmake[1]: Leaving directory '/usr<https://ci.centos.org/job/libosinfo-check/systems=libvirt-freebsd-11/ws/bui…'> Making check in tools gmake[1]: Entering directory '/usr<https://ci.centos.org/job/libosinfo-check/systems=libvirt-freebsd-11/ws/bui…'> gmake[1]: Nothing to be done for 'check'. gmake[1]: Leaving directory '/usr<https://ci.centos.org/job/libosinfo-check/systems=libvirt-freebsd-11/ws/bui…'> Making check in docs gmake[1]: Entering directory '/usr<https://ci.centos.org/job/libosinfo-check/systems=libvirt-freebsd-11/ws/bui…'> Making check in reference gmake[2]: Entering directory '/usr<https://ci.centos.org/job/libosinfo-check/systems=libvirt-freebsd-11/ws/bui…'> gmake[2]: Nothing to be done for 'check'. gmake[2]: Leaving directory '/usr<https://ci.centos.org/job/libosinfo-check/systems=libvirt-freebsd-11/ws/bui…'> gmake[2]: Entering directory '/usr<https://ci.centos.org/job/libosinfo-check/systems=libvirt-freebsd-11/ws/bui…'> gmake[2]: Nothing to be done for 'check-am'. gmake[2]: Leaving directory '/usr<https://ci.centos.org/job/libosinfo-check/systems=libvirt-freebsd-11/ws/bui…'> gmake[1]: Leaving directory '/usr<https://ci.centos.org/job/libosinfo-check/systems=libvirt-freebsd-11/ws/bui…'> Making check in po gmake[1]: Entering directory '/usr<https://ci.centos.org/job/libosinfo-check/systems=libvirt-freebsd-11/ws/bui…'> INTLTOOL_EXTRACT="/usr/local/bin/intltool-extract" XGETTEXT="/usr/local/bin/xgettext" srcdir=../../po /usr/local/bin/intltool-update --gettext-package libosinfo --pot rm -f missing notexist srcdir=../../po /usr/local/bin/intltool-update -m if [ -r missing -o -r notexist ]; then \ exit 1; \ fi gmake[1]: Leaving directory '/usr<https://ci.centos.org/job/libosinfo-check/systems=libvirt-freebsd-11/ws/bui…'> Making check in examples gmake[1]: Entering directory '/usr<https://ci.centos.org/job/libosinfo-check/systems=libvirt-freebsd-11/ws/bui…'> gmake[1]: Nothing to be done for 'check'. gmake[1]: Leaving directory '/usr<https://ci.centos.org/job/libosinfo-check/systems=libvirt-freebsd-11/ws/bui…'> Making check in tests gmake[1]: Entering directory '/usr<https://ci.centos.org/job/libosinfo-check/systems=libvirt-freebsd-11/ws/bui…'> /usr/local/bin/gmake test-entity test-device test-list test-devicelist test-filter test-product test-os test-oslist test-productfilter test-platform test-platformlist test-db test-loader test-isodetect test-install-script test-os-resources test-mediauris test-treeuris gmake[2]: Entering directory '/usr<https://ci.centos.org/job/libosinfo-check/systems=libvirt-freebsd-11/ws/bui…'> CC test_entity-test-entity.o CC test_device-test-device.o CC test_list-test-list.o CC test_devicelist-test-devicelist.o CC test_filter-test-filter.o CC test_product-test-product.o CC test_os-test-os.o CC test_oslist-test-oslist.o CC test_productfilter-test-productfilter.o CC test_platform-test-platform.o CC test_platformlist-test-platformlist.o CC test_db-test-db.o CC test_loader-test-loader.o CC test_isodetect-test-isodetect.o CC test_install_script-test-install-script.o CC test_os_resources-test-os-resources.o CC test_mediauris-test-mediauris.o CC test_treeuris-test-treeuris.o CCLD test-entity CCLD test-device CCLD test-list CCLD test-devicelist CCLD test-filter CCLD test-product CCLD test-os CCLD test-oslist CCLD test-productfilter CCLD test-platform CCLD test-platformlist CCLD test-db CCLD test-loader CCLD test-isodetect CCLD test-install-script CCLD test-os-resources CCLD test-mediauris CCLD test-treeuris gmake[2]: Leaving directory '/usr<https://ci.centos.org/job/libosinfo-check/systems=libvirt-freebsd-11/ws/bui…'> /usr/local/bin/gmake check-TESTS gmake[2]: Entering directory '/usr<https://ci.centos.org/job/libosinfo-check/systems=libvirt-freebsd-11/ws/bui…'> gmake[3]: Entering directory '/usr<https://ci.centos.org/job/libosinfo-check/systems=libvirt-freebsd-11/ws/bui…'> PASS: test-entity PASS: test-list PASS: test-device PASS: test-devicelist PASS: test-filter PASS: test-product PASS: test-os PASS: test-productfilter PASS: test-oslist PASS: test-platformlist PASS: test-platform PASS: test-db PASS: test-install-script PASS: test-loader PASS: test-os-resources PASS: test-treeuris FAIL: test-isodetect PASS: test-mediauris ============================================================================ Testsuite summary for libosinfo 1.3.0 ============================================================================ # TOTAL: 18 # PASS: 17 # SKIP: 0 # XFAIL: 0 # FAIL: 1 # XPASS: 0 # ERROR: 0 ============================================================================ See tests/test-suite.log Please report to libosinfo(a)redhat.com ============================================================================ gmake[3]: *** [Makefile:1313: test-suite.log] Error 1 gmake[3]: Leaving directory '/usr<https://ci.centos.org/job/libosinfo-check/systems=libvirt-freebsd-11/ws/bui…'> gmake[2]: *** [Makefile:1421: check-TESTS] Error 2 gmake[2]: Leaving directory '/usr<https://ci.centos.org/job/libosinfo-check/systems=libvirt-freebsd-11/ws/bui…'> gmake[1]: *** [Makefile:1614: check-am] Error 2 gmake[1]: Leaving directory '/usr<https://ci.centos.org/job/libosinfo-check/systems=libvirt-freebsd-11/ws/bui…'> gmake: *** [Makefile:594: check-recursive] Error 1 + cat tests/test-suite.log =========================================== libosinfo 1.3.0: tests/test-suite.log =========================================== # TOTAL: 18 # PASS: 17 # SKIP: 0 # XFAIL: 0 # FAIL: 1 # XPASS: 0 # ERROR: 0 .. contents:: :depth: 2 FAIL: test-isodetect ==================== /isodetect/windows: OK /isodetect/ubuntu: ISO disco-desktop-amd64.iso.txt was not matched by OS ubuntu19.04 /isodetect/ubuntu: ISO disco-server-amd64.iso.txt was not matched by OS ubuntu19.04 /isodetect/ubuntu: ISO disco-server-arm64.iso.txt was not matched by OS ubuntu19.04 /isodetect/ubuntu: ISO disco-server-s390x.iso.txt was not matched by OS ubuntu19.04 /isodetect/ubuntu: FAIL /isodetect/sles: OK /isodetect/sled: OK /isodetect/rhel: OK /isodetect/popos: OK /isodetect/opensuse: OK /isodetect/openbsd: OK /isodetect/netbsd: OK /isodetect/mageia: OK /isodetect/haiku: OK /isodetect/gnome: OK /isodetect/freedos: OK /isodetect/freebsd: OK /isodetect/fedora: OK /isodetect/dragonflybsd: OK /isodetect/debian: OK /isodetect/centos: OK /isodetect/asianux: OK /isodetect/altlinux: OK /isodetect/alpinelinux: OK FAIL test-isodetect (exit status: 1) + exit 1 Build step 'Execute shell' marked build as failure
1 3
0 0
[Libvirt-ci] Build failed in Jenkins: libosinfo-check » libvirt-centos-7 #41
by ci@centos.org 16 Nov '18

16 Nov '18
See <https://ci.centos.org/job/libosinfo-check/systems=libvirt-centos-7/41/displ…> ------------------------------------------ Started by upstream project "libosinfo-check" build number 41 originally caused by: Started by upstream project "libosinfo-syntax-check" build number 41 originally caused by: Started by upstream project "libosinfo-build" build number 41 originally caused by: Started by an SCM change [EnvInject] - Loading node environment variables. Building remotely on libvirt-centos-7 (libvirt) in workspace <https://ci.centos.org/job/libosinfo-check/systems=libvirt-centos-7/ws/> [libosinfo] $ /bin/sh -xe /tmp/jenkins535429884112534487.sh + export LIBOSINFO_NETWORK_TESTS=1 + LIBOSINFO_NETWORK_TESTS=1 + cd build + /usr/bin/gmake check GEN public-submodule-commit Making check in osinfo gmake[1]: Entering directory `<https://ci.centos.org/job/libosinfo-check/systems=libvirt-centos-7/ws/build…'> /usr/bin/gmake check-am gmake[2]: Entering directory `<https://ci.centos.org/job/libosinfo-check/systems=libvirt-centos-7/ws/build…'> /usr/bin/gmake check-local gmake[3]: Entering directory `<https://ci.centos.org/job/libosinfo-check/systems=libvirt-centos-7/ws/build…'> GEN check-symfile GEN check-symsorting gmake[3]: Leaving directory `<https://ci.centos.org/job/libosinfo-check/systems=libvirt-centos-7/ws/build…'> gmake[2]: Leaving directory `<https://ci.centos.org/job/libosinfo-check/systems=libvirt-centos-7/ws/build…'> gmake[1]: Leaving directory `<https://ci.centos.org/job/libosinfo-check/systems=libvirt-centos-7/ws/build…'> Making check in tools gmake[1]: Entering directory `<https://ci.centos.org/job/libosinfo-check/systems=libvirt-centos-7/ws/build…'> gmake[1]: Nothing to be done for `check'. gmake[1]: Leaving directory `<https://ci.centos.org/job/libosinfo-check/systems=libvirt-centos-7/ws/build…'> Making check in docs gmake[1]: Entering directory `<https://ci.centos.org/job/libosinfo-check/systems=libvirt-centos-7/ws/build…'> Making check in reference gmake[2]: Entering directory `<https://ci.centos.org/job/libosinfo-check/systems=libvirt-centos-7/ws/build…'> gmake[2]: Nothing to be done for `check'. gmake[2]: Leaving directory `<https://ci.centos.org/job/libosinfo-check/systems=libvirt-centos-7/ws/build…'> gmake[2]: Entering directory `<https://ci.centos.org/job/libosinfo-check/systems=libvirt-centos-7/ws/build…'> gmake[2]: Nothing to be done for `check-am'. gmake[2]: Leaving directory `<https://ci.centos.org/job/libosinfo-check/systems=libvirt-centos-7/ws/build…'> gmake[1]: Leaving directory `<https://ci.centos.org/job/libosinfo-check/systems=libvirt-centos-7/ws/build…'> Making check in po gmake[1]: Entering directory `<https://ci.centos.org/job/libosinfo-check/systems=libvirt-centos-7/ws/build…'> INTLTOOL_EXTRACT="/usr/bin/intltool-extract" XGETTEXT="/usr/bin/xgettext" srcdir=../../po /usr/bin/intltool-update --gettext-package libosinfo --pot rm -f missing notexist srcdir=../../po /usr/bin/intltool-update -m if [ -r missing -o -r notexist ]; then \ exit 1; \ fi gmake[1]: Leaving directory `<https://ci.centos.org/job/libosinfo-check/systems=libvirt-centos-7/ws/build…'> Making check in examples gmake[1]: Entering directory `<https://ci.centos.org/job/libosinfo-check/systems=libvirt-centos-7/ws/build…'> gmake[1]: Nothing to be done for `check'. gmake[1]: Leaving directory `<https://ci.centos.org/job/libosinfo-check/systems=libvirt-centos-7/ws/build…'> Making check in tests gmake[1]: Entering directory `<https://ci.centos.org/job/libosinfo-check/systems=libvirt-centos-7/ws/build…'> /usr/bin/gmake test-entity test-device test-list test-devicelist test-filter test-product test-os test-oslist test-productfilter test-platform test-platformlist test-db test-loader test-isodetect test-install-script test-os-resources test-mediauris test-treeuris gmake[2]: Entering directory `<https://ci.centos.org/job/libosinfo-check/systems=libvirt-centos-7/ws/build…'> CC test_device-test-device.o CC test_list-test-list.o CC test_entity-test-entity.o CC test_devicelist-test-devicelist.o CC test_filter-test-filter.o CC test_product-test-product.o CC test_os-test-os.o CC test_oslist-test-oslist.o CC test_productfilter-test-productfilter.o CC test_platform-test-platform.o CC test_platformlist-test-platformlist.o CC test_db-test-db.o CC test_loader-test-loader.o CC test_isodetect-test-isodetect.o CC test_install_script-test-install-script.o CC test_os_resources-test-os-resources.o CC test_mediauris-test-mediauris.o CC test_treeuris-test-treeuris.o CCLD test-entity CCLD test-device CCLD test-list CCLD test-devicelist CCLD test-filter CCLD test-product CCLD test-os CCLD test-oslist CCLD test-productfilter CCLD test-platform CCLD test-platformlist CCLD test-db CCLD test-loader CCLD test-isodetect CCLD test-install-script CCLD test-os-resources CCLD test-mediauris CCLD test-treeuris gmake[2]: Leaving directory `<https://ci.centos.org/job/libosinfo-check/systems=libvirt-centos-7/ws/build…'> /usr/bin/gmake check-TESTS gmake[2]: Entering directory `<https://ci.centos.org/job/libosinfo-check/systems=libvirt-centos-7/ws/build…'> gmake[3]: Entering directory `<https://ci.centos.org/job/libosinfo-check/systems=libvirt-centos-7/ws/build…'> PASS: test-entity PASS: test-list PASS: test-device PASS: test-devicelist PASS: test-filter PASS: test-os PASS: test-product PASS: test-oslist PASS: test-productfilter PASS: test-platform PASS: test-db PASS: test-platformlist PASS: test-install-script PASS: test-loader PASS: test-os-resources PASS: test-treeuris FAIL: test-isodetect PASS: test-mediauris gmake[4]: Entering directory `<https://ci.centos.org/job/libosinfo-check/systems=libvirt-centos-7/ws/build…'> gmake[4]: Nothing to be done for `all'. gmake[4]: Leaving directory `<https://ci.centos.org/job/libosinfo-check/systems=libvirt-centos-7/ws/build…'> ============================================================================ Testsuite summary for libosinfo 1.3.0 ============================================================================ # TOTAL: 18 # PASS: 17 # SKIP: 0 # XFAIL: 0 # FAIL: 1 # XPASS: 0 # ERROR: 0 ============================================================================ See tests/test-suite.log Please report to libosinfo(a)redhat.com ============================================================================ gmake[3]: *** [test-suite.log] Error 1 gmake[3]: Leaving directory `<https://ci.centos.org/job/libosinfo-check/systems=libvirt-centos-7/ws/build…'> gmake[2]: *** [check-TESTS] Error 2 gmake[2]: Leaving directory `<https://ci.centos.org/job/libosinfo-check/systems=libvirt-centos-7/ws/build…'> gmake[1]: *** [check-am] Error 2 gmake[1]: Leaving directory `<https://ci.centos.org/job/libosinfo-check/systems=libvirt-centos-7/ws/build…'> gmake: *** [check-recursive] Error 1 + cat tests/test-suite.log =========================================== libosinfo 1.3.0: tests/test-suite.log =========================================== # TOTAL: 18 # PASS: 17 # SKIP: 0 # XFAIL: 0 # FAIL: 1 # XPASS: 0 # ERROR: 0 .. contents:: :depth: 2 FAIL: test-isodetect ==================== /isodetect/dragonflybsd: OK /isodetect/haiku: OK /isodetect/windows: OK /isodetect/ubuntu: ISO disco-desktop-amd64.iso.txt was not matched by OS ubuntu19.04 /isodetect/ubuntu: ISO disco-server-amd64.iso.txt was not matched by OS ubuntu19.04 /isodetect/ubuntu: ISO disco-server-arm64.iso.txt was not matched by OS ubuntu19.04 /isodetect/ubuntu: ISO disco-server-s390x.iso.txt was not matched by OS ubuntu19.04 /isodetect/ubuntu: FAIL /isodetect/sles: OK /isodetect/sled: OK /isodetect/rhel: OK /isodetect/popos: OK /isodetect/opensuse: OK /isodetect/openbsd: OK /isodetect/netbsd: OK /isodetect/mageia: OK /isodetect/gnome: OK /isodetect/freedos: OK /isodetect/freebsd: OK /isodetect/fedora: OK /isodetect/debian: OK /isodetect/centos: OK /isodetect/asianux: OK /isodetect/altlinux: OK /isodetect/alpinelinux: OK + exit 1 Build step 'Execute shell' marked build as failure
1 3
0 0
  • ← Newer
  • 1
  • ...
  • 811
  • 812
  • 813
  • 814
  • 815
  • 816
  • 817
  • ...
  • 1022
  • Older →

HyperKitty Powered by HyperKitty version 1.3.12.