libvirt List Archives
Sign In Sign Up
Manage this list Sign In Sign Up

Keyboard Shortcuts

Thread View

  • j: Next unread message
  • k: Previous unread message
  • j a: Jump to all threads
  • j l: Jump to MailingList overview

CI

Thread Start a new thread
Download
Threads by month
  • ----- 2026 -----
  • September
  • August
  • July
  • June
  • May
  • April
  • March
  • February
  • January
  • ----- 2025 -----
  • December
  • November
  • October
  • September
  • August
  • July
  • June
  • May
  • April
  • March
  • February
  • January
  • ----- 2024 -----
  • December
  • November
  • October
  • September
  • August
  • July
  • June
  • May
  • April
  • March
  • February
  • January
  • ----- 2023 -----
  • December
  • November
  • October
  • September
  • August
  • July
  • June
  • May
  • April
  • March
  • February
  • January
  • ----- 2022 -----
  • December
  • November
  • October
  • September
  • August
  • July
  • June
  • May
  • April
  • March
  • February
  • January
  • ----- 2021 -----
  • December
  • November
  • October
  • September
  • August
  • July
  • June
  • May
  • April
  • March
  • February
  • January
  • ----- 2020 -----
  • December
  • November
  • October
  • September
  • August
  • July
  • June
  • May
  • April
  • March
  • February
  • January
  • ----- 2019 -----
  • December
  • November
  • October
  • September
  • August
  • July
  • June
  • May
  • April
  • March
  • February
  • January
  • ----- 2018 -----
  • December
  • November
  • October
  • September
  • August
  • July
  • June
  • May
  • April
  • March
  • February
  • January
  • ----- 2017 -----
  • December
  • November
  • October
  • September
  • August
  • July
  • June
  • May
  • April
  • March
  • February
  • January
  • ----- 2016 -----
  • December
  • November
  • October
  • September
  • August
  • July
ci@lists.libvirt.org

  • 2 participants
  • 10211 discussions
[Libvirt-ci] Build failed in Jenkins: libvirt+mingw32-build » libvirt-fedora-rawhide #172
by ci@centos.org 04 Dec '18

04 Dec '18
See <https://ci.centos.org/job/libvirt+mingw32-build/systems=libvirt-fedora-rawh…> Changes: [abologna] Add armv6l Support as guest [abologna] qemu: Add Default PCI Device for armv6l versatilepb guests [abologna] News: Add armv6l Support as guest [mprivozn] qemu: handle multicast overflow on macvtap NIC_RX_FILTER_CHANGED [eskultet] util: Introduce virHostGetDRMRenderNode helper [eskultet] conf: Introduce virDomainGraphics-related helpers [eskultet] qemu: process: spice: Pick the first available DRM render node [eskultet] qemu: command: Introduce qemuBuildGraphicsEGLHeadlessCommandLine helper [eskultet] qemu: caps: Introduce QEMU_EGL_HEADLESS_RENDERNODE capability [eskultet] conf: gfx: Add egl-headless as a member to virDomainGraphicsDef struct [eskultet] conf: gfx: egl-headless: Introduce a new <gl> subelement [eskultet] qemu: domain: egl-headless: Add the DRI device into the namespace [eskultet] qemu: cgroup: gfx: egl-headless: Add the DRI device into the cgroup list [eskultet] security: dac: gfx: egl-headless: Relabel the DRI device [eskultet] qemu: command: gfx: egl-headless: Add 'rendernode' option to the cmdline [eskultet] docs: Provide news update for libvirt being able to pick a DRI device ------------------------------------------ [...truncated 129.87 KB...] CC uniwidth/width.lo CCLD libgnu.la gmake[3]: Leaving directory '<https://ci.centos.org/job/libvirt+mingw32-build/systems=libvirt-fedora-rawh…'> gmake[2]: Leaving directory '<https://ci.centos.org/job/libvirt+mingw32-build/systems=libvirt-fedora-rawh…'> Making all in include/libvirt gmake[2]: Entering directory '<https://ci.centos.org/job/libvirt+mingw32-build/systems=libvirt-fedora-rawh…'> gmake[2]: Nothing to be done for 'all'. gmake[2]: Leaving directory '<https://ci.centos.org/job/libvirt+mingw32-build/systems=libvirt-fedora-rawh…'> Making all in src gmake[2]: Entering directory '<https://ci.centos.org/job/libvirt+mingw32-build/systems=libvirt-fedora-rawh…'> GEN util/virkeycodetable_linux.h GEN util/virkeycodetable_osx.h GEN util/virkeycodetable_atset1.h GEN util/virkeycodetable_atset2.h GEN util/virkeycodetable_atset3.h GEN util/virkeycodetable_xtkbd.h GEN util/virkeycodetable_usb.h GEN util/virkeycodetable_win32.h GEN util/virkeycodetable_qnum.h GEN util/virkeynametable_linux.h GEN util/virkeynametable_osx.h GEN util/virkeynametable_win32.h GEN ../../src/access/org.libvirt.api.policy GEN access/viraccessapicheck.h GEN access/viraccessapicheck.c GEN access/viraccessapicheckqemu.h GEN access/viraccessapicheckqemu.c GEN access/viraccessapichecklxc.h GEN access/viraccessapichecklxc.c GEN libvirt_access.xml GEN libvirt_access_qemu.xml GEN libvirt_access_lxc.xml GEN logging/log_protocol.h GEN logging/log_daemon_dispatch_stubs.h GEN locking/lock_protocol.h GEN locking/lock_daemon_dispatch_stubs.h GEN admin/admin_protocol.h GEN admin/admin_client.h GEN admin/admin_server_dispatch_stubs.h GEN rpc/virnetprotocol.h GEN rpc/virkeepaliveprotocol.h GEN .esx_vi_generator.stamp GEN .hyperv_wmi_generator.stamp GEN lxc/lxc_monitor_protocol.h GEN lxc/lxc_monitor_dispatch.h GEN ../../src/hyperv/hyperv_wmi_classes.generated.typedef GEN ../../src/hyperv/hyperv_wmi_classes.generated.h GEN ../../src/hyperv/hyperv_wmi_classes.generated.c GEN lxc/lxc_controller_dispatch.h GEN ../../src/esx/esx_vi_types.generated.typedef GEN ../../src/esx/esx_vi_types.generated.typeenum GEN ../../src/esx/esx_vi_types.generated.typetostring GEN ../../src/esx/esx_vi_types.generated.typefromstring GEN ../../src/esx/esx_vi_types.generated.h GEN ../../src/esx/esx_vi_types.generated.c GEN ../../src/esx/esx_vi_methods.generated.h GEN ../../src/esx/esx_vi_methods.generated.c GEN ../../src/esx/esx_vi_methods.generated.macro GEN ../../src/esx/esx_vi.generated.h GEN ../../src/esx/esx_vi.generated.c GEN remote/remote_protocol.h GEN remote/remote_client_bodies.h GEN remote/lxc_protocol.h GEN remote/lxc_client_bodies.h GEN remote/qemu_protocol.h GEN remote/qemu_client_bodies.h GEN remote/remote_daemon_dispatch_stubs.h GEN remote/remote_daemon_dispatch_lxc_stubs.h GEN remote/remote_daemon_dispatch_qemu_stubs.h GEN libvirt_access.syms GEN libvirt_access_qemu.syms GEN libvirt_access_lxc.syms GEN libvirt_qemu.def GEN libvirt_lxc.def GEN libvirt_admin.syms GEN libvirtd.qemu.logrotate GEN libvirtd.lxc.logrotate GEN libvirtd.libxl.logrotate GEN libvirtd.uml.logrotate GEN libvirtd.logrotate GEN logging/log_protocol.c GEN locking/lock_protocol.c GEN admin/admin_protocol.c GEN rpc/virnetprotocol.c GEN rpc/virkeepaliveprotocol.c GEN lxc/lxc_monitor_protocol.c GEN remote/remote_protocol.c GEN remote/lxc_protocol.c GEN remote/qemu_protocol.c GEN libvirt.syms GEN libvirt_admin.def GEN libvirt.def /usr/bin/gmake all-am gmake[3]: Entering directory '<https://ci.centos.org/job/libvirt+mingw32-build/systems=libvirt-fedora-rawh…'> CC libvirt_driver_la-driver.lo CC libvirt_driver_la-datatypes.lo CC libvirt_driver_la-libvirt.lo CC libvirt_driver_la-libvirt-domain.lo CC libvirt_driver_la-libvirt-domain-snapshot.lo CC libvirt_driver_la-libvirt-host.lo CC libvirt_driver_la-libvirt-interface.lo CC libvirt_driver_la-libvirt-network.lo CC libvirt_driver_la-libvirt-nodedev.lo CC libvirt_driver_la-libvirt-nwfilter.lo CC libvirt_driver_la-libvirt-secret.lo CC libvirt_driver_la-libvirt-storage.lo CC libvirt_driver_la-libvirt-stream.lo CC libvirt_qemu_la-libvirt-qemu.lo CC libvirt_lxc_la-libvirt-lxc.lo CC libvirt_admin_la-libvirt-admin.lo CC libvirt_admin_la-datatypes.lo CC admin/libvirt_driver_admin_la-admin_protocol.lo CC admin/libvirt_driver_admin_la-admin_server.lo CC admin/libvirt_driver_admin_la-admin_server_dispatch.lo GEN util/virkeycode-linux.pod GEN util/virkeycode-osx.pod GEN util/virkeycode-atset1.pod GEN util/virkeycode-atset2.pod GEN util/virkeycode-atset3.pod GEN util/virkeycode-xtkbd.pod GEN util/virkeycode-usb.pod GEN util/virkeycode-win32.pod GEN util/virkeycode-qnum.pod GEN util/virkeyname-linux.pod GEN util/virkeyname-osx.pod GEN util/virkeyname-win32.pod CC util/libvirt_util_la-viralloc.lo CC util/libvirt_util_la-virarch.lo CC util/libvirt_util_la-virarptable.lo CC util/libvirt_util_la-viratomic.lo CC util/libvirt_util_la-viraudit.lo CC util/libvirt_util_la-virauth.lo CC util/libvirt_util_la-virauthconfig.lo CC util/libvirt_util_la-virbitmap.lo CC util/libvirt_util_la-virbuffer.lo CC util/libvirt_util_la-virperf.lo CC util/libvirt_util_la-vircgroup.lo CC util/libvirt_util_la-vircgroupbackend.lo CC util/libvirt_util_la-vircgroupv1.lo CC util/libvirt_util_la-vircgroupv2.lo CC util/libvirt_util_la-virclosecallbacks.lo CC util/libvirt_util_la-vircommand.lo CC util/libvirt_util_la-virconf.lo CC util/libvirt_util_la-vircrypto.lo CC util/libvirt_util_la-virdbus.lo CC util/libvirt_util_la-virdevmapper.lo CC util/libvirt_util_la-virdnsmasq.lo CC util/libvirt_util_la-virebtables.lo CC util/libvirt_util_la-virerror.lo CC util/libvirt_util_la-virevent.lo CC util/libvirt_util_la-vireventpoll.lo CC util/libvirt_util_la-virfcp.lo CC util/libvirt_util_la-virfdstream.lo CC util/libvirt_util_la-virfile.lo CC util/libvirt_util_la-virfirewall.lo CC util/libvirt_util_la-virfirmware.lo CC util/libvirt_util_la-virgettext.lo CC util/libvirt_util_la-virgic.lo CC util/libvirt_util_la-virhash.lo CC util/libvirt_util_la-virhashcode.lo CC util/libvirt_util_la-virhook.lo CC util/libvirt_util_la-virhostcpu.lo CC util/libvirt_util_la-virhostdev.lo CC util/libvirt_util_la-virhostmem.lo CC util/libvirt_util_la-viridentity.lo CC util/libvirt_util_la-virinitctl.lo CC util/libvirt_util_la-viriptables.lo CC util/libvirt_util_la-viriscsi.lo CC util/libvirt_util_la-virjson.lo CC util/libvirt_util_la-virkeycode.lo CC util/libvirt_util_la-virkeyfile.lo CC util/libvirt_util_la-virlease.lo CC util/libvirt_util_la-virlockspace.lo CC util/libvirt_util_la-virlog.lo CC util/libvirt_util_la-virmacaddr.lo CC util/libvirt_util_la-virmacmap.lo CC util/libvirt_util_la-virmodule.lo CC util/libvirt_util_la-virnetdev.lo CC util/libvirt_util_la-virnetdevbandwidth.lo CC util/libvirt_util_la-virnetdevbridge.lo CC util/libvirt_util_la-virnetdevip.lo CC util/libvirt_util_la-virnetdevmacvlan.lo CC util/libvirt_util_la-virnetdevmidonet.lo CC util/libvirt_util_la-virnetdevopenvswitch.lo CC util/libvirt_util_la-virnetdevtap.lo CC util/libvirt_util_la-virnetdevveth.lo CC util/libvirt_util_la-virnetdevvlan.lo CC util/libvirt_util_la-virnetdevvportprofile.lo CC util/libvirt_util_la-virnetlink.lo CC util/libvirt_util_la-virnodesuspend.lo CC util/libvirt_util_la-virkmod.lo CC util/libvirt_util_la-virnuma.lo CC util/libvirt_util_la-virobject.lo CC util/libvirt_util_la-virpci.lo CC util/libvirt_util_la-virpidfile.lo CC util/libvirt_util_la-virpolkit.lo CC util/libvirt_util_la-virportallocator.lo CC util/libvirt_util_la-virprocess.lo CC util/libvirt_util_la-virqemu.lo CC util/libvirt_util_la-virrandom.lo CC util/libvirt_util_la-virresctrl.lo CC util/libvirt_util_la-virrotatingfile.lo CC util/libvirt_util_la-virscsi.lo CC util/libvirt_util_la-virscsihost.lo CC util/libvirt_util_la-virscsivhost.lo CC util/libvirt_util_la-virseclabel.lo CC util/libvirt_util_la-virsecret.lo CC util/libvirt_util_la-virsexpr.lo CC util/libvirt_util_la-virsocketaddr.lo CC util/libvirt_util_la-virstorageencryption.lo CC util/libvirt_util_la-virstoragefile.lo CC util/libvirt_util_la-virstoragefilebackend.lo CC util/libvirt_util_la-virstring.lo CC util/libvirt_util_la-virsysinfo.lo CC util/libvirt_util_la-virsystemd.lo CC util/libvirt_util_la-virthread.lo CC util/libvirt_util_la-virthreadjob.lo CC util/libvirt_util_la-virthreadpool.lo CC util/libvirt_util_la-virtime.lo CC util/libvirt_util_la-virtpm.lo CC util/libvirt_util_la-virtypedparam.lo CC util/libvirt_util_la-virusb.lo CC util/libvirt_util_la-viruri.lo CC util/libvirt_util_la-virutil.lo CC util/libvirt_util_la-viruuid.lo CC util/libvirt_util_la-virvhba.lo CC util/libvirt_util_la-virvsock.lo CC util/libvirt_util_la-virxml.lo CC util/libvirt_util_la-virmdev.lo ../../src/util/virutil.c: In function 'virHostGetDRMRenderNode': ../../src/util/virutil.c:2175:18: error: 'struct dirent' has no member named 'd_type'; did you mean 'd_name'? if (ent->d_type != DT_CHR) ^~~~~~ d_name ../../src/util/virutil.c:2175:28: error: 'DT_CHR' undeclared (first use in this function); did you mean 'VT_CF'? if (ent->d_type != DT_CHR) ^~~~~~ VT_CF ../../src/util/virutil.c:2175:28: note: each undeclared identifier is reported only once for each function it appears in gmake[3]: *** [Makefile:12228: util/libvirt_util_la-virutil.lo] Error 1 gmake[3]: *** Waiting for unfinished jobs.... rm util/virkeyname-osx.pod util/virkeycode-atset3.pod util/virkeycode-usb.pod util/virkeycode-qnum.pod util/virkeycode-xtkbd.pod util/virkeycode-win32.pod util/virkeyname-linux.pod util/virkeycode-osx.pod util/virkeycode-linux.pod util/virkeycode-atset1.pod util/virkeyname-win32.pod util/virkeycode-atset2.pod gmake[3]: Leaving directory '<https://ci.centos.org/job/libvirt+mingw32-build/systems=libvirt-fedora-rawh…'> gmake[2]: *** [Makefile:7025: all] Error 2 gmake[2]: Leaving directory '<https://ci.centos.org/job/libvirt+mingw32-build/systems=libvirt-fedora-rawh…'> gmake[1]: *** [Makefile:2111: all-recursive] Error 1 gmake[1]: Leaving directory '<https://ci.centos.org/job/libvirt+mingw32-build/systems=libvirt-fedora-rawh…'> gmake: *** [Makefile:2004: all] Error 2 Build step 'Execute shell' marked build as failure
1 2
0 0
[Libvirt-ci] Fixed: libvirt/libvirt#1843 (master - c57adc3)
by Travis CI 04 Dec '18

04 Dec '18
Build Update for libvirt/libvirt ------------------------------------- Build: #1843 Status: Fixed Duration: 20 mins and 58 secs Commit: c57adc3 (master) Author: Erik Skultety Message: util: Fix the build on MinGW because of missing DT_CHR dirent type Caused by commit 39480969 Signed-off-by: Erik Skultety <eskultet(a)redhat.com> View the changeset: https://github.com/libvirt/libvirt/compare/f39f881dc111...c57adc330016 View the full build log and details: https://travis-ci.org/libvirt/libvirt/builds/463229986?utm_medium=notificat… -- You can unsubscribe from build emails from the libvirt/libvirt repository going to https://travis-ci.org/account/preferences/unsubscribe?repository=4872032&ut…. Or unsubscribe from *all* email updating your settings at https://travis-ci.org/account/preferences/unsubscribe?utm_medium=notificati…. Or configure specific recipients for build notifications in your .travis.yml file. See https://docs.travis-ci.com/user/notifications.
1 0
0 0
[Libvirt-ci] Still Failing: libvirt/libvirt#1842 (master - f39f881)
by Travis CI 04 Dec '18

04 Dec '18
Build Update for libvirt/libvirt ------------------------------------- Build: #1842 Status: Still Failing Duration: 20 mins and 20 secs Commit: f39f881 (master) Author: Michal Privoznik Message: syncNicRxFilterMultiMode: Fix indentation The indentation of the code in this function is a bit off. Signed-off-by: Michal Privoznik <mprivozn(a)redhat.com> View the changeset: https://github.com/libvirt/libvirt/compare/3934beb8579c...f39f881dc111 View the full build log and details: https://travis-ci.org/libvirt/libvirt/builds/463200825?utm_medium=notificat… -- You can unsubscribe from build emails from the libvirt/libvirt repository going to https://travis-ci.org/account/preferences/unsubscribe?repository=4872032&ut…. Or unsubscribe from *all* email updating your settings at https://travis-ci.org/account/preferences/unsubscribe?utm_medium=notificati…. Or configure specific recipients for build notifications in your .travis.yml file. See https://docs.travis-ci.com/user/notifications.
1 0
0 0
[Libvirt-ci] Build failed in Jenkins: libvirt-go-xml-check » libvirt-fedora-rawhide #137
by ci@centos.org 03 Dec '18

03 Dec '18
See <https://ci.centos.org/job/libvirt-go-xml-check/systems=libvirt-fedora-rawhi…> ------------------------------------------ Started by upstream project "libvirt-go-xml-check" build number 137 originally caused by: Started by upstream project "libvirt-go-xml-build" build number 137 originally caused by: Started by upstream project "libvirt-build" build number 159 originally caused by: Started by an SCM change Started by an SCM change Started by an SCM change [EnvInject] - Loading node environment variables. Building remotely on libvirt-fedora-rawhide (libvirt) in workspace <https://ci.centos.org/job/libvirt-go-xml-check/systems=libvirt-fedora-rawhi…> [libvirt-go-xml] $ /bin/sh -xe /tmp/jenkins9214825045224614110.sh + export 'TEST_ARGS=-tags xmlroundtrip' + TEST_ARGS='-tags xmlroundtrip' + go test -tags xmlroundtrip --- FAIL: TestRoundTrip (19.74s) xml_test.go:390: testdata/libvirt/tests/qemuxml2argvdata/graphics-egl-headless-rendernode.xml: /domain[0]/devices[0]/graphics[0]/gl[0]: element in expected XML missing in actual XML FAIL exit status 1 FAIL _<https://ci.centos.org/job/libvirt-go-xml-check/systems=libvirt-fedora-rawhi…> 19.917s Build step 'Execute shell' marked build as failure
1 1
0 0
[Libvirt-ci] Build failed in Jenkins: libvirt-go-xml-check » libvirt-fedora-28 #137
by ci@centos.org 03 Dec '18

03 Dec '18
See <https://ci.centos.org/job/libvirt-go-xml-check/systems=libvirt-fedora-28/13…> ------------------------------------------ Started by upstream project "libvirt-go-xml-check" build number 137 originally caused by: Started by upstream project "libvirt-go-xml-build" build number 137 originally caused by: Started by upstream project "libvirt-build" build number 159 originally caused by: Started by an SCM change Started by an SCM change Started by an SCM change [EnvInject] - Loading node environment variables. Building remotely on libvirt-fedora-28 (libvirt) in workspace <https://ci.centos.org/job/libvirt-go-xml-check/systems=libvirt-fedora-28/ws/> [libvirt-go-xml] $ /bin/sh -xe /tmp/jenkins4818429989148872229.sh + export 'TEST_ARGS=-tags xmlroundtrip' + TEST_ARGS='-tags xmlroundtrip' + go test -tags xmlroundtrip --- FAIL: TestRoundTrip (20.51s) xml_test.go:390: testdata/libvirt/tests/qemuxml2argvdata/graphics-egl-headless-rendernode.xml: /domain[0]/devices[0]/graphics[0]/gl[0]: element in expected XML missing in actual XML FAIL exit status 1 FAIL _<https://ci.centos.org/job/libvirt-go-xml-check/systems=libvirt-fedora-28/ws/> 20.614s Build step 'Execute shell' marked build as failure
1 1
0 0
[Libvirt-ci] Build failed in Jenkins: libvirt-go-xml-check » libvirt-fedora-29 #137
by ci@centos.org 03 Dec '18

03 Dec '18
See <https://ci.centos.org/job/libvirt-go-xml-check/systems=libvirt-fedora-29/13…> ------------------------------------------ Started by upstream project "libvirt-go-xml-check" build number 137 originally caused by: Started by upstream project "libvirt-go-xml-build" build number 137 originally caused by: Started by upstream project "libvirt-build" build number 159 originally caused by: Started by an SCM change Started by an SCM change Started by an SCM change [EnvInject] - Loading node environment variables. Building remotely on libvirt-fedora-29 (libvirt) in workspace <https://ci.centos.org/job/libvirt-go-xml-check/systems=libvirt-fedora-29/ws/> [libvirt-go-xml] $ /bin/sh -xe /tmp/jenkins1781384250716015172.sh + export 'TEST_ARGS=-tags xmlroundtrip' + TEST_ARGS='-tags xmlroundtrip' + go test -tags xmlroundtrip --- FAIL: TestRoundTrip (13.87s) xml_test.go:390: testdata/libvirt/tests/qemuxml2argvdata/graphics-egl-headless-rendernode.xml: /domain[0]/devices[0]/graphics[0]/gl[0]: element in expected XML missing in actual XML FAIL exit status 1 FAIL _<https://ci.centos.org/job/libvirt-go-xml-check/systems=libvirt-fedora-29/ws/> 13.973s Build step 'Execute shell' marked build as failure
1 1
0 0
[Libvirt-ci] Build failed in Jenkins: libvirt-go-xml-check » libvirt-centos-7 #137
by ci@centos.org 03 Dec '18

03 Dec '18
See <https://ci.centos.org/job/libvirt-go-xml-check/systems=libvirt-centos-7/137…> ------------------------------------------ Started by upstream project "libvirt-go-xml-check" build number 137 originally caused by: Started by upstream project "libvirt-go-xml-build" build number 137 originally caused by: Started by upstream project "libvirt-build" build number 159 originally caused by: Started by an SCM change Started by an SCM change Started by an SCM change [EnvInject] - Loading node environment variables. Building remotely on libvirt-centos-7 (libvirt) in workspace <https://ci.centos.org/job/libvirt-go-xml-check/systems=libvirt-centos-7/ws/> [libvirt-go-xml] $ /bin/sh -xe /tmp/jenkins4006136473641634585.sh + export 'TEST_ARGS=-tags xmlroundtrip' + TEST_ARGS='-tags xmlroundtrip' + go test -tags xmlroundtrip --- FAIL: TestRoundTrip (25.39s) xml_test.go:390: testdata/libvirt/tests/qemuxml2argvdata/graphics-egl-headless-rendernode.xml: /domain[0]/devices[0]/graphics[0]/gl[0]: element in expected XML missing in actual XML FAIL exit status 1 FAIL _<https://ci.centos.org/job/libvirt-go-xml-check/systems=libvirt-centos-7/ws/> 25.461s Build step 'Execute shell' marked build as failure
1 1
0 0
[Libvirt-ci] Build failed in Jenkins: libvirt-go-xml-check » libvirt-debian-9 #137
by ci@centos.org 03 Dec '18

03 Dec '18
See <https://ci.centos.org/job/libvirt-go-xml-check/systems=libvirt-debian-9/137…> ------------------------------------------ Started by upstream project "libvirt-go-xml-check" build number 137 originally caused by: Started by upstream project "libvirt-go-xml-build" build number 137 originally caused by: Started by upstream project "libvirt-build" build number 159 originally caused by: Started by an SCM change Started by an SCM change Started by an SCM change [EnvInject] - Loading node environment variables. Building remotely on libvirt-debian-9 (libvirt) in workspace <https://ci.centos.org/job/libvirt-go-xml-check/systems=libvirt-debian-9/ws/> [libvirt-go-xml] $ /bin/sh -xe /tmp/jenkins3250984995950550130.sh + export TEST_ARGS=-tags xmlroundtrip + go test -tags xmlroundtrip --- FAIL: TestRoundTrip (16.42s) xml_test.go:390: testdata/libvirt/tests/qemuxml2argvdata/graphics-egl-headless-rendernode.xml: /domain[0]/devices[0]/graphics[0]/gl[0]: element in expected XML missing in actual XML FAIL exit status 1 FAIL _<https://ci.centos.org/job/libvirt-go-xml-check/systems=libvirt-debian-9/ws/> 16.520s Build step 'Execute shell' marked build as failure
1 1
0 0
[Libvirt-ci] Build failed in Jenkins: libvirt-go-xml-check » libvirt-debian-8 #137
by ci@centos.org 03 Dec '18

03 Dec '18
See <https://ci.centos.org/job/libvirt-go-xml-check/systems=libvirt-debian-8/137…> ------------------------------------------ Started by upstream project "libvirt-go-xml-check" build number 137 originally caused by: Started by upstream project "libvirt-go-xml-build" build number 137 originally caused by: Started by upstream project "libvirt-build" build number 159 originally caused by: Started by an SCM change Started by an SCM change Started by an SCM change [EnvInject] - Loading node environment variables. Building remotely on libvirt-debian-8 (libvirt) in workspace <https://ci.centos.org/job/libvirt-go-xml-check/systems=libvirt-debian-8/ws/> [libvirt-go-xml] $ /bin/sh -xe /tmp/jenkins4597723341744954327.sh + export TEST_ARGS=-tags xmlroundtrip + go test -tags xmlroundtrip --- FAIL: TestRoundTrip (11.22s) xml_test.go:390: testdata/libvirt/tests/qemuxml2argvdata/graphics-egl-headless-rendernode.xml: /domain[0]/devices[0]/graphics[0]/gl[0]: element in expected XML missing in actual XML FAIL exit status 1 FAIL _<https://ci.centos.org/job/libvirt-go-xml-check/systems=libvirt-debian-8/ws/> 11.290s Build step 'Execute shell' marked build as failure
1 1
0 0
[Libvirt-ci] Build failed in Jenkins: libvirt-go-xml-check » libvirt-freebsd-11 #137
by ci@centos.org 03 Dec '18

03 Dec '18
See <https://ci.centos.org/job/libvirt-go-xml-check/systems=libvirt-freebsd-11/1…> ------------------------------------------ Started by upstream project "libvirt-go-xml-check" build number 137 originally caused by: Started by upstream project "libvirt-go-xml-build" build number 137 originally caused by: Started by upstream project "libvirt-build" build number 159 originally caused by: Started by an SCM change Started by an SCM change Started by an SCM change [EnvInject] - Loading node environment variables. Building remotely on libvirt-freebsd-11 (libvirt) in workspace <https://ci.centos.org/job/libvirt-go-xml-check/systems=libvirt-freebsd-11/w…> [libvirt-go-xml] $ /bin/sh -xe /tmp/jenkins3272689145020378698.sh + export 'TEST_ARGS=-tags xmlroundtrip' + go test -tags xmlroundtrip --- FAIL: TestRoundTrip (12.13s) xml_test.go:390: testdata/libvirt/tests/qemuxml2argvdata/graphics-egl-headless-rendernode.xml: /domain[0]/devices[0]/graphics[0]/gl[0]: element in expected XML missing in actual XML FAIL exit status 1 FAIL _/usr<https://ci.centos.org/job/libvirt-go-xml-check/systems=libvirt-freebsd-11/w…> 12.220s Build step 'Execute shell' marked build as failure
1 1
0 0
  • ← Newer
  • 1
  • ...
  • 800
  • 801
  • 802
  • 803
  • 804
  • 805
  • 806
  • ...
  • 1022
  • Older →

HyperKitty Powered by HyperKitty version 1.3.12.