libvirt List Archives
Sign In Sign Up
Manage this list Sign In Sign Up

Keyboard Shortcuts

Thread View

  • j: Next unread message
  • k: Previous unread message
  • j a: Jump to all threads
  • j l: Jump to MailingList overview

CI

Thread Start a new thread
Download
Threads by month
  • ----- 2026 -----
  • September
  • August
  • July
  • June
  • May
  • April
  • March
  • February
  • January
  • ----- 2025 -----
  • December
  • November
  • October
  • September
  • August
  • July
  • June
  • May
  • April
  • March
  • February
  • January
  • ----- 2024 -----
  • December
  • November
  • October
  • September
  • August
  • July
  • June
  • May
  • April
  • March
  • February
  • January
  • ----- 2023 -----
  • December
  • November
  • October
  • September
  • August
  • July
  • June
  • May
  • April
  • March
  • February
  • January
  • ----- 2022 -----
  • December
  • November
  • October
  • September
  • August
  • July
  • June
  • May
  • April
  • March
  • February
  • January
  • ----- 2021 -----
  • December
  • November
  • October
  • September
  • August
  • July
  • June
  • May
  • April
  • March
  • February
  • January
  • ----- 2020 -----
  • December
  • November
  • October
  • September
  • August
  • July
  • June
  • May
  • April
  • March
  • February
  • January
  • ----- 2019 -----
  • December
  • November
  • October
  • September
  • August
  • July
  • June
  • May
  • April
  • March
  • February
  • January
  • ----- 2018 -----
  • December
  • November
  • October
  • September
  • August
  • July
  • June
  • May
  • April
  • March
  • February
  • January
  • ----- 2017 -----
  • December
  • November
  • October
  • September
  • August
  • July
  • June
  • May
  • April
  • March
  • February
  • January
  • ----- 2016 -----
  • December
  • November
  • October
  • September
  • August
  • July
ci@lists.libvirt.org

  • 2 participants
  • 10210 discussions
[Libvirt-ci] Build failed in Jenkins: libosinfo-syntax-check » libvirt-freebsd-12 #218
by ci@centos.org 25 Sep '19

25 Sep '19
See <https://ci.centos.org/job/libosinfo-syntax-check/systems=libvirt-freebsd-12…> ------------------------------------------ Started by upstream project "libosinfo-syntax-check" build number 218 originally caused by: Started by upstream project "libosinfo-build" build number 242 originally caused by: Started by an SCM change Started by an SCM change Running as SYSTEM [EnvInject] - Loading node environment variables. Building remotely on libvirt-freebsd-12 (libvirt) in workspace <https://ci.centos.org/job/libosinfo-syntax-check/systems=libvirt-freebsd-12…> [libosinfo] $ /bin/sh -xe /tmp/jenkins17558168069332101838.sh + cd build + /usr/local/bin/gmake syntax-check gmake: *** No rule to make target 'syntax-check'. Stop. Build step 'Execute shell' marked build as failure
1 1
0 0
[Libvirt-ci] Build failed in Jenkins: libosinfo-syntax-check » libvirt-freebsd-11 #218
by ci@centos.org 25 Sep '19

25 Sep '19
See <https://ci.centos.org/job/libosinfo-syntax-check/systems=libvirt-freebsd-11…> ------------------------------------------ Started by upstream project "libosinfo-syntax-check" build number 218 originally caused by: Started by upstream project "libosinfo-build" build number 242 originally caused by: Started by an SCM change Started by an SCM change Running as SYSTEM [EnvInject] - Loading node environment variables. Building remotely on libvirt-freebsd-11 (libvirt) in workspace <https://ci.centos.org/job/libosinfo-syntax-check/systems=libvirt-freebsd-11…> [libosinfo] $ /bin/sh -xe /tmp/jenkins15242487689882967358.sh + cd build + /usr/local/bin/gmake syntax-check gmake: *** No rule to make target 'syntax-check'. Stop. Build step 'Execute shell' marked build as failure
1 1
0 0
[Libvirt-ci] Build failed in Jenkins: libosinfo-syntax-check » libvirt-debian-10 #218
by ci@centos.org 25 Sep '19

25 Sep '19
See <https://ci.centos.org/job/libosinfo-syntax-check/systems=libvirt-debian-10/…> ------------------------------------------ Started by upstream project "libosinfo-syntax-check" build number 218 originally caused by: Started by upstream project "libosinfo-build" build number 242 originally caused by: Started by an SCM change Started by an SCM change Running as SYSTEM [EnvInject] - Loading node environment variables. Building remotely on libvirt-debian-10 (libvirt) in workspace <https://ci.centos.org/job/libosinfo-syntax-check/systems=libvirt-debian-10/…> [libosinfo] $ /bin/sh -xe /tmp/jenkins15084865485368826443.sh + cd build + /usr/bin/make syntax-check make: *** No rule to make target 'syntax-check'. Stop. Build step 'Execute shell' marked build as failure
1 1
0 0
[Libvirt-ci] Build failed in Jenkins: libosinfo-syntax-check » libvirt-fedora-rawhide #218
by ci@centos.org 25 Sep '19

25 Sep '19
See <https://ci.centos.org/job/libosinfo-syntax-check/systems=libvirt-fedora-raw…> ------------------------------------------ Started by upstream project "libosinfo-syntax-check" build number 218 originally caused by: Started by upstream project "libosinfo-build" build number 242 originally caused by: Started by an SCM change Started by an SCM change Running as SYSTEM [EnvInject] - Loading node environment variables. Building remotely on libvirt-fedora-rawhide (libvirt) in workspace <https://ci.centos.org/job/libosinfo-syntax-check/systems=libvirt-fedora-raw…> [libosinfo] $ /bin/sh -xe /tmp/jenkins2376457283770358766.sh + cd build + /usr/bin/gmake syntax-check gmake: *** No rule to make target 'syntax-check'. Stop. Build step 'Execute shell' marked build as failure
1 1
0 0
[Libvirt-ci] Build failed in Jenkins: osinfo-db-tools-syntax-check » libvirt-freebsd-12 #37
by ci@centos.org 25 Sep '19

25 Sep '19
See <https://ci.centos.org/job/osinfo-db-tools-syntax-check/systems=libvirt-free…> ------------------------------------------ Started by upstream project "osinfo-db-tools-syntax-check" build number 37 originally caused by: Started by upstream project "osinfo-db-tools-build" build number 38 originally caused by: Started by an SCM change Started by an SCM change Running as SYSTEM [EnvInject] - Loading node environment variables. Building remotely on libvirt-freebsd-12 (libvirt) in workspace <https://ci.centos.org/job/osinfo-db-tools-syntax-check/systems=libvirt-free…> [osinfo-db-tools] $ /bin/sh -xe /tmp/jenkins16111599603938701941.sh + cd build + ninja syntax-check ninja: error: unknown target 'syntax-check' Build step 'Execute shell' marked build as failure
1 0
0 0
[Libvirt-ci] Build failed in Jenkins: osinfo-db-tools-syntax-check » libvirt-fedora-30 #37
by ci@centos.org 25 Sep '19

25 Sep '19
See <https://ci.centos.org/job/osinfo-db-tools-syntax-check/systems=libvirt-fedo…> ------------------------------------------ Started by upstream project "osinfo-db-tools-syntax-check" build number 37 originally caused by: Started by upstream project "osinfo-db-tools-build" build number 38 originally caused by: Started by an SCM change Started by an SCM change Running as SYSTEM [EnvInject] - Loading node environment variables. Building remotely on libvirt-fedora-30 (libvirt) in workspace <https://ci.centos.org/job/osinfo-db-tools-syntax-check/systems=libvirt-fedo…> [osinfo-db-tools] $ /bin/sh -xe /tmp/jenkins15419436235227888802.sh + cd build + ninja syntax-check ninja: error: unknown target 'syntax-check' Build step 'Execute shell' marked build as failure
1 0
0 0
[Libvirt-ci] Build failed in Jenkins: osinfo-db-tools-syntax-check » libvirt-freebsd-11 #37
by ci@centos.org 25 Sep '19

25 Sep '19
See <https://ci.centos.org/job/osinfo-db-tools-syntax-check/systems=libvirt-free…> ------------------------------------------ Started by upstream project "osinfo-db-tools-syntax-check" build number 37 originally caused by: Started by upstream project "osinfo-db-tools-build" build number 38 originally caused by: Started by an SCM change Started by an SCM change Running as SYSTEM [EnvInject] - Loading node environment variables. Building remotely on libvirt-freebsd-11 (libvirt) in workspace <https://ci.centos.org/job/osinfo-db-tools-syntax-check/systems=libvirt-free…> [osinfo-db-tools] $ /bin/sh -xe /tmp/jenkins617394916085648716.sh + cd build + ninja syntax-check ninja: error: unknown target 'syntax-check' Build step 'Execute shell' marked build as failure
1 0
0 0
[Libvirt-ci] Build failed in Jenkins: osinfo-db-tools-syntax-check » libvirt-fedora-29 #37
by ci@centos.org 25 Sep '19

25 Sep '19
See <https://ci.centos.org/job/osinfo-db-tools-syntax-check/systems=libvirt-fedo…> ------------------------------------------ Started by upstream project "osinfo-db-tools-syntax-check" build number 37 originally caused by: Started by upstream project "osinfo-db-tools-build" build number 38 originally caused by: Started by an SCM change Started by an SCM change Running as SYSTEM [EnvInject] - Loading node environment variables. Building remotely on libvirt-fedora-29 (libvirt) in workspace <https://ci.centos.org/job/osinfo-db-tools-syntax-check/systems=libvirt-fedo…> [osinfo-db-tools] $ /bin/sh -xe /tmp/jenkins5124989056679791992.sh + cd build + ninja syntax-check ninja: error: unknown target 'syntax-check' Build step 'Execute shell' marked build as failure
1 0
0 0
[Libvirt-ci] Build failed in Jenkins: osinfo-db-tools-syntax-check » libvirt-debian-10 #37
by ci@centos.org 25 Sep '19

25 Sep '19
See <https://ci.centos.org/job/osinfo-db-tools-syntax-check/systems=libvirt-debi…> ------------------------------------------ Started by upstream project "osinfo-db-tools-syntax-check" build number 37 originally caused by: Started by upstream project "osinfo-db-tools-build" build number 38 originally caused by: Started by an SCM change Started by an SCM change Running as SYSTEM [EnvInject] - Loading node environment variables. Building remotely on libvirt-debian-10 (libvirt) in workspace <https://ci.centos.org/job/osinfo-db-tools-syntax-check/systems=libvirt-debi…> [osinfo-db-tools] $ /bin/sh -xe /tmp/jenkins13040199861048489227.sh + cd build + ninja syntax-check ninja: error: unknown target 'syntax-check' Build step 'Execute shell' marked build as failure
1 0
0 0
[Libvirt-ci] Build failed in Jenkins: osinfo-db-tools-syntax-check » libvirt-fedora-rawhide #37
by ci@centos.org 25 Sep '19

25 Sep '19
See <https://ci.centos.org/job/osinfo-db-tools-syntax-check/systems=libvirt-fedo…> ------------------------------------------ Started by upstream project "osinfo-db-tools-syntax-check" build number 37 originally caused by: Started by upstream project "osinfo-db-tools-build" build number 38 originally caused by: Started by an SCM change Started by an SCM change Running as SYSTEM [EnvInject] - Loading node environment variables. Building remotely on libvirt-fedora-rawhide (libvirt) in workspace <https://ci.centos.org/job/osinfo-db-tools-syntax-check/systems=libvirt-fedo…> [osinfo-db-tools] $ /bin/sh -xe /tmp/jenkins17732026587506956579.sh + cd build + ninja syntax-check ninja: error: unknown target 'syntax-check' Build step 'Execute shell' marked build as failure
1 0
0 0
  • ← Newer
  • 1
  • ...
  • 690
  • 691
  • 692
  • 693
  • 694
  • 695
  • 696
  • ...
  • 1021
  • Older →

HyperKitty Powered by HyperKitty version 1.3.12.