libvirt List Archives
Sign In Sign Up
Manage this list Sign In Sign Up

Keyboard Shortcuts

Thread View

  • j: Next unread message
  • k: Previous unread message
  • j a: Jump to all threads
  • j l: Jump to MailingList overview

CI

Thread Start a new thread
Download
Threads by month
  • ----- 2026 -----
  • September
  • August
  • July
  • June
  • May
  • April
  • March
  • February
  • January
  • ----- 2025 -----
  • December
  • November
  • October
  • September
  • August
  • July
  • June
  • May
  • April
  • March
  • February
  • January
  • ----- 2024 -----
  • December
  • November
  • October
  • September
  • August
  • July
  • June
  • May
  • April
  • March
  • February
  • January
  • ----- 2023 -----
  • December
  • November
  • October
  • September
  • August
  • July
  • June
  • May
  • April
  • March
  • February
  • January
  • ----- 2022 -----
  • December
  • November
  • October
  • September
  • August
  • July
  • June
  • May
  • April
  • March
  • February
  • January
  • ----- 2021 -----
  • December
  • November
  • October
  • September
  • August
  • July
  • June
  • May
  • April
  • March
  • February
  • January
  • ----- 2020 -----
  • December
  • November
  • October
  • September
  • August
  • July
  • June
  • May
  • April
  • March
  • February
  • January
  • ----- 2019 -----
  • December
  • November
  • October
  • September
  • August
  • July
  • June
  • May
  • April
  • March
  • February
  • January
  • ----- 2018 -----
  • December
  • November
  • October
  • September
  • August
  • July
  • June
  • May
  • April
  • March
  • February
  • January
  • ----- 2017 -----
  • December
  • November
  • October
  • September
  • August
  • July
  • June
  • May
  • April
  • March
  • February
  • January
  • ----- 2016 -----
  • December
  • November
  • October
  • September
  • August
  • July
ci@lists.libvirt.org

  • 2 participants
  • 10210 discussions
[Libvirt-ci] Still Failing: libvirt/libvirt#2786 (master - b3739aa)
by Travis CI 23 Oct '19

23 Oct '19
Build Update for libvirt/libvirt ------------------------------------- Build: #2786 Status: Still Failing Duration: 30 mins and 17 secs Commit: b3739aa (master) Author: Michal Privoznik Message: .gitignore: Ignore src/admin/libvirt_admin.{def,syms} In v5.8.0-332-g3097282d86 the libvirt-admin.so was moved into src/admin/ directory. However, corresponding .gitignore change was left out. Signed-off-by: Michal Privoznik <mprivozn(a)redhat.com> View the changeset: https://github.com/libvirt/libvirt/compare/67a61a1bf693...b3739aa63f89 View the full build log and details: https://travis-ci.org/libvirt/libvirt/builds/601825389?utm_medium=notificat… -- You can unsubscribe from build emails from the libvirt/libvirt repository going to https://travis-ci.org/account/preferences/unsubscribe?repository=4872032&ut…. Or unsubscribe from *all* email updating your settings at https://travis-ci.org/account/preferences/unsubscribe?utm_medium=notificati…. Or configure specific recipients for build notifications in your .travis.yml file. See https://docs.travis-ci.com/user/notifications.
1 0
0 0
[Libvirt-ci] Broken: libvirt/libvirt#2785 (master - 67a61a1)
by Travis CI 23 Oct '19

23 Oct '19
Build Update for libvirt/libvirt ------------------------------------- Build: #2785 Status: Broken Duration: 27 mins and 35 secs Commit: 67a61a1 (master) Author: Pavel Hrdina Message: docs: generate files into build dir and stop distributing them Historically we did not support VPATH builds and everything was generated into source directory. The introduction of VPATH builds did not changed the way how our documentation is handled. This patch changes the rules to generate everything into build directory and stops distributing generated files in order to have properly separated VPATH builds. Signed-off-by: Pavel Hrdina <phrdina(a)redhat.com> Reviewed-by: Ján Tomko <jtomko(a)redhat.com> View the changeset: https://github.com/libvirt/libvirt/compare/c8007fdc5d2c...67a61a1bf693 View the full build log and details: https://travis-ci.org/libvirt/libvirt/builds/601811520?utm_medium=notificat… -- You can unsubscribe from build emails from the libvirt/libvirt repository going to https://travis-ci.org/account/preferences/unsubscribe?repository=4872032&ut…. Or unsubscribe from *all* email updating your settings at https://travis-ci.org/account/preferences/unsubscribe?utm_medium=notificati…. Or configure specific recipients for build notifications in your .travis.yml file. See https://docs.travis-ci.com/user/notifications.
1 0
0 0
[Libvirt-ci] Build failed in Jenkins: virt-manager-check » libvirt-fedora-30 #1200
by ci@centos.org 22 Oct '19

22 Oct '19
See <https://ci.centos.org/job/virt-manager-check/systems=libvirt-fedora-30/1200…> ------------------------------------------ Started by upstream project "virt-manager-check" build number 1200 originally caused by: Started by upstream project "virt-manager-build" build number 1204 originally caused by: Started by upstream project "libvirt-python-build" build number 810 originally caused by: Started by upstream project "libvirt-build" build number 936 originally caused by: Started by an SCM change Running as SYSTEM [EnvInject] - Loading node environment variables. Building remotely on libvirt-fedora-30 (libvirt) in workspace <https://ci.centos.org/job/virt-manager-check/systems=libvirt-fedora-30/ws/> [virt-manager] $ /bin/sh -xe /tmp/jenkins2835591097427250698.sh + /usr/bin/python3 ./setup.py test running test .........................................................................................................................................................................................................................................................................................................................................................................................F.......................................................................................................................................F.FF...........................F....ssssssssssssssssss ====================================================================== FAIL: testCLI0264virt_clone_clone_auto1 (tests.clitest.CLITests) ---------------------------------------------------------------------- Traceback (most recent call last): File "<https://ci.centos.org/job/virt-manager-check/systems=libvirt-fedora-30/ws/t…",> line 1444, in <lambda> return lambda s: cmdtemplate(s, cmd) File "<https://ci.centos.org/job/virt-manager-check/systems=libvirt-fedora-30/ws/t…",> line 1443, in cmdtemplate _cmdobj.run(self) File "<https://ci.centos.org/job/virt-manager-check/systems=libvirt-fedora-30/ws/t…",> line 344, in run tests.fail(err) AssertionError: ./virt-clone --connect __virtinst_test__test://<https://ci.centos.org/job/virt-manager-check/systems=libvirt-fedora-30/ws/t…> -o test-clone --auto-clone --clone-running --print-xml Conversion outputs did not match. --- tests/cli-test-xml/compare/virt-clone-clone-auto1.xml +++ Generated Output @@ -31,7 +31,7 @@ <readonly/> <address type="drive" controller="0" bus="0" target="0" unit="0"/> </disk> - <disk type="block" device="cdrom"> + <disk type="file" device="cdrom"> <target dev="sdb" bus="scsi"/> <readonly/> <address type="drive" controller="0" bus="0" target="0" unit="1"/> ====================================================================== FAIL: testCLI0400virt_xml_start_select_disk_bootorder (tests.clitest.CLITests) ---------------------------------------------------------------------- Traceback (most recent call last): File "<https://ci.centos.org/job/virt-manager-check/systems=libvirt-fedora-30/ws/t…",> line 1444, in <lambda> return lambda s: cmdtemplate(s, cmd) File "<https://ci.centos.org/job/virt-manager-check/systems=libvirt-fedora-30/ws/t…",> line 1443, in cmdtemplate _cmdobj.run(self) File "<https://ci.centos.org/job/virt-manager-check/systems=libvirt-fedora-30/ws/t…",> line 344, in run tests.fail(err) AssertionError: ./virt-xml test-state-shutoff --print-diff --start --define --edit target=vda --disk boot_order=1 --connect __virtinst_test__test://<https://ci.centos.org/job/virt-manager-check/systems=libvirt-fedora-30/ws/t…> Conversion outputs did not match. --- tests/cli-test-xml/compare/virt-xml-start-select-disk-bootorder.xml +++ Generated Output @@ -11,7 +11,7 @@ - <boot order="3"/> + <boot order="4"/> </disk> - <disk type="block" device="cdrom"> + <disk type="file" device="cdrom"> <target dev="hdc" bus="ide"/> <readonly/> - <boot order="1"/> ====================================================================== FAIL: testCLI0402virt_xml_start_select_disk_bootorder2 (tests.clitest.CLITests) ---------------------------------------------------------------------- Traceback (most recent call last): File "<https://ci.centos.org/job/virt-manager-check/systems=libvirt-fedora-30/ws/t…",> line 1444, in <lambda> return lambda s: cmdtemplate(s, cmd) File "<https://ci.centos.org/job/virt-manager-check/systems=libvirt-fedora-30/ws/t…",> line 1443, in cmdtemplate _cmdobj.run(self) File "<https://ci.centos.org/job/virt-manager-check/systems=libvirt-fedora-30/ws/t…",> line 344, in run tests.fail(err) AssertionError: ./virt-xml test-state-shutoff --print-diff --start --edit target=vda --disk boot_order=1 --connect __virtinst_test__test://<https://ci.centos.org/job/virt-manager-check/systems=libvirt-fedora-30/ws/t…> Conversion outputs did not match. --- tests/cli-test-xml/compare/virt-xml-start-select-disk-bootorder2.xml +++ Generated Output @@ -11,7 +11,7 @@ - <boot order="3"/> + <boot order="4"/> </disk> - <disk type="block" device="cdrom"> + <disk type="file" device="cdrom"> <target dev="hdc" bus="ide"/> <readonly/> - <boot order="1"/> ====================================================================== FAIL: testCLI0403virt_xml_start_select_disk_bootorder2 (tests.clitest.CLITests) ---------------------------------------------------------------------- Traceback (most recent call last): File "<https://ci.centos.org/job/virt-manager-check/systems=libvirt-fedora-30/ws/t…",> line 1444, in <lambda> return lambda s: cmdtemplate(s, cmd) File "<https://ci.centos.org/job/virt-manager-check/systems=libvirt-fedora-30/ws/t…",> line 1443, in cmdtemplate _cmdobj.run(self) File "<https://ci.centos.org/job/virt-manager-check/systems=libvirt-fedora-30/ws/t…",> line 344, in run tests.fail(err) AssertionError: ./virt-xml test-state-shutoff --print-diff --start --no-define --edit target=vda --disk boot_order=1 --connect __virtinst_test__test://<https://ci.centos.org/job/virt-manager-check/systems=libvirt-fedora-30/ws/t…> Conversion outputs did not match. --- tests/cli-test-xml/compare/virt-xml-start-select-disk-bootorder2.xml +++ Generated Output @@ -11,7 +11,7 @@ - <boot order="3"/> + <boot order="4"/> </disk> - <disk type="block" device="cdrom"> + <disk type="file" device="cdrom"> <target dev="hdc" bus="ide"/> <readonly/> - <boot order="1"/> ====================================================================== FAIL: testCLI0431virt_xml_remove_disk_path_start (tests.clitest.CLITests) ---------------------------------------------------------------------- Traceback (most recent call last): File "<https://ci.centos.org/job/virt-manager-check/systems=libvirt-fedora-30/ws/t…",> line 1444, in <lambda> return lambda s: cmdtemplate(s, cmd) File "<https://ci.centos.org/job/virt-manager-check/systems=libvirt-fedora-30/ws/t…",> line 1443, in cmdtemplate _cmdobj.run(self) File "<https://ci.centos.org/job/virt-manager-check/systems=libvirt-fedora-30/ws/t…",> line 344, in run tests.fail(err) AssertionError: ./virt-xml test-state-shutoff --print-diff --start --remove-device --disk /dev/null --connect __virtinst_test__test://<https://ci.centos.org/job/virt-manager-check/systems=libvirt-fedora-30/ws/t…> Conversion outputs did not match. --- tests/cli-test-xml/compare/virt-xml-remove-disk-path-start.xml +++ Generated Output @@ -13,7 +13,7 @@ - <target dev="vdb" bus="virtio"/> - <boot order="3"/> - </disk> - <disk type="block" device="cdrom"> + <disk type="file" device="cdrom"> <target dev="hdc" bus="ide"/> <readonly/> ---------------------------------------------------------------------- Ran 567 tests in 185.461s FAILED (failures=5, skipped=18) Build step 'Execute shell' marked build as failure
1 4
0 0
[Libvirt-ci] Build failed in Jenkins: virt-manager-check » libvirt-debian-9 #1200
by ci@centos.org 22 Oct '19

22 Oct '19
See <https://ci.centos.org/job/virt-manager-check/systems=libvirt-debian-9/1200/…> ------------------------------------------ Started by upstream project "virt-manager-check" build number 1200 originally caused by: Started by upstream project "virt-manager-build" build number 1204 originally caused by: Started by upstream project "libvirt-python-build" build number 810 originally caused by: Started by upstream project "libvirt-build" build number 936 originally caused by: Started by an SCM change Running as SYSTEM [EnvInject] - Loading node environment variables. Building remotely on libvirt-debian-9 (libvirt) in workspace <https://ci.centos.org/job/virt-manager-check/systems=libvirt-debian-9/ws/> [virt-manager] $ /bin/sh -xe /tmp/jenkins2941662133670941819.sh + /usr/bin/python3 ./setup.py test running test .........................................................................................................................................................................................................................................................................................................................................................................................F.......................................................................................................................................F.FF...........................F....ssssssssssssssssss ====================================================================== FAIL: testCLI0264virt_clone_clone_auto1 (tests.clitest.CLITests) ---------------------------------------------------------------------- Traceback (most recent call last): File "<https://ci.centos.org/job/virt-manager-check/systems=libvirt-debian-9/ws/te…",> line 1444, in <lambda> return lambda s: cmdtemplate(s, cmd) File "<https://ci.centos.org/job/virt-manager-check/systems=libvirt-debian-9/ws/te…",> line 1443, in cmdtemplate _cmdobj.run(self) File "<https://ci.centos.org/job/virt-manager-check/systems=libvirt-debian-9/ws/te…",> line 344, in run tests.fail(err) AssertionError: ./virt-clone --connect __virtinst_test__test://<https://ci.centos.org/job/virt-manager-check/systems=libvirt-debian-9/ws/te…> -o test-clone --auto-clone --clone-running --print-xml Conversion outputs did not match. --- tests/cli-test-xml/compare/virt-clone-clone-auto1.xml +++ Generated Output @@ -31,7 +31,7 @@ <readonly/> <address type="drive" controller="0" bus="0" target="0" unit="0"/> </disk> - <disk type="block" device="cdrom"> + <disk type="file" device="cdrom"> <target dev="sdb" bus="scsi"/> <readonly/> <address type="drive" controller="0" bus="0" target="0" unit="1"/> ====================================================================== FAIL: testCLI0400virt_xml_start_select_disk_bootorder (tests.clitest.CLITests) ---------------------------------------------------------------------- Traceback (most recent call last): File "<https://ci.centos.org/job/virt-manager-check/systems=libvirt-debian-9/ws/te…",> line 1444, in <lambda> return lambda s: cmdtemplate(s, cmd) File "<https://ci.centos.org/job/virt-manager-check/systems=libvirt-debian-9/ws/te…",> line 1443, in cmdtemplate _cmdobj.run(self) File "<https://ci.centos.org/job/virt-manager-check/systems=libvirt-debian-9/ws/te…",> line 344, in run tests.fail(err) AssertionError: ./virt-xml test-state-shutoff --print-diff --start --define --edit target=vda --disk boot_order=1 --connect __virtinst_test__test://<https://ci.centos.org/job/virt-manager-check/systems=libvirt-debian-9/ws/te…> Conversion outputs did not match. --- tests/cli-test-xml/compare/virt-xml-start-select-disk-bootorder.xml +++ Generated Output @@ -11,7 +11,7 @@ - <boot order="3"/> + <boot order="4"/> </disk> - <disk type="block" device="cdrom"> + <disk type="file" device="cdrom"> <target dev="hdc" bus="ide"/> <readonly/> - <boot order="1"/> ====================================================================== FAIL: testCLI0402virt_xml_start_select_disk_bootorder2 (tests.clitest.CLITests) ---------------------------------------------------------------------- Traceback (most recent call last): File "<https://ci.centos.org/job/virt-manager-check/systems=libvirt-debian-9/ws/te…",> line 1444, in <lambda> return lambda s: cmdtemplate(s, cmd) File "<https://ci.centos.org/job/virt-manager-check/systems=libvirt-debian-9/ws/te…",> line 1443, in cmdtemplate _cmdobj.run(self) File "<https://ci.centos.org/job/virt-manager-check/systems=libvirt-debian-9/ws/te…",> line 344, in run tests.fail(err) AssertionError: ./virt-xml test-state-shutoff --print-diff --start --edit target=vda --disk boot_order=1 --connect __virtinst_test__test://<https://ci.centos.org/job/virt-manager-check/systems=libvirt-debian-9/ws/te…> Conversion outputs did not match. --- tests/cli-test-xml/compare/virt-xml-start-select-disk-bootorder2.xml +++ Generated Output @@ -11,7 +11,7 @@ - <boot order="3"/> + <boot order="4"/> </disk> - <disk type="block" device="cdrom"> + <disk type="file" device="cdrom"> <target dev="hdc" bus="ide"/> <readonly/> - <boot order="1"/> ====================================================================== FAIL: testCLI0403virt_xml_start_select_disk_bootorder2 (tests.clitest.CLITests) ---------------------------------------------------------------------- Traceback (most recent call last): File "<https://ci.centos.org/job/virt-manager-check/systems=libvirt-debian-9/ws/te…",> line 1444, in <lambda> return lambda s: cmdtemplate(s, cmd) File "<https://ci.centos.org/job/virt-manager-check/systems=libvirt-debian-9/ws/te…",> line 1443, in cmdtemplate _cmdobj.run(self) File "<https://ci.centos.org/job/virt-manager-check/systems=libvirt-debian-9/ws/te…",> line 344, in run tests.fail(err) AssertionError: ./virt-xml test-state-shutoff --print-diff --start --no-define --edit target=vda --disk boot_order=1 --connect __virtinst_test__test://<https://ci.centos.org/job/virt-manager-check/systems=libvirt-debian-9/ws/te…> Conversion outputs did not match. --- tests/cli-test-xml/compare/virt-xml-start-select-disk-bootorder2.xml +++ Generated Output @@ -11,7 +11,7 @@ - <boot order="3"/> + <boot order="4"/> </disk> - <disk type="block" device="cdrom"> + <disk type="file" device="cdrom"> <target dev="hdc" bus="ide"/> <readonly/> - <boot order="1"/> ====================================================================== FAIL: testCLI0431virt_xml_remove_disk_path_start (tests.clitest.CLITests) ---------------------------------------------------------------------- Traceback (most recent call last): File "<https://ci.centos.org/job/virt-manager-check/systems=libvirt-debian-9/ws/te…",> line 1444, in <lambda> return lambda s: cmdtemplate(s, cmd) File "<https://ci.centos.org/job/virt-manager-check/systems=libvirt-debian-9/ws/te…",> line 1443, in cmdtemplate _cmdobj.run(self) File "<https://ci.centos.org/job/virt-manager-check/systems=libvirt-debian-9/ws/te…",> line 344, in run tests.fail(err) AssertionError: ./virt-xml test-state-shutoff --print-diff --start --remove-device --disk /dev/null --connect __virtinst_test__test://<https://ci.centos.org/job/virt-manager-check/systems=libvirt-debian-9/ws/te…> Conversion outputs did not match. --- tests/cli-test-xml/compare/virt-xml-remove-disk-path-start.xml +++ Generated Output @@ -13,7 +13,7 @@ - <target dev="vdb" bus="virtio"/> - <boot order="3"/> - </disk> - <disk type="block" device="cdrom"> + <disk type="file" device="cdrom"> <target dev="hdc" bus="ide"/> <readonly/> ---------------------------------------------------------------------- Ran 567 tests in 87.030s FAILED (failures=5, skipped=18) Build step 'Execute shell' marked build as failure
1 4
0 0
[Libvirt-ci] Build failed in Jenkins: virt-manager-check » libvirt-fedora-29 #1200
by ci@centos.org 22 Oct '19

22 Oct '19
See <https://ci.centos.org/job/virt-manager-check/systems=libvirt-fedora-29/1200…> ------------------------------------------ Started by upstream project "virt-manager-check" build number 1200 originally caused by: Started by upstream project "virt-manager-build" build number 1204 originally caused by: Started by upstream project "libvirt-python-build" build number 810 originally caused by: Started by upstream project "libvirt-build" build number 936 originally caused by: Started by an SCM change Running as SYSTEM [EnvInject] - Loading node environment variables. Building remotely on libvirt-fedora-29 (libvirt) in workspace <https://ci.centos.org/job/virt-manager-check/systems=libvirt-fedora-29/ws/> [virt-manager] $ /bin/sh -xe /tmp/jenkins11783953560129027222.sh + /usr/bin/python3 ./setup.py test running test .........................................................................................................................................................................................................................................................................................................................................................................................F.......................................................................................................................................F.FF...........................F....ssssssssssssssssss ====================================================================== FAIL: testCLI0264virt_clone_clone_auto1 (tests.clitest.CLITests) ---------------------------------------------------------------------- Traceback (most recent call last): File "<https://ci.centos.org/job/virt-manager-check/systems=libvirt-fedora-29/ws/t…",> line 1444, in <lambda> return lambda s: cmdtemplate(s, cmd) File "<https://ci.centos.org/job/virt-manager-check/systems=libvirt-fedora-29/ws/t…",> line 1443, in cmdtemplate _cmdobj.run(self) File "<https://ci.centos.org/job/virt-manager-check/systems=libvirt-fedora-29/ws/t…",> line 344, in run tests.fail(err) AssertionError: ./virt-clone --connect __virtinst_test__test://<https://ci.centos.org/job/virt-manager-check/systems=libvirt-fedora-29/ws/t…> -o test-clone --auto-clone --clone-running --print-xml Conversion outputs did not match. --- tests/cli-test-xml/compare/virt-clone-clone-auto1.xml +++ Generated Output @@ -31,7 +31,7 @@ <readonly/> <address type="drive" controller="0" bus="0" target="0" unit="0"/> </disk> - <disk type="block" device="cdrom"> + <disk type="file" device="cdrom"> <target dev="sdb" bus="scsi"/> <readonly/> <address type="drive" controller="0" bus="0" target="0" unit="1"/> ====================================================================== FAIL: testCLI0400virt_xml_start_select_disk_bootorder (tests.clitest.CLITests) ---------------------------------------------------------------------- Traceback (most recent call last): File "<https://ci.centos.org/job/virt-manager-check/systems=libvirt-fedora-29/ws/t…",> line 1444, in <lambda> return lambda s: cmdtemplate(s, cmd) File "<https://ci.centos.org/job/virt-manager-check/systems=libvirt-fedora-29/ws/t…",> line 1443, in cmdtemplate _cmdobj.run(self) File "<https://ci.centos.org/job/virt-manager-check/systems=libvirt-fedora-29/ws/t…",> line 344, in run tests.fail(err) AssertionError: ./virt-xml test-state-shutoff --print-diff --start --define --edit target=vda --disk boot_order=1 --connect __virtinst_test__test://<https://ci.centos.org/job/virt-manager-check/systems=libvirt-fedora-29/ws/t…> Conversion outputs did not match. --- tests/cli-test-xml/compare/virt-xml-start-select-disk-bootorder.xml +++ Generated Output @@ -11,7 +11,7 @@ - <boot order="3"/> + <boot order="4"/> </disk> - <disk type="block" device="cdrom"> + <disk type="file" device="cdrom"> <target dev="hdc" bus="ide"/> <readonly/> - <boot order="1"/> ====================================================================== FAIL: testCLI0402virt_xml_start_select_disk_bootorder2 (tests.clitest.CLITests) ---------------------------------------------------------------------- Traceback (most recent call last): File "<https://ci.centos.org/job/virt-manager-check/systems=libvirt-fedora-29/ws/t…",> line 1444, in <lambda> return lambda s: cmdtemplate(s, cmd) File "<https://ci.centos.org/job/virt-manager-check/systems=libvirt-fedora-29/ws/t…",> line 1443, in cmdtemplate _cmdobj.run(self) File "<https://ci.centos.org/job/virt-manager-check/systems=libvirt-fedora-29/ws/t…",> line 344, in run tests.fail(err) AssertionError: ./virt-xml test-state-shutoff --print-diff --start --edit target=vda --disk boot_order=1 --connect __virtinst_test__test://<https://ci.centos.org/job/virt-manager-check/systems=libvirt-fedora-29/ws/t…> Conversion outputs did not match. --- tests/cli-test-xml/compare/virt-xml-start-select-disk-bootorder2.xml +++ Generated Output @@ -11,7 +11,7 @@ - <boot order="3"/> + <boot order="4"/> </disk> - <disk type="block" device="cdrom"> + <disk type="file" device="cdrom"> <target dev="hdc" bus="ide"/> <readonly/> - <boot order="1"/> ====================================================================== FAIL: testCLI0403virt_xml_start_select_disk_bootorder2 (tests.clitest.CLITests) ---------------------------------------------------------------------- Traceback (most recent call last): File "<https://ci.centos.org/job/virt-manager-check/systems=libvirt-fedora-29/ws/t…",> line 1444, in <lambda> return lambda s: cmdtemplate(s, cmd) File "<https://ci.centos.org/job/virt-manager-check/systems=libvirt-fedora-29/ws/t…",> line 1443, in cmdtemplate _cmdobj.run(self) File "<https://ci.centos.org/job/virt-manager-check/systems=libvirt-fedora-29/ws/t…",> line 344, in run tests.fail(err) AssertionError: ./virt-xml test-state-shutoff --print-diff --start --no-define --edit target=vda --disk boot_order=1 --connect __virtinst_test__test://<https://ci.centos.org/job/virt-manager-check/systems=libvirt-fedora-29/ws/t…> Conversion outputs did not match. --- tests/cli-test-xml/compare/virt-xml-start-select-disk-bootorder2.xml +++ Generated Output @@ -11,7 +11,7 @@ - <boot order="3"/> + <boot order="4"/> </disk> - <disk type="block" device="cdrom"> + <disk type="file" device="cdrom"> <target dev="hdc" bus="ide"/> <readonly/> - <boot order="1"/> ====================================================================== FAIL: testCLI0431virt_xml_remove_disk_path_start (tests.clitest.CLITests) ---------------------------------------------------------------------- Traceback (most recent call last): File "<https://ci.centos.org/job/virt-manager-check/systems=libvirt-fedora-29/ws/t…",> line 1444, in <lambda> return lambda s: cmdtemplate(s, cmd) File "<https://ci.centos.org/job/virt-manager-check/systems=libvirt-fedora-29/ws/t…",> line 1443, in cmdtemplate _cmdobj.run(self) File "<https://ci.centos.org/job/virt-manager-check/systems=libvirt-fedora-29/ws/t…",> line 344, in run tests.fail(err) AssertionError: ./virt-xml test-state-shutoff --print-diff --start --remove-device --disk /dev/null --connect __virtinst_test__test://<https://ci.centos.org/job/virt-manager-check/systems=libvirt-fedora-29/ws/t…> Conversion outputs did not match. --- tests/cli-test-xml/compare/virt-xml-remove-disk-path-start.xml +++ Generated Output @@ -13,7 +13,7 @@ - <target dev="vdb" bus="virtio"/> - <boot order="3"/> - </disk> - <disk type="block" device="cdrom"> + <disk type="file" device="cdrom"> <target dev="hdc" bus="ide"/> <readonly/> ---------------------------------------------------------------------- Ran 567 tests in 83.389s FAILED (failures=5, skipped=18) Build step 'Execute shell' marked build as failure
1 4
0 0
[Libvirt-ci] Build failed in Jenkins: virt-manager-check » libvirt-fedora-rawhide #1200
by ci@centos.org 22 Oct '19

22 Oct '19
See <https://ci.centos.org/job/virt-manager-check/systems=libvirt-fedora-rawhide…> ------------------------------------------ Started by upstream project "virt-manager-check" build number 1200 originally caused by: Started by upstream project "virt-manager-build" build number 1204 originally caused by: Started by upstream project "libvirt-python-build" build number 810 originally caused by: Started by upstream project "libvirt-build" build number 936 originally caused by: Started by an SCM change Running as SYSTEM [EnvInject] - Loading node environment variables. Building remotely on libvirt-fedora-rawhide (libvirt) in workspace <https://ci.centos.org/job/virt-manager-check/systems=libvirt-fedora-rawhide…> [virt-manager] $ /bin/sh -xe /tmp/jenkins17554240289148742597.sh + /usr/bin/python3 ./setup.py test running test .........................................................................................................................................................................................................................................................................................................................................................................................F.......................................................................................................................................F.FF...........................F....ssssssssssssssssss ====================================================================== FAIL: testCLI0264virt_clone_clone_auto1 (tests.clitest.CLITests) ---------------------------------------------------------------------- Traceback (most recent call last): File "<https://ci.centos.org/job/virt-manager-check/systems=libvirt-fedora-rawhide…",> line 1444, in <lambda> return lambda s: cmdtemplate(s, cmd) File "<https://ci.centos.org/job/virt-manager-check/systems=libvirt-fedora-rawhide…",> line 1443, in cmdtemplate _cmdobj.run(self) File "<https://ci.centos.org/job/virt-manager-check/systems=libvirt-fedora-rawhide…",> line 344, in run tests.fail(err) AssertionError: ./virt-clone --connect __virtinst_test__test://<https://ci.centos.org/job/virt-manager-check/systems=libvirt-fedora-rawhide…> -o test-clone --auto-clone --clone-running --print-xml Conversion outputs did not match. --- tests/cli-test-xml/compare/virt-clone-clone-auto1.xml +++ Generated Output @@ -31,7 +31,7 @@ <readonly/> <address type="drive" controller="0" bus="0" target="0" unit="0"/> </disk> - <disk type="block" device="cdrom"> + <disk type="file" device="cdrom"> <target dev="sdb" bus="scsi"/> <readonly/> <address type="drive" controller="0" bus="0" target="0" unit="1"/> ====================================================================== FAIL: testCLI0400virt_xml_start_select_disk_bootorder (tests.clitest.CLITests) ---------------------------------------------------------------------- Traceback (most recent call last): File "<https://ci.centos.org/job/virt-manager-check/systems=libvirt-fedora-rawhide…",> line 1444, in <lambda> return lambda s: cmdtemplate(s, cmd) File "<https://ci.centos.org/job/virt-manager-check/systems=libvirt-fedora-rawhide…",> line 1443, in cmdtemplate _cmdobj.run(self) File "<https://ci.centos.org/job/virt-manager-check/systems=libvirt-fedora-rawhide…",> line 344, in run tests.fail(err) AssertionError: ./virt-xml test-state-shutoff --print-diff --start --define --edit target=vda --disk boot_order=1 --connect __virtinst_test__test://<https://ci.centos.org/job/virt-manager-check/systems=libvirt-fedora-rawhide…> Conversion outputs did not match. --- tests/cli-test-xml/compare/virt-xml-start-select-disk-bootorder.xml +++ Generated Output @@ -11,7 +11,7 @@ - <boot order="3"/> + <boot order="4"/> </disk> - <disk type="block" device="cdrom"> + <disk type="file" device="cdrom"> <target dev="hdc" bus="ide"/> <readonly/> - <boot order="1"/> ====================================================================== FAIL: testCLI0402virt_xml_start_select_disk_bootorder2 (tests.clitest.CLITests) ---------------------------------------------------------------------- Traceback (most recent call last): File "<https://ci.centos.org/job/virt-manager-check/systems=libvirt-fedora-rawhide…",> line 1444, in <lambda> return lambda s: cmdtemplate(s, cmd) File "<https://ci.centos.org/job/virt-manager-check/systems=libvirt-fedora-rawhide…",> line 1443, in cmdtemplate _cmdobj.run(self) File "<https://ci.centos.org/job/virt-manager-check/systems=libvirt-fedora-rawhide…",> line 344, in run tests.fail(err) AssertionError: ./virt-xml test-state-shutoff --print-diff --start --edit target=vda --disk boot_order=1 --connect __virtinst_test__test://<https://ci.centos.org/job/virt-manager-check/systems=libvirt-fedora-rawhide…> Conversion outputs did not match. --- tests/cli-test-xml/compare/virt-xml-start-select-disk-bootorder2.xml +++ Generated Output @@ -11,7 +11,7 @@ - <boot order="3"/> + <boot order="4"/> </disk> - <disk type="block" device="cdrom"> + <disk type="file" device="cdrom"> <target dev="hdc" bus="ide"/> <readonly/> - <boot order="1"/> ====================================================================== FAIL: testCLI0403virt_xml_start_select_disk_bootorder2 (tests.clitest.CLITests) ---------------------------------------------------------------------- Traceback (most recent call last): File "<https://ci.centos.org/job/virt-manager-check/systems=libvirt-fedora-rawhide…",> line 1444, in <lambda> return lambda s: cmdtemplate(s, cmd) File "<https://ci.centos.org/job/virt-manager-check/systems=libvirt-fedora-rawhide…",> line 1443, in cmdtemplate _cmdobj.run(self) File "<https://ci.centos.org/job/virt-manager-check/systems=libvirt-fedora-rawhide…",> line 344, in run tests.fail(err) AssertionError: ./virt-xml test-state-shutoff --print-diff --start --no-define --edit target=vda --disk boot_order=1 --connect __virtinst_test__test://<https://ci.centos.org/job/virt-manager-check/systems=libvirt-fedora-rawhide…> Conversion outputs did not match. --- tests/cli-test-xml/compare/virt-xml-start-select-disk-bootorder2.xml +++ Generated Output @@ -11,7 +11,7 @@ - <boot order="3"/> + <boot order="4"/> </disk> - <disk type="block" device="cdrom"> + <disk type="file" device="cdrom"> <target dev="hdc" bus="ide"/> <readonly/> - <boot order="1"/> ====================================================================== FAIL: testCLI0431virt_xml_remove_disk_path_start (tests.clitest.CLITests) ---------------------------------------------------------------------- Traceback (most recent call last): File "<https://ci.centos.org/job/virt-manager-check/systems=libvirt-fedora-rawhide…",> line 1444, in <lambda> return lambda s: cmdtemplate(s, cmd) File "<https://ci.centos.org/job/virt-manager-check/systems=libvirt-fedora-rawhide…",> line 1443, in cmdtemplate _cmdobj.run(self) File "<https://ci.centos.org/job/virt-manager-check/systems=libvirt-fedora-rawhide…",> line 344, in run tests.fail(err) AssertionError: ./virt-xml test-state-shutoff --print-diff --start --remove-device --disk /dev/null --connect __virtinst_test__test://<https://ci.centos.org/job/virt-manager-check/systems=libvirt-fedora-rawhide…> Conversion outputs did not match. --- tests/cli-test-xml/compare/virt-xml-remove-disk-path-start.xml +++ Generated Output @@ -13,7 +13,7 @@ - <target dev="vdb" bus="virtio"/> - <boot order="3"/> - </disk> - <disk type="block" device="cdrom"> + <disk type="file" device="cdrom"> <target dev="hdc" bus="ide"/> <readonly/> ---------------------------------------------------------------------- Ran 567 tests in 99.742s FAILED (failures=5, skipped=18) Build step 'Execute shell' marked build as failure
1 4
0 0
[Libvirt-ci] Build failed in Jenkins: virt-manager-check » libvirt-debian-10 #1200
by ci@centos.org 22 Oct '19

22 Oct '19
See <https://ci.centos.org/job/virt-manager-check/systems=libvirt-debian-10/1200…> ------------------------------------------ Started by upstream project "virt-manager-check" build number 1200 originally caused by: Started by upstream project "virt-manager-build" build number 1204 originally caused by: Started by upstream project "libvirt-python-build" build number 810 originally caused by: Started by upstream project "libvirt-build" build number 936 originally caused by: Started by an SCM change Running as SYSTEM [EnvInject] - Loading node environment variables. Building remotely on libvirt-debian-10 (libvirt) in workspace <https://ci.centos.org/job/virt-manager-check/systems=libvirt-debian-10/ws/> [virt-manager] $ /bin/sh -xe /tmp/jenkins8818296434156962402.sh + /usr/bin/python3 ./setup.py test running test .........................................................................................................................................................................................................................................................................................................................................................................................F.......................................................................................................................................F.FF...........................F....ssssssssssssssssss ====================================================================== FAIL: testCLI0264virt_clone_clone_auto1 (tests.clitest.CLITests) ---------------------------------------------------------------------- Traceback (most recent call last): File "<https://ci.centos.org/job/virt-manager-check/systems=libvirt-debian-10/ws/t…",> line 1444, in <lambda> return lambda s: cmdtemplate(s, cmd) File "<https://ci.centos.org/job/virt-manager-check/systems=libvirt-debian-10/ws/t…",> line 1443, in cmdtemplate _cmdobj.run(self) File "<https://ci.centos.org/job/virt-manager-check/systems=libvirt-debian-10/ws/t…",> line 344, in run tests.fail(err) AssertionError: ./virt-clone --connect __virtinst_test__test://<https://ci.centos.org/job/virt-manager-check/systems=libvirt-debian-10/ws/t…> -o test-clone --auto-clone --clone-running --print-xml Conversion outputs did not match. --- tests/cli-test-xml/compare/virt-clone-clone-auto1.xml +++ Generated Output @@ -31,7 +31,7 @@ <readonly/> <address type="drive" controller="0" bus="0" target="0" unit="0"/> </disk> - <disk type="block" device="cdrom"> + <disk type="file" device="cdrom"> <target dev="sdb" bus="scsi"/> <readonly/> <address type="drive" controller="0" bus="0" target="0" unit="1"/> ====================================================================== FAIL: testCLI0400virt_xml_start_select_disk_bootorder (tests.clitest.CLITests) ---------------------------------------------------------------------- Traceback (most recent call last): File "<https://ci.centos.org/job/virt-manager-check/systems=libvirt-debian-10/ws/t…",> line 1444, in <lambda> return lambda s: cmdtemplate(s, cmd) File "<https://ci.centos.org/job/virt-manager-check/systems=libvirt-debian-10/ws/t…",> line 1443, in cmdtemplate _cmdobj.run(self) File "<https://ci.centos.org/job/virt-manager-check/systems=libvirt-debian-10/ws/t…",> line 344, in run tests.fail(err) AssertionError: ./virt-xml test-state-shutoff --print-diff --start --define --edit target=vda --disk boot_order=1 --connect __virtinst_test__test://<https://ci.centos.org/job/virt-manager-check/systems=libvirt-debian-10/ws/t…> Conversion outputs did not match. --- tests/cli-test-xml/compare/virt-xml-start-select-disk-bootorder.xml +++ Generated Output @@ -11,7 +11,7 @@ - <boot order="3"/> + <boot order="4"/> </disk> - <disk type="block" device="cdrom"> + <disk type="file" device="cdrom"> <target dev="hdc" bus="ide"/> <readonly/> - <boot order="1"/> ====================================================================== FAIL: testCLI0402virt_xml_start_select_disk_bootorder2 (tests.clitest.CLITests) ---------------------------------------------------------------------- Traceback (most recent call last): File "<https://ci.centos.org/job/virt-manager-check/systems=libvirt-debian-10/ws/t…",> line 1444, in <lambda> return lambda s: cmdtemplate(s, cmd) File "<https://ci.centos.org/job/virt-manager-check/systems=libvirt-debian-10/ws/t…",> line 1443, in cmdtemplate _cmdobj.run(self) File "<https://ci.centos.org/job/virt-manager-check/systems=libvirt-debian-10/ws/t…",> line 344, in run tests.fail(err) AssertionError: ./virt-xml test-state-shutoff --print-diff --start --edit target=vda --disk boot_order=1 --connect __virtinst_test__test://<https://ci.centos.org/job/virt-manager-check/systems=libvirt-debian-10/ws/t…> Conversion outputs did not match. --- tests/cli-test-xml/compare/virt-xml-start-select-disk-bootorder2.xml +++ Generated Output @@ -11,7 +11,7 @@ - <boot order="3"/> + <boot order="4"/> </disk> - <disk type="block" device="cdrom"> + <disk type="file" device="cdrom"> <target dev="hdc" bus="ide"/> <readonly/> - <boot order="1"/> ====================================================================== FAIL: testCLI0403virt_xml_start_select_disk_bootorder2 (tests.clitest.CLITests) ---------------------------------------------------------------------- Traceback (most recent call last): File "<https://ci.centos.org/job/virt-manager-check/systems=libvirt-debian-10/ws/t…",> line 1444, in <lambda> return lambda s: cmdtemplate(s, cmd) File "<https://ci.centos.org/job/virt-manager-check/systems=libvirt-debian-10/ws/t…",> line 1443, in cmdtemplate _cmdobj.run(self) File "<https://ci.centos.org/job/virt-manager-check/systems=libvirt-debian-10/ws/t…",> line 344, in run tests.fail(err) AssertionError: ./virt-xml test-state-shutoff --print-diff --start --no-define --edit target=vda --disk boot_order=1 --connect __virtinst_test__test://<https://ci.centos.org/job/virt-manager-check/systems=libvirt-debian-10/ws/t…> Conversion outputs did not match. --- tests/cli-test-xml/compare/virt-xml-start-select-disk-bootorder2.xml +++ Generated Output @@ -11,7 +11,7 @@ - <boot order="3"/> + <boot order="4"/> </disk> - <disk type="block" device="cdrom"> + <disk type="file" device="cdrom"> <target dev="hdc" bus="ide"/> <readonly/> - <boot order="1"/> ====================================================================== FAIL: testCLI0431virt_xml_remove_disk_path_start (tests.clitest.CLITests) ---------------------------------------------------------------------- Traceback (most recent call last): File "<https://ci.centos.org/job/virt-manager-check/systems=libvirt-debian-10/ws/t…",> line 1444, in <lambda> return lambda s: cmdtemplate(s, cmd) File "<https://ci.centos.org/job/virt-manager-check/systems=libvirt-debian-10/ws/t…",> line 1443, in cmdtemplate _cmdobj.run(self) File "<https://ci.centos.org/job/virt-manager-check/systems=libvirt-debian-10/ws/t…",> line 344, in run tests.fail(err) AssertionError: ./virt-xml test-state-shutoff --print-diff --start --remove-device --disk /dev/null --connect __virtinst_test__test://<https://ci.centos.org/job/virt-manager-check/systems=libvirt-debian-10/ws/t…> Conversion outputs did not match. --- tests/cli-test-xml/compare/virt-xml-remove-disk-path-start.xml +++ Generated Output @@ -13,7 +13,7 @@ - <target dev="vdb" bus="virtio"/> - <boot order="3"/> - </disk> - <disk type="block" device="cdrom"> + <disk type="file" device="cdrom"> <target dev="hdc" bus="ide"/> <readonly/> ---------------------------------------------------------------------- Ran 567 tests in 67.808s FAILED (failures=5, skipped=18) Build step 'Execute shell' marked build as failure
1 4
0 0
[Libvirt-ci] Build failed in Jenkins: libvirt-go-xml-check » libvirt-fedora-rawhide #790
by ci@centos.org 22 Oct '19

22 Oct '19
See <https://ci.centos.org/job/libvirt-go-xml-check/systems=libvirt-fedora-rawhi…> ------------------------------------------ Started by upstream project "libvirt-go-xml-check" build number 790 originally caused by: Started by upstream project "libvirt-go-xml-build" build number 792 originally caused by: Started by upstream project "libvirt-build" build number 927 originally caused by: Started by an SCM change Running as SYSTEM [EnvInject] - Loading node environment variables. Building remotely on libvirt-fedora-rawhide (libvirt) in workspace <https://ci.centos.org/job/libvirt-go-xml-check/systems=libvirt-fedora-rawhi…> [libvirt-go-xml] $ /bin/sh -xe /tmp/jenkins14129849743300847791.sh + export 'TEST_ARGS=-tags xmlroundtrip' + TEST_ARGS='-tags xmlroundtrip' + go test -tags xmlroundtrip --- FAIL: TestRoundTrip (35.72s) xml_test.go:374: testdata/libvirt/tests/qemuxml2argvdata/video-qxl-resolution.xml: /domain[0]/devices[0]/video[0]/model[0]/resolution[0]: element in expected XML missing in actual XML FAIL exit status 1 FAIL _<https://ci.centos.org/job/libvirt-go-xml-check/systems=libvirt-fedora-rawhi…> 35.844s Build step 'Execute shell' marked build as failure
1 8
0 0
[Libvirt-ci] Build failed in Jenkins: libvirt-go-xml-check » libvirt-fedora-29 #790
by ci@centos.org 22 Oct '19

22 Oct '19
See <https://ci.centos.org/job/libvirt-go-xml-check/systems=libvirt-fedora-29/79…> ------------------------------------------ Started by upstream project "libvirt-go-xml-check" build number 790 originally caused by: Started by upstream project "libvirt-go-xml-build" build number 792 originally caused by: Started by upstream project "libvirt-build" build number 927 originally caused by: Started by an SCM change Running as SYSTEM [EnvInject] - Loading node environment variables. Building remotely on libvirt-fedora-29 (libvirt) in workspace <https://ci.centos.org/job/libvirt-go-xml-check/systems=libvirt-fedora-29/ws/> [libvirt-go-xml] $ /bin/sh -xe /tmp/jenkins4039936611262357074.sh + export 'TEST_ARGS=-tags xmlroundtrip' + TEST_ARGS='-tags xmlroundtrip' + go test -tags xmlroundtrip --- FAIL: TestRoundTrip (41.04s) xml_test.go:374: testdata/libvirt/tests/qemuxml2argvdata/video-qxl-resolution.xml: /domain[0]/devices[0]/video[0]/model[0]/resolution[0]: element in expected XML missing in actual XML FAIL exit status 1 FAIL _<https://ci.centos.org/job/libvirt-go-xml-check/systems=libvirt-fedora-29/ws/> 41.135s Build step 'Execute shell' marked build as failure
1 8
0 0
[Libvirt-ci] Build failed in Jenkins: libvirt-go-xml-check » libvirt-fedora-30 #790
by ci@centos.org 22 Oct '19

22 Oct '19
See <https://ci.centos.org/job/libvirt-go-xml-check/systems=libvirt-fedora-30/79…> ------------------------------------------ Started by upstream project "libvirt-go-xml-check" build number 790 originally caused by: Started by upstream project "libvirt-go-xml-build" build number 792 originally caused by: Started by upstream project "libvirt-build" build number 927 originally caused by: Started by an SCM change Running as SYSTEM [EnvInject] - Loading node environment variables. Building remotely on libvirt-fedora-30 (libvirt) in workspace <https://ci.centos.org/job/libvirt-go-xml-check/systems=libvirt-fedora-30/ws/> [libvirt-go-xml] $ /bin/sh -xe /tmp/jenkins6381157461131422648.sh + export 'TEST_ARGS=-tags xmlroundtrip' + TEST_ARGS='-tags xmlroundtrip' + go test -tags xmlroundtrip --- FAIL: TestRoundTrip (26.56s) xml_test.go:374: testdata/libvirt/tests/qemuxml2argvdata/video-qxl-resolution.xml: /domain[0]/devices[0]/video[0]/model[0]/resolution[0]: element in expected XML missing in actual XML FAIL exit status 1 FAIL _<https://ci.centos.org/job/libvirt-go-xml-check/systems=libvirt-fedora-30/ws/> 26.730s Build step 'Execute shell' marked build as failure
1 8
0 0
  • ← Newer
  • 1
  • ...
  • 682
  • 683
  • 684
  • 685
  • 686
  • 687
  • 688
  • ...
  • 1021
  • Older →

HyperKitty Powered by HyperKitty version 1.3.12.