libvirt List Archives
Sign In Sign Up
Manage this list Sign In Sign Up

Keyboard Shortcuts

Thread View

  • j: Next unread message
  • k: Previous unread message
  • j a: Jump to all threads
  • j l: Jump to MailingList overview

CI

Thread Start a new thread
Download
Threads by month
  • ----- 2026 -----
  • September
  • August
  • July
  • June
  • May
  • April
  • March
  • February
  • January
  • ----- 2025 -----
  • December
  • November
  • October
  • September
  • August
  • July
  • June
  • May
  • April
  • March
  • February
  • January
  • ----- 2024 -----
  • December
  • November
  • October
  • September
  • August
  • July
  • June
  • May
  • April
  • March
  • February
  • January
  • ----- 2023 -----
  • December
  • November
  • October
  • September
  • August
  • July
  • June
  • May
  • April
  • March
  • February
  • January
  • ----- 2022 -----
  • December
  • November
  • October
  • September
  • August
  • July
  • June
  • May
  • April
  • March
  • February
  • January
  • ----- 2021 -----
  • December
  • November
  • October
  • September
  • August
  • July
  • June
  • May
  • April
  • March
  • February
  • January
  • ----- 2020 -----
  • December
  • November
  • October
  • September
  • August
  • July
  • June
  • May
  • April
  • March
  • February
  • January
  • ----- 2019 -----
  • December
  • November
  • October
  • September
  • August
  • July
  • June
  • May
  • April
  • March
  • February
  • January
  • ----- 2018 -----
  • December
  • November
  • October
  • September
  • August
  • July
  • June
  • May
  • April
  • March
  • February
  • January
  • ----- 2017 -----
  • December
  • November
  • October
  • September
  • August
  • July
  • June
  • May
  • April
  • March
  • February
  • January
  • ----- 2016 -----
  • December
  • November
  • October
  • September
  • August
  • July
ci@lists.libvirt.org

  • 2 participants
  • 10211 discussions
Build failed in Jenkins: libvirt-go-xml-check » libvirt-fedora-30 #1171
by ci@centos.org 22 Apr '20

22 Apr '20
See <https://ci.centos.org/job/libvirt-go-xml-check/systems=libvirt-fedora-30/11…> ------------------------------------------ Started by upstream project "libvirt-go-xml-check" build number 1171 originally caused by: Started by upstream project "libvirt-go-xml-build" build number 1175 originally caused by: Started by upstream project "libvirt-build" build number 1362 originally caused by: Started by an SCM change Running as SYSTEM [EnvInject] - Loading node environment variables. Building remotely on libvirt-fedora-30 (libvirt) in workspace <https://ci.centos.org/job/libvirt-go-xml-check/systems=libvirt-fedora-30/ws/> [libvirt-go-xml] $ /bin/sh -xe /tmp/jenkins389712914236609031.sh + export 'TEST_ARGS=-tags xmlroundtrip' + TEST_ARGS='-tags xmlroundtrip' + go test -tags xmlroundtrip --- FAIL: TestRoundTrip (61.43s) xml_test.go:374: testdata/libvirt/tests/xlconfigdata/test-fullvirt-hypervisor-features.xml: /domain[0]/features[0]/xen[0]: element in expected XML missing in actual XML FAIL exit status 1 FAIL _<https://ci.centos.org/job/libvirt-go-xml-check/systems=libvirt-fedora-30/ws/> 61.570s Build step 'Execute shell' marked build as failure
1 6
0 0
Build failed in Jenkins: libvirt-go-xml-check » libvirt-fedora-rawhide #1171
by ci@centos.org 22 Apr '20

22 Apr '20
See <https://ci.centos.org/job/libvirt-go-xml-check/systems=libvirt-fedora-rawhi…> ------------------------------------------ Started by upstream project "libvirt-go-xml-check" build number 1171 originally caused by: Started by upstream project "libvirt-go-xml-build" build number 1175 originally caused by: Started by upstream project "libvirt-build" build number 1362 originally caused by: Started by an SCM change Running as SYSTEM [EnvInject] - Loading node environment variables. Building remotely on libvirt-fedora-rawhide (libvirt) in workspace <https://ci.centos.org/job/libvirt-go-xml-check/systems=libvirt-fedora-rawhi…> [libvirt-go-xml] $ /bin/sh -xe /tmp/jenkins17980261972937434133.sh + export 'TEST_ARGS=-tags xmlroundtrip' + TEST_ARGS='-tags xmlroundtrip' + go test -tags xmlroundtrip --- FAIL: TestRoundTrip (72.43s) xml_test.go:374: testdata/libvirt/tests/xlconfigdata/test-fullvirt-hypervisor-features.xml: /domain[0]/features[0]/xen[0]: element in expected XML missing in actual XML FAIL exit status 1 FAIL _<https://ci.centos.org/job/libvirt-go-xml-check/systems=libvirt-fedora-rawhi…> 72.687s Build step 'Execute shell' marked build as failure
1 6
0 0
Build failed in Jenkins: libvirt-go-xml-check » libvirt-freebsd-12 #1171
by ci@centos.org 22 Apr '20

22 Apr '20
See <https://ci.centos.org/job/libvirt-go-xml-check/systems=libvirt-freebsd-12/1…> ------------------------------------------ Started by upstream project "libvirt-go-xml-check" build number 1171 originally caused by: Started by upstream project "libvirt-go-xml-build" build number 1175 originally caused by: Started by upstream project "libvirt-build" build number 1362 originally caused by: Started by an SCM change Running as SYSTEM [EnvInject] - Loading node environment variables. Building remotely on libvirt-freebsd-12 (libvirt) in workspace <https://ci.centos.org/job/libvirt-go-xml-check/systems=libvirt-freebsd-12/w…> [libvirt-go-xml] $ /bin/sh -xe /tmp/jenkins15397110455996798484.sh + export 'TEST_ARGS=-tags xmlroundtrip' + go test -tags xmlroundtrip --- FAIL: TestRoundTrip (40.70s) xml_test.go:374: testdata/libvirt/tests/xlconfigdata/test-fullvirt-hypervisor-features.xml: /domain[0]/features[0]/xen[0]: element in expected XML missing in actual XML FAIL exit status 1 FAIL _/usr<https://ci.centos.org/job/libvirt-go-xml-check/systems=libvirt-freebsd-12/w…> 40.780s Build step 'Execute shell' marked build as failure
1 6
0 0
Build failed in Jenkins: libvirt-go-xml-check » libvirt-freebsd-11 #1171
by ci@centos.org 22 Apr '20

22 Apr '20
See <https://ci.centos.org/job/libvirt-go-xml-check/systems=libvirt-freebsd-11/1…> ------------------------------------------ Started by upstream project "libvirt-go-xml-check" build number 1171 originally caused by: Started by upstream project "libvirt-go-xml-build" build number 1175 originally caused by: Started by upstream project "libvirt-build" build number 1362 originally caused by: Started by an SCM change Running as SYSTEM [EnvInject] - Loading node environment variables. Building remotely on libvirt-freebsd-11 (libvirt) in workspace <https://ci.centos.org/job/libvirt-go-xml-check/systems=libvirt-freebsd-11/w…> [libvirt-go-xml] $ /bin/sh -xe /tmp/jenkins16020591609928945236.sh + export 'TEST_ARGS=-tags xmlroundtrip' + go test -tags xmlroundtrip --- FAIL: TestRoundTrip (38.42s) xml_test.go:374: testdata/libvirt/tests/xlconfigdata/test-fullvirt-hypervisor-features.xml: /domain[0]/features[0]/xen[0]: element in expected XML missing in actual XML FAIL exit status 1 FAIL _/usr<https://ci.centos.org/job/libvirt-go-xml-check/systems=libvirt-freebsd-11/w…> 38.571s Build step 'Execute shell' marked build as failure
1 6
0 0
Build failed in Jenkins: libvirt-go-xml-check » libvirt-debian-9 #1171
by ci@centos.org 22 Apr '20

22 Apr '20
See <https://ci.centos.org/job/libvirt-go-xml-check/systems=libvirt-debian-9/117…> ------------------------------------------ Started by upstream project "libvirt-go-xml-check" build number 1171 originally caused by: Started by upstream project "libvirt-go-xml-build" build number 1175 originally caused by: Started by upstream project "libvirt-build" build number 1362 originally caused by: Started by an SCM change Running as SYSTEM [EnvInject] - Loading node environment variables. Building remotely on libvirt-debian-9 (libvirt) in workspace <https://ci.centos.org/job/libvirt-go-xml-check/systems=libvirt-debian-9/ws/> [libvirt-go-xml] $ /bin/sh -xe /tmp/jenkins7625932048832693527.sh + export TEST_ARGS=-tags xmlroundtrip + go test -tags xmlroundtrip --- FAIL: TestRoundTrip (79.77s) xml_test.go:374: testdata/libvirt/tests/xlconfigdata/test-fullvirt-hypervisor-features.xml: /domain[0]/features[0]/xen[0]: element in expected XML missing in actual XML FAIL exit status 1 FAIL _<https://ci.centos.org/job/libvirt-go-xml-check/systems=libvirt-debian-9/ws/> 79.985s Build step 'Execute shell' marked build as failure
1 6
0 0
Build failed in Jenkins: libvirt-go-xml-check » libvirt-debian-10 #1171
by ci@centos.org 22 Apr '20

22 Apr '20
See <https://ci.centos.org/job/libvirt-go-xml-check/systems=libvirt-debian-10/11…> ------------------------------------------ Started by upstream project "libvirt-go-xml-check" build number 1171 originally caused by: Started by upstream project "libvirt-go-xml-build" build number 1175 originally caused by: Started by upstream project "libvirt-build" build number 1362 originally caused by: Started by an SCM change Running as SYSTEM [EnvInject] - Loading node environment variables. Building remotely on libvirt-debian-10 (libvirt) in workspace <https://ci.centos.org/job/libvirt-go-xml-check/systems=libvirt-debian-10/ws/> [libvirt-go-xml] $ /bin/sh -xe /tmp/jenkins3276730822703046100.sh + export TEST_ARGS=-tags xmlroundtrip + go test -tags xmlroundtrip --- FAIL: TestRoundTrip (46.12s) xml_test.go:374: testdata/libvirt/tests/xlconfigdata/test-fullvirt-hypervisor-features.xml: /domain[0]/features[0]/xen[0]: element in expected XML missing in actual XML FAIL exit status 1 FAIL _<https://ci.centos.org/job/libvirt-go-xml-check/systems=libvirt-debian-10/ws/> 46.201s Build step 'Execute shell' marked build as failure
1 6
0 0
Still Failing: libvirt/libvirt#3348 (master - c740ae6)
by Travis CI 22 Apr '20

22 Apr '20
Build Update for libvirt/libvirt ------------------------------------- Build: #3348 Status: Still Failing Duration: 20 mins and 3 secs Commit: c740ae6 (master) Author: Ján Tomko Message: conf: split out virDomainFeaturesDefParse The virDomainDefParseXML function has grown so large it broke the build: ../../src/conf/domain_conf.c:20362:1: error: stack frame size of 4168 bytes in function 'virDomainDefParseXML' [-Werror,-Wframe-larger-than=] Signed-off-by: Ján Tomko <jtomko(a)redhat.com> Reviewed-by: Peter Krempa <pkrempa(a)redhat.com> View the changeset: https://github.com/libvirt/libvirt/compare/090a1770a1d2...c740ae69c382 View the full build log and details: https://travis-ci.org/github/libvirt/libvirt/builds/678071732?utm_medium=no… -- You can unsubscribe from build emails from the libvirt/libvirt repository going to https://travis-ci.org/account/preferences/unsubscribe?repository=4872032&ut…. Or unsubscribe from *all* email updating your settings at https://travis-ci.org/account/preferences/unsubscribe?utm_medium=notificati…. Or configure specific recipients for build notifications in your .travis.yml file. See https://docs.travis-ci.com/user/notifications.
1 0
0 0
Still Failing: libvirt/libvirt#3347 (master - 090a177)
by Travis CI 22 Apr '20

22 Apr '20
Build Update for libvirt/libvirt ------------------------------------- Build: #3347 Status: Still Failing Duration: 18 mins and 58 secs Commit: 090a177 (master) Author: Marc-André Lureau Message: qemu-cgroup: remove unnecessary include The file doesn't use virSystemd functions directly. Signed-off-by: Marc-André Lureau <marcandre.lureau(a)redhat.com> Reviewed-by: Michal Privoznik <mprivozn(a)redhat.com> View the changeset: https://github.com/libvirt/libvirt/compare/fbc4e81a36d1...090a1770a1d2 View the full build log and details: https://travis-ci.org/github/libvirt/libvirt/builds/678056190?utm_medium=no… -- You can unsubscribe from build emails from the libvirt/libvirt repository going to https://travis-ci.org/account/preferences/unsubscribe?repository=4872032&ut…. Or unsubscribe from *all* email updating your settings at https://travis-ci.org/account/preferences/unsubscribe?utm_medium=notificati…. Or configure specific recipients for build notifications in your .travis.yml file. See https://docs.travis-ci.com/user/notifications.
1 0
0 0
Still Failing: libvirt/libvirt#3346 (master - fbc4e81)
by Travis CI 22 Apr '20

22 Apr '20
Build Update for libvirt/libvirt ------------------------------------- Build: #3346 Status: Still Failing Duration: 19 mins and 33 secs Commit: fbc4e81 (master) Author: Andrea Bolognani Message: virsh: Fix return code for dump and migrate When the job monitoring logic was refactored, these two commands were not converted properly and the result is that a successful dump or migration (char '0') would be reported as a failed one (int 48) instead. Fixes: dc0771cfa2e78ffecd7c8234538ee548748d7bef Reported-by: Brian Rak <brak(a)gameservers.com> Signed-off-by: Andrea Bolognani <abologna(a)redhat.com> Reviewed-by: Daniel P. Berrangé <berrange(a)redhat.com> View the changeset: https://github.com/libvirt/libvirt/compare/9ced95a49c74...fbc4e81a36d1 View the full build log and details: https://travis-ci.org/github/libvirt/libvirt/builds/678048018?utm_medium=no… -- You can unsubscribe from build emails from the libvirt/libvirt repository going to https://travis-ci.org/account/preferences/unsubscribe?repository=4872032&ut…. Or unsubscribe from *all* email updating your settings at https://travis-ci.org/account/preferences/unsubscribe?utm_medium=notificati…. Or configure specific recipients for build notifications in your .travis.yml file. See https://docs.travis-ci.com/user/notifications.
1 0
0 0
libvirt-go-xml | Pipeline #138532204 has failed for master | 309bde79
by GitLab 22 Apr '20

22 Apr '20
Your pipeline has failed. Project: libvirt-go-xml ( https://gitlab.com/libvirt/libvirt-go-xml ) Branch: master ( https://gitlab.com/libvirt/libvirt-go-xml/-/commits/master ) Commit: 309bde79 ( https://gitlab.com/libvirt/libvirt-go-xml/-/commit/309bde793185448f1bf35d38… ) Commit Message: Add PCI controller hotplug attribute Signed-of... Commit Author: Daniel Berrange ( https://gitlab.com/berrange ) Pipeline #138532204 ( https://gitlab.com/libvirt/libvirt-go-xml/pipelines/138532204 ) triggered by Daniel Berrange ( https://gitlab.com/berrange ) had 5 failed builds. Job #521287657 ( https://gitlab.com/libvirt/libvirt-go-xml/-/jobs/521287657/raw ) Stage: test Name: go_1_11 Trace: Skipping Git submodules setup section_end:1587528692:get_sources section_start:1587528692:restore_cache Restoring cache section_end:1587528694:restore_cache section_start:1587528694:download_artifacts Downloading artifacts section_end:1587528697:download_artifacts section_start:1587528697:build_script Running before_script and script $ go test -timeout 10m -tags xmlroundtrip -v === RUN TestDomainSnapshot --- PASS: TestDomainSnapshot (0.00s) === RUN TestDomain --- PASS: TestDomain (0.01s) === RUN TestNetwork --- PASS: TestNetwork (0.00s) === RUN TestNodeDevice --- PASS: TestNodeDevice (0.00s) === RUN TestSecret --- PASS: TestSecret (0.00s) === RUN TestStoragePool --- PASS: TestStoragePool (0.00s) === RUN TestStorageVolume --- PASS: TestStorageVolume (0.00s) === RUN TestRoundTrip --- FAIL: TestRoundTrip (24.99s) xml_test.go:374: testdata/libvirt/tests/xlconfigdata/test-fullvirt-hypervisor-features.xml: /domain[0]/features[0]/xen[0]: element in expected XML missing in actual XML FAIL exit status 1 FAIL _/builds/libvirt/libvirt-go-xml 25.008s section_end:1587528729:build_script section_start:1587528729:after_script Running after_script section_end:1587528732:after_script section_start:1587528732:upload_artifacts_on_failure Uploading artifacts for failed job section_end:1587528734:upload_artifacts_on_failure ERROR: Job failed: exit code 1  Job #521287683 ( https://gitlab.com/libvirt/libvirt-go-xml/-/jobs/521287683/raw ) Stage: test Name: go_1_14 Trace: Skipping Git submodules setup section_end:1587528695:get_sources section_start:1587528695:restore_cache Restoring cache section_end:1587528697:restore_cache section_start:1587528697:download_artifacts Downloading artifacts section_end:1587528700:download_artifacts section_start:1587528700:build_script Running before_script and script $ go test -timeout 10m -tags xmlroundtrip -v === RUN TestDomainSnapshot --- PASS: TestDomainSnapshot (0.00s) === RUN TestDomain --- PASS: TestDomain (0.01s) === RUN TestNetwork --- PASS: TestNetwork (0.00s) === RUN TestNodeDevice --- PASS: TestNodeDevice (0.00s) === RUN TestSecret --- PASS: TestSecret (0.00s) === RUN TestStoragePool --- PASS: TestStoragePool (0.00s) === RUN TestStorageVolume --- PASS: TestStorageVolume (0.00s) === RUN TestRoundTrip TestRoundTrip: xml_test.go:374: testdata/libvirt/tests/xlconfigdata/test-fullvirt-hypervisor-features.xml: /domain[0]/features[0]/xen[0]: element in expected XML missing in actual XML --- FAIL: TestRoundTrip (23.49s) FAIL exit status 1 FAIL _/builds/libvirt/libvirt-go-xml 23.509s section_end:1587528730:build_script section_start:1587528730:after_script Running after_script section_end:1587528732:after_script section_start:1587528732:upload_artifacts_on_failure Uploading artifacts for failed job section_end:1587528733:upload_artifacts_on_failure ERROR: Job failed: exit code 1  Job #521287665 ( https://gitlab.com/libvirt/libvirt-go-xml/-/jobs/521287665/raw ) Stage: test Name: go_1_12 Trace: Skipping Git submodules setup section_end:1587528688:get_sources section_start:1587528688:restore_cache Restoring cache section_end:1587528690:restore_cache section_start:1587528690:download_artifacts Downloading artifacts section_end:1587528692:download_artifacts section_start:1587528692:build_script Running before_script and script $ go test -timeout 10m -tags xmlroundtrip -v === RUN TestDomainSnapshot --- PASS: TestDomainSnapshot (0.00s) === RUN TestDomain --- PASS: TestDomain (0.01s) === RUN TestNetwork --- PASS: TestNetwork (0.00s) === RUN TestNodeDevice --- PASS: TestNodeDevice (0.00s) === RUN TestSecret --- PASS: TestSecret (0.00s) === RUN TestStoragePool --- PASS: TestStoragePool (0.00s) === RUN TestStorageVolume --- PASS: TestStorageVolume (0.00s) === RUN TestRoundTrip --- FAIL: TestRoundTrip (25.24s) xml_test.go:374: testdata/libvirt/tests/xlconfigdata/test-fullvirt-hypervisor-features.xml: /domain[0]/features[0]/xen[0]: element in expected XML missing in actual XML FAIL exit status 1 FAIL _/builds/libvirt/libvirt-go-xml 25.258s section_end:1587528725:build_script section_start:1587528725:after_script Running after_script section_end:1587528727:after_script section_start:1587528727:upload_artifacts_on_failure Uploading artifacts for failed job section_end:1587528730:upload_artifacts_on_failure ERROR: Job failed: exit code 1  Job #521287673 ( https://gitlab.com/libvirt/libvirt-go-xml/-/jobs/521287673/raw ) Stage: test Name: go_1_13 Trace: Skipping Git submodules setup section_end:1587528683:get_sources section_start:1587528683:restore_cache Restoring cache section_end:1587528685:restore_cache section_start:1587528685:download_artifacts Downloading artifacts section_end:1587528687:download_artifacts section_start:1587528687:build_script Running before_script and script $ go test -timeout 10m -tags xmlroundtrip -v === RUN TestDomainSnapshot --- PASS: TestDomainSnapshot (0.00s) === RUN TestDomain --- PASS: TestDomain (0.01s) === RUN TestNetwork --- PASS: TestNetwork (0.00s) === RUN TestNodeDevice --- PASS: TestNodeDevice (0.00s) === RUN TestSecret --- PASS: TestSecret (0.00s) === RUN TestStoragePool --- PASS: TestStoragePool (0.00s) === RUN TestStorageVolume --- PASS: TestStorageVolume (0.00s) === RUN TestRoundTrip --- FAIL: TestRoundTrip (21.83s) xml_test.go:374: testdata/libvirt/tests/xlconfigdata/test-fullvirt-hypervisor-features.xml: /domain[0]/features[0]/xen[0]: element in expected XML missing in actual XML FAIL exit status 1 FAIL _/builds/libvirt/libvirt-go-xml 21.847s section_end:1587528714:build_script section_start:1587528714:after_script Running after_script section_end:1587528716:after_script section_start:1587528716:upload_artifacts_on_failure Uploading artifacts for failed job section_end:1587528719:upload_artifacts_on_failure ERROR: Job failed: exit code 1  Job #521287649 ( https://gitlab.com/libvirt/libvirt-go-xml/-/jobs/521287649/raw ) Stage: test Name: go_1_10 Trace: Skipping Git submodules setup section_end:1587528635:get_sources section_start:1587528635:restore_cache Restoring cache section_end:1587528637:restore_cache section_start:1587528637:download_artifacts Downloading artifacts section_end:1587528640:download_artifacts section_start:1587528640:build_script Running before_script and script $ go test -timeout 10m -tags xmlroundtrip -v === RUN TestDomainSnapshot --- PASS: TestDomainSnapshot (0.00s) === RUN TestDomain --- PASS: TestDomain (0.01s) === RUN TestNetwork --- PASS: TestNetwork (0.00s) === RUN TestNodeDevice --- PASS: TestNodeDevice (0.00s) === RUN TestSecret --- PASS: TestSecret (0.00s) === RUN TestStoragePool --- PASS: TestStoragePool (0.00s) === RUN TestStorageVolume --- PASS: TestStorageVolume (0.00s) === RUN TestRoundTrip --- FAIL: TestRoundTrip (18.60s) xml_test.go:374: testdata/libvirt/tests/xlconfigdata/test-fullvirt-hypervisor-features.xml: /domain[0]/features[0]/xen[0]: element in expected XML missing in actual XML FAIL exit status 1 FAIL _/builds/libvirt/libvirt-go-xml 18.621s section_end:1587528663:build_script section_start:1587528663:after_script Running after_script section_end:1587528665:after_script section_start:1587528665:upload_artifacts_on_failure Uploading artifacts for failed job section_end:1587528667:upload_artifacts_on_failure ERROR: Job failed: exit code 1  -- You're receiving this email because of your account on gitlab.com.
1 0
0 0
  • ← Newer
  • 1
  • ...
  • 618
  • 619
  • 620
  • 621
  • 622
  • 623
  • 624
  • ...
  • 1022
  • Older →

HyperKitty Powered by HyperKitty version 1.3.12.