libvirt List Archives
Sign In Sign Up
Manage this list Sign In Sign Up

Keyboard Shortcuts

Thread View

  • j: Next unread message
  • k: Previous unread message
  • j a: Jump to all threads
  • j l: Jump to MailingList overview

CI

Thread Start a new thread
Download
Threads by month
  • ----- 2026 -----
  • September
  • August
  • July
  • June
  • May
  • April
  • March
  • February
  • January
  • ----- 2025 -----
  • December
  • November
  • October
  • September
  • August
  • July
  • June
  • May
  • April
  • March
  • February
  • January
  • ----- 2024 -----
  • December
  • November
  • October
  • September
  • August
  • July
  • June
  • May
  • April
  • March
  • February
  • January
  • ----- 2023 -----
  • December
  • November
  • October
  • September
  • August
  • July
  • June
  • May
  • April
  • March
  • February
  • January
  • ----- 2022 -----
  • December
  • November
  • October
  • September
  • August
  • July
  • June
  • May
  • April
  • March
  • February
  • January
  • ----- 2021 -----
  • December
  • November
  • October
  • September
  • August
  • July
  • June
  • May
  • April
  • March
  • February
  • January
  • ----- 2020 -----
  • December
  • November
  • October
  • September
  • August
  • July
  • June
  • May
  • April
  • March
  • February
  • January
  • ----- 2019 -----
  • December
  • November
  • October
  • September
  • August
  • July
  • June
  • May
  • April
  • March
  • February
  • January
  • ----- 2018 -----
  • December
  • November
  • October
  • September
  • August
  • July
  • June
  • May
  • April
  • March
  • February
  • January
  • ----- 2017 -----
  • December
  • November
  • October
  • September
  • August
  • July
  • June
  • May
  • April
  • March
  • February
  • January
  • ----- 2016 -----
  • December
  • November
  • October
  • September
  • August
  • July
ci@lists.libvirt.org

  • 2 participants
  • 10209 discussions
libvirt-go-xml | Pipeline #174810521 has failed for master | b3a1a6b8
by GitLab 06 Aug '20

06 Aug '20
Your pipeline has failed. Project: libvirt-go-xml ( https://gitlab.com/libvirt/libvirt-go-xml ) Branch: master ( https://gitlab.com/libvirt/libvirt-go-xml/-/commits/master ) Commit: b3a1a6b8 ( https://gitlab.com/libvirt/libvirt-go-xml/-/commit/b3a1a6b8bb41c9aba2ea41fc… ) Commit Message: Add support for storage pool 'cow' feature Sig... Commit Author: Daniel Berrange ( https://gitlab.com/berrange ) Pipeline #174810521 ( https://gitlab.com/libvirt/libvirt-go-xml/-/pipelines/174810521 ) triggered by Daniel Berrange ( https://gitlab.com/berrange ) had 5 failed builds. Job #673250660 ( https://gitlab.com/libvirt/libvirt-go-xml/-/jobs/673250660/raw ) Stage: build Name: go_1_12 Trace: Fetching changes... Initialized empty Git repository in /builds/libvirt/libvirt-go-xml/.git/ Created fresh repository. Checking out b3a1a6b8 as master... Skipping Git submodules setup section_end:1596683169:get_sources section_start:1596683169:step_script Executing "step_script" stage of the job script $ go test -timeout 10m -tags xmlroundtrip -v === RUN TestDomainSnapshot --- PASS: TestDomainSnapshot (0.00s) === RUN TestDomain --- PASS: TestDomain (0.01s) === RUN TestNetwork --- PASS: TestNetwork (0.00s) === RUN TestNodeDevice --- PASS: TestNodeDevice (0.00s) === RUN TestSecret --- PASS: TestSecret (0.00s) === RUN TestStoragePool --- PASS: TestStoragePool (0.00s) === RUN TestStorageVolume --- PASS: TestStorageVolume (0.00s) === RUN TestRoundTrip --- FAIL: TestRoundTrip (4.70s) xml_test.go:374: testdata/libvirt/tests/qemuhotplugtestdevices/qemuhotplug-ivshmem-plain-detach.xml: /shmem[0]/@role: attribute 'peer' in expected XML missing in actual XML FAIL exit status 1 FAIL _/builds/libvirt/libvirt-go-xml 4.713s section_end:1596683180:step_script ERROR: Job failed: exit code 1  Job #673250663 ( https://gitlab.com/libvirt/libvirt-go-xml/-/jobs/673250663/raw ) Stage: build Name: go_1_13 Trace: Fetching changes... Initialized empty Git repository in /builds/libvirt/libvirt-go-xml/.git/ Created fresh repository. Checking out b3a1a6b8 as master... Skipping Git submodules setup section_end:1596683163:get_sources section_start:1596683163:step_script Executing "step_script" stage of the job script $ go test -timeout 10m -tags xmlroundtrip -v === RUN TestDomainSnapshot --- PASS: TestDomainSnapshot (0.00s) === RUN TestDomain --- PASS: TestDomain (0.01s) === RUN TestNetwork --- PASS: TestNetwork (0.00s) === RUN TestNodeDevice --- PASS: TestNodeDevice (0.00s) === RUN TestSecret --- PASS: TestSecret (0.00s) === RUN TestStoragePool --- PASS: TestStoragePool (0.00s) === RUN TestStorageVolume --- PASS: TestStorageVolume (0.00s) === RUN TestRoundTrip --- FAIL: TestRoundTrip (4.93s) xml_test.go:374: testdata/libvirt/tests/qemuhotplugtestdevices/qemuhotplug-ivshmem-plain-detach.xml: /shmem[0]/@role: attribute 'peer' in expected XML missing in actual XML FAIL exit status 1 FAIL _/builds/libvirt/libvirt-go-xml 4.945s section_end:1596683175:step_script ERROR: Job failed: exit code 1  Job #673250617 ( https://gitlab.com/libvirt/libvirt-go-xml/-/jobs/673250617/raw ) Stage: build Name: go_1_11 Trace: Fetching changes... Initialized empty Git repository in /builds/libvirt/libvirt-go-xml/.git/ Created fresh repository. Checking out b3a1a6b8 as master... Skipping Git submodules setup section_end:1596683162:get_sources section_start:1596683162:step_script Executing "step_script" stage of the job script $ go test -timeout 10m -tags xmlroundtrip -v === RUN TestDomainSnapshot --- PASS: TestDomainSnapshot (0.00s) === RUN TestDomain --- PASS: TestDomain (0.01s) === RUN TestNetwork --- PASS: TestNetwork (0.00s) === RUN TestNodeDevice --- PASS: TestNodeDevice (0.00s) === RUN TestSecret --- PASS: TestSecret (0.00s) === RUN TestStoragePool --- PASS: TestStoragePool (0.00s) === RUN TestStorageVolume --- PASS: TestStorageVolume (0.00s) === RUN TestRoundTrip --- FAIL: TestRoundTrip (5.06s) xml_test.go:374: testdata/libvirt/tests/qemuhotplugtestdevices/qemuhotplug-ivshmem-plain-detach.xml: /shmem[0]/@role: attribute 'peer' in expected XML missing in actual XML FAIL exit status 1 FAIL _/builds/libvirt/libvirt-go-xml 5.070s section_end:1596683174:step_script ERROR: Job failed: exit code 1  Job #673250670 ( https://gitlab.com/libvirt/libvirt-go-xml/-/jobs/673250670/raw ) Stage: build Name: go_1_14 Trace: Fetching changes... Initialized empty Git repository in /builds/libvirt/libvirt-go-xml/.git/ Created fresh repository. Checking out b3a1a6b8 as master... Skipping Git submodules setup section_end:1596683161:get_sources section_start:1596683161:step_script Executing "step_script" stage of the job script $ go test -timeout 10m -tags xmlroundtrip -v === RUN TestDomainSnapshot --- PASS: TestDomainSnapshot (0.00s) === RUN TestDomain --- PASS: TestDomain (0.01s) === RUN TestNetwork --- PASS: TestNetwork (0.00s) === RUN TestNodeDevice --- PASS: TestNodeDevice (0.00s) === RUN TestSecret --- PASS: TestSecret (0.00s) === RUN TestStoragePool --- PASS: TestStoragePool (0.00s) === RUN TestStorageVolume --- PASS: TestStorageVolume (0.00s) === RUN TestRoundTrip xml_test.go:374: testdata/libvirt/tests/qemuhotplugtestdevices/qemuhotplug-ivshmem-plain-detach.xml: /shmem[0]/@role: attribute 'peer' in expected XML missing in actual XML --- FAIL: TestRoundTrip (5.51s) FAIL exit status 1 FAIL _/builds/libvirt/libvirt-go-xml 5.529s section_end:1596683173:step_script ERROR: Job failed: exit code 1  Job #673250600 ( https://gitlab.com/libvirt/libvirt-go-xml/-/jobs/673250600/raw ) Stage: build Name: go_1_10 Trace: Fetching changes... Initialized empty Git repository in /builds/libvirt/libvirt-go-xml/.git/ Created fresh repository. Checking out b3a1a6b8 as master... Skipping Git submodules setup section_end:1596683158:get_sources section_start:1596683158:step_script Executing "step_script" stage of the job script $ go test -timeout 10m -tags xmlroundtrip -v === RUN TestDomainSnapshot --- PASS: TestDomainSnapshot (0.00s) === RUN TestDomain --- PASS: TestDomain (0.01s) === RUN TestNetwork --- PASS: TestNetwork (0.00s) === RUN TestNodeDevice --- PASS: TestNodeDevice (0.00s) === RUN TestSecret --- PASS: TestSecret (0.00s) === RUN TestStoragePool --- PASS: TestStoragePool (0.00s) === RUN TestStorageVolume --- PASS: TestStorageVolume (0.00s) === RUN TestRoundTrip --- FAIL: TestRoundTrip (5.23s) xml_test.go:374: testdata/libvirt/tests/qemuhotplugtestdevices/qemuhotplug-ivshmem-plain-detach.xml: /shmem[0]/@role: attribute 'peer' in expected XML missing in actual XML FAIL exit status 1 FAIL _/builds/libvirt/libvirt-go-xml 5.243s section_end:1596683168:step_script ERROR: Job failed: exit code 1  -- You're receiving this email because of your account on gitlab.com.
1 0
0 0
libvirt-go-xml | Pipeline #174379158 has failed for master | b3a1a6b8
by GitLab 05 Aug '20

05 Aug '20
Your pipeline has failed. Project: libvirt-go-xml ( https://gitlab.com/libvirt/libvirt-go-xml ) Branch: master ( https://gitlab.com/libvirt/libvirt-go-xml/-/commits/master ) Commit: b3a1a6b8 ( https://gitlab.com/libvirt/libvirt-go-xml/-/commit/b3a1a6b8bb41c9aba2ea41fc… ) Commit Message: Add support for storage pool 'cow' feature Sig... Commit Author: Daniel Berrange ( https://gitlab.com/berrange ) Pipeline #174379158 ( https://gitlab.com/libvirt/libvirt-go-xml/-/pipelines/174379158 ) triggered by Daniel Berrange ( https://gitlab.com/berrange ) had 5 failed builds. Job #671346706 ( https://gitlab.com/libvirt/libvirt-go-xml/-/jobs/671346706/raw ) Stage: build Name: go_1_10 Job #671346745 ( https://gitlab.com/libvirt/libvirt-go-xml/-/jobs/671346745/raw ) Stage: build Name: go_1_12 Trace: Fetching changes... Initialized empty Git repository in /builds/libvirt/libvirt-go-xml/.git/ Created fresh repository. Checking out b3a1a6b8 as master... Skipping Git submodules setup section_end:1596596769:get_sources section_start:1596596769:step_script Executing "step_script" stage of the job script $ go test -timeout 10m -tags xmlroundtrip -v === RUN TestDomainSnapshot --- PASS: TestDomainSnapshot (0.00s) === RUN TestDomain --- PASS: TestDomain (0.01s) === RUN TestNetwork --- PASS: TestNetwork (0.00s) === RUN TestNodeDevice --- PASS: TestNodeDevice (0.00s) === RUN TestSecret --- PASS: TestSecret (0.00s) === RUN TestStoragePool --- PASS: TestStoragePool (0.00s) === RUN TestStorageVolume --- PASS: TestStorageVolume (0.00s) === RUN TestRoundTrip --- FAIL: TestRoundTrip (5.08s) xml_test.go:374: testdata/libvirt/tests/qemuhotplugtestdevices/qemuhotplug-ivshmem-plain-detach.xml: /shmem[0]/@role: attribute 'peer' in expected XML missing in actual XML FAIL exit status 1 FAIL _/builds/libvirt/libvirt-go-xml 5.091s section_end:1596596781:step_script ERROR: Job failed: exit code 1  Job #671346801 ( https://gitlab.com/libvirt/libvirt-go-xml/-/jobs/671346801/raw ) Stage: build Name: go_1_14 Trace: Fetching changes... Initialized empty Git repository in /builds/libvirt/libvirt-go-xml/.git/ Created fresh repository. Checking out b3a1a6b8 as master... Skipping Git submodules setup section_end:1596596766:get_sources section_start:1596596766:step_script Executing "step_script" stage of the job script $ go test -timeout 10m -tags xmlroundtrip -v === RUN TestDomainSnapshot --- PASS: TestDomainSnapshot (0.00s) === RUN TestDomain --- PASS: TestDomain (0.01s) === RUN TestNetwork --- PASS: TestNetwork (0.00s) === RUN TestNodeDevice --- PASS: TestNodeDevice (0.00s) === RUN TestSecret --- PASS: TestSecret (0.00s) === RUN TestStoragePool --- PASS: TestStoragePool (0.00s) === RUN TestStorageVolume --- PASS: TestStorageVolume (0.00s) === RUN TestRoundTrip xml_test.go:374: testdata/libvirt/tests/qemuhotplugtestdevices/qemuhotplug-ivshmem-plain-detach.xml: /shmem[0]/@role: attribute 'peer' in expected XML missing in actual XML --- FAIL: TestRoundTrip (5.08s) FAIL exit status 1 FAIL _/builds/libvirt/libvirt-go-xml 5.095s section_end:1596596778:step_script ERROR: Job failed: exit code 1  Job #671346775 ( https://gitlab.com/libvirt/libvirt-go-xml/-/jobs/671346775/raw ) Stage: build Name: go_1_13 Trace: Fetching changes... Initialized empty Git repository in /builds/libvirt/libvirt-go-xml/.git/ Created fresh repository. Checking out b3a1a6b8 as master... Skipping Git submodules setup section_end:1596596769:get_sources section_start:1596596769:step_script Executing "step_script" stage of the job script $ go test -timeout 10m -tags xmlroundtrip -v === RUN TestDomainSnapshot --- PASS: TestDomainSnapshot (0.00s) === RUN TestDomain --- PASS: TestDomain (0.01s) === RUN TestNetwork --- PASS: TestNetwork (0.00s) === RUN TestNodeDevice --- PASS: TestNodeDevice (0.00s) === RUN TestSecret --- PASS: TestSecret (0.00s) === RUN TestStoragePool --- PASS: TestStoragePool (0.00s) === RUN TestStorageVolume --- PASS: TestStorageVolume (0.00s) === RUN TestRoundTrip --- FAIL: TestRoundTrip (5.05s) xml_test.go:374: testdata/libvirt/tests/qemuhotplugtestdevices/qemuhotplug-ivshmem-plain-detach.xml: /shmem[0]/@role: attribute 'peer' in expected XML missing in actual XML FAIL exit status 1 FAIL _/builds/libvirt/libvirt-go-xml 5.065s section_end:1596596781:step_script ERROR: Job failed: exit code 1  Job #671346729 ( https://gitlab.com/libvirt/libvirt-go-xml/-/jobs/671346729/raw ) Stage: build Name: go_1_11 Trace: Fetching changes... Initialized empty Git repository in /builds/libvirt/libvirt-go-xml/.git/ Created fresh repository. Checking out b3a1a6b8 as master... Skipping Git submodules setup section_end:1596596768:get_sources section_start:1596596768:step_script Executing "step_script" stage of the job script $ go test -timeout 10m -tags xmlroundtrip -v === RUN TestDomainSnapshot --- PASS: TestDomainSnapshot (0.00s) === RUN TestDomain --- PASS: TestDomain (0.01s) === RUN TestNetwork --- PASS: TestNetwork (0.00s) === RUN TestNodeDevice --- PASS: TestNodeDevice (0.00s) === RUN TestSecret --- PASS: TestSecret (0.00s) === RUN TestStoragePool --- PASS: TestStoragePool (0.00s) === RUN TestStorageVolume --- PASS: TestStorageVolume (0.00s) === RUN TestRoundTrip --- FAIL: TestRoundTrip (4.85s) xml_test.go:374: testdata/libvirt/tests/qemuhotplugtestdevices/qemuhotplug-ivshmem-plain-detach.xml: /shmem[0]/@role: attribute 'peer' in expected XML missing in actual XML FAIL exit status 1 FAIL _/builds/libvirt/libvirt-go-xml 4.870s section_end:1596596780:step_script ERROR: Job failed: exit code 1  -- You're receiving this email because of your account on gitlab.com.
1 0
0 0
libvirt | Pipeline #174150487 has failed for master | 2b9e2771
by GitLab 04 Aug '20

04 Aug '20
Your pipeline has failed. Project: libvirt ( https://gitlab.com/libvirt/libvirt ) Branch: master ( https://gitlab.com/libvirt/libvirt/-/commits/master ) Commit: 2b9e2771 ( https://gitlab.com/libvirt/libvirt/-/commit/2b9e277106b76095105ad8f878c69b5… ) Commit Message: network: Use single quotes in default network c... Commit Author: Andrea Bolognani ( https://gitlab.com/abologna ) Pipeline #174150487 ( https://gitlab.com/libvirt/libvirt/-/pipelines/174150487 ) triggered by Andrea Bolognani ( https://gitlab.com/abologna ) had 2 failed builds. Job #670297678 ( https://gitlab.com/libvirt/libvirt/-/jobs/670297678/raw ) Stage: builds Name: x64-freebsd-12-build Trace: CI_COMMIT_SHA: "2b9e277106b76095105ad8f878c69b5152117365" PATH: "$PATH" PKG_CONFIG_PATH: "" PYTHON: "/usr/local/bin/python3" MAKE: "/usr/local/bin/gmake" build_task: install_script: - pkg install -y augeas autoconf automake avahi bash bash-completion ca_root_nss ccache chrony cppi curl cyrus-sasl dbus diskscrub dnsmasq fusefs-libs gdb gettext gettext-tools git glib gmake gnutls hal libpcap libpciaccess libssh libssh2 libtool libxml2 libxslt lsof ncurses ninja p5-App-cpanminus patch perl5 pkgconf polkit py37-docutils py37-flake8 py37-pip py37-setuptools py37-wheel python3 qemu-utils radvd readline screen sudo vim yajl - /usr/local/bin/pip-3.7 install meson==0.54.0 clone_script: - git clone --depth 100 "$CI_REPOSITORY_URL" . - git fetch origin "$CI_COMMIT_REF_NAME" - git reset --hard "$CI_COMMIT_SHA" build_script: - meson build --prefix=$(pwd)/install-root - if test "$(uname)" = "FreeBSD"; then ninja -C build dist; fi - if test "$(uname)" = "Darwin"; then ninja -C build && ninja -C build install; fi $ cirrus-run -v --show-build-log always ci/cirrus/$NAME.yml Traceback (most recent call last): File "/usr/bin/cirrus-run", line 11, in <module> load_entry_point('cirrus-run==0.2.0', 'console_scripts', 'cirrus-run')() File "/usr/lib/python3.6/site-packages/cirrus_run-0.2.0-py3.6.egg/cirrus_run/cli.py", line 40, in main File "/usr/lib/python3.6/site-packages/cirrus_run-0.2.0-py3.6.egg/cirrus_run/queries.py", line 84, in create_build File "/usr/lib/python3.6/site-packages/cirrus_run-0.2.0-py3.6.egg/cirrus_run/api.py", line 64, in __call__ File "/usr/lib/python3.6/site-packages/cirrus_run-0.2.0-py3.6.egg/cirrus_run/api.py", line 68, in _parse_api_response cirrus_run.api.CirrusAPIError: API returned 1 error(s): [{'message': 'Internal Server Error(s) while executing query'}] section_end:1596546829:step_script ERROR: Job failed: exit code 1  Job #670297682 ( https://gitlab.com/libvirt/libvirt/-/jobs/670297682/raw ) Stage: builds Name: x64-macos-1015-build Trace: CI_COMMIT_SHA: "2b9e277106b76095105ad8f878c69b5152117365" PATH: "/usr/local/opt/ccache/libexec:/usr/local/opt/gettext/bin:/usr/local/opt/libpcap/bin:/usr/local/opt/libxslt/bin:/usr/local/opt/rpcgen/bin:$PATH" PKG_CONFIG_PATH: "/usr/local/opt/curl/lib/pkgconfig:/usr/local/opt/libpcap/lib/pkgconfig:/usr/local/opt/libxml2/lib/pkgconfig:/usr/local/opt/ncurses/lib/pkgconfig:/usr/local/opt/readline/lib/pkgconfig" PYTHON: "/usr/local/bin/python3" MAKE: "/usr/local/bin/gmake" build_task: install_script: - brew install augeas autoconf automake bash bash-completion ccache cpanminus cppi curl dbus dnsmasq docutils flake8 gdb gettext git glib gnutls gpatch libiscsi libpcap libssh libssh2 libtool libxml2 libxslt lsof make ncurses ninja perl pkg-config python3 qemu readline rpcgen screen scrub vim xz yajl - /usr/local/bin/pip3 install meson==0.54.0 clone_script: - git clone --depth 100 "$CI_REPOSITORY_URL" . - git fetch origin "$CI_COMMIT_REF_NAME" - git reset --hard "$CI_COMMIT_SHA" build_script: - meson build --prefix=$(pwd)/install-root - if test "$(uname)" = "FreeBSD"; then ninja -C build dist; fi - if test "$(uname)" = "Darwin"; then ninja -C build && ninja -C build install; fi $ cirrus-run -v --show-build-log always ci/cirrus/$NAME.yml Traceback (most recent call last): File "/usr/bin/cirrus-run", line 11, in <module> load_entry_point('cirrus-run==0.2.0', 'console_scripts', 'cirrus-run')() File "/usr/lib/python3.6/site-packages/cirrus_run-0.2.0-py3.6.egg/cirrus_run/cli.py", line 40, in main File "/usr/lib/python3.6/site-packages/cirrus_run-0.2.0-py3.6.egg/cirrus_run/queries.py", line 84, in create_build File "/usr/lib/python3.6/site-packages/cirrus_run-0.2.0-py3.6.egg/cirrus_run/api.py", line 64, in __call__ File "/usr/lib/python3.6/site-packages/cirrus_run-0.2.0-py3.6.egg/cirrus_run/api.py", line 68, in _parse_api_response cirrus_run.api.CirrusAPIError: API returned 1 error(s): [{'message': 'Internal Server Error(s) while executing query'}] section_end:1596546831:step_script ERROR: Job failed: exit code 1  -- You're receiving this email because of your account on gitlab.com.
1 0
0 0
libvirt | Pipeline #174122912 has failed for master | 8361d335
by GitLab 04 Aug '20

04 Aug '20
Your pipeline has failed. Project: libvirt ( https://gitlab.com/libvirt/libvirt ) Branch: master ( https://gitlab.com/libvirt/libvirt/-/commits/master ) Commit: 8361d335 ( https://gitlab.com/libvirt/libvirt/-/commit/8361d335ab77cb1f3b70a3fa92f7e2d… ) Commit Message: mdev: Fix daemon crash when reattaching mdevs o... Commit Author: Wu Binfeng ( https://gitlab.com/BinfengWu ) Committed by: Erik Skultety ( https://gitlab.com/eskultety ) Pipeline #174122912 ( https://gitlab.com/libvirt/libvirt/-/pipelines/174122912 ) triggered by Erik Skultety ( https://gitlab.com/eskultety ) had 1 failed build. Job #670166615 ( https://gitlab.com/libvirt/libvirt/-/jobs/670166615/raw ) Stage: builds Name: x64-freebsd-12-build Trace: Timeout: 0 The output from the failed tests: 97/138 qemumonitorjsontest FAIL 6.423260927200317 s (killed by signal 11 SIGSEGV) --- command --- 12:34:08 LIBVIRT_AUTOSTART='0' abs_top_srcdir='/tmp/cirrus-ci-build/build/meson-private/dist-unpack/libvirt-6.7.0' abs_srcdir='/tmp/cirrus-ci-build/build/meson-private/dist-unpack/libvirt-6.7.0/tests' abs_top_builddir='/tmp/cirrus-ci-build/build/meson-private/dist-build' VIR_TEST_EXPENSIVE='1' abs_builddir='/tmp/cirrus-ci-build/build/meson-private/dist-build/tests' LC_ALL='C' /tmp/cirrus-ci-build/build/meson-private/dist-build/tests/qemumonitorjsontest --- stderr --- TEST: qemumonitorjsontest .... ------- Full log written to /tmp/cirrus-ci-build/build/meson-private/dist-build/meson-logs/testlog.txt FAILED: meson-test /usr/local/bin/meson test --no-rebuild --print-errorlogs ninja: build stopped: subcommand failed. Running custom dist script '/tmp/cirrus-ci-build/scripts/meson-python.sh /usr/local/bin/python3 /tmp/cirrus-ci-build/scripts/meson-dist.py /tmp/cirrus-ci-build/build libvirt.spec' Running custom dist script '/tmp/cirrus-ci-build/scripts/meson-python.sh /usr/local/bin/python3 /tmp/cirrus-ci-build/scripts/meson-dist.py /tmp/cirrus-ci-build/build AUTHORS' Testing distribution package /tmp/cirrus-ci-build/build/meson-dist/libvirt-6.7.0.tar.xz Running unit tests on the distribution package failed Dist check build directory was /tmp/cirrus-ci-build/build/meson-private/dist-build FAILED: meson-dist /usr/local/bin/meson dist ninja: build stopped: subcommand failed. Build failed: https://cirrus-ci.com/build/4635516589047808 section_end:1596544470:step_script ERROR: Job failed: exit code 1  -- You're receiving this email because of your account on gitlab.com.
1 0
0 0
libvirt-go-xml | Pipeline #173953397 has failed for master | b3a1a6b8
by GitLab 04 Aug '20

04 Aug '20
Your pipeline has failed. Project: libvirt-go-xml ( https://gitlab.com/libvirt/libvirt-go-xml ) Branch: master ( https://gitlab.com/libvirt/libvirt-go-xml/-/commits/master ) Commit: b3a1a6b8 ( https://gitlab.com/libvirt/libvirt-go-xml/-/commit/b3a1a6b8bb41c9aba2ea41fc… ) Commit Message: Add support for storage pool 'cow' feature Sig... Commit Author: Daniel Berrange ( https://gitlab.com/berrange ) Pipeline #173953397 ( https://gitlab.com/libvirt/libvirt-go-xml/-/pipelines/173953397 ) triggered by Daniel Berrange ( https://gitlab.com/berrange ) had 5 failed builds. Job #669448882 ( https://gitlab.com/libvirt/libvirt-go-xml/-/jobs/669448882/raw ) Stage: build Name: go_1_14 Trace: Fetching changes... Initialized empty Git repository in /builds/libvirt/libvirt-go-xml/.git/ Created fresh repository. Checking out b3a1a6b8 as master... Skipping Git submodules setup section_end:1596510377:get_sources section_start:1596510377:step_script Executing "step_script" stage of the job script $ go test -timeout 10m -tags xmlroundtrip -v === RUN TestDomainSnapshot --- PASS: TestDomainSnapshot (0.00s) === RUN TestDomain --- PASS: TestDomain (0.01s) === RUN TestNetwork --- PASS: TestNetwork (0.00s) === RUN TestNodeDevice --- PASS: TestNodeDevice (0.00s) === RUN TestSecret --- PASS: TestSecret (0.00s) === RUN TestStoragePool --- PASS: TestStoragePool (0.00s) === RUN TestStorageVolume --- PASS: TestStorageVolume (0.00s) === RUN TestRoundTrip xml_test.go:374: testdata/libvirt/tests/qemuhotplugtestdevices/qemuhotplug-ivshmem-plain-detach.xml: /shmem[0]/@role: attribute 'peer' in expected XML missing in actual XML --- FAIL: TestRoundTrip (4.73s) FAIL exit status 1 FAIL _/builds/libvirt/libvirt-go-xml 4.745s section_end:1596510389:step_script ERROR: Job failed: exit code 1  Job #669448872 ( https://gitlab.com/libvirt/libvirt-go-xml/-/jobs/669448872/raw ) Stage: build Name: go_1_12 Trace: Fetching changes... Initialized empty Git repository in /builds/libvirt/libvirt-go-xml/.git/ Created fresh repository. Checking out b3a1a6b8 as master... Skipping Git submodules setup section_end:1596510373:get_sources section_start:1596510373:step_script Executing "step_script" stage of the job script $ go test -timeout 10m -tags xmlroundtrip -v === RUN TestDomainSnapshot --- PASS: TestDomainSnapshot (0.00s) === RUN TestDomain --- PASS: TestDomain (0.01s) === RUN TestNetwork --- PASS: TestNetwork (0.00s) === RUN TestNodeDevice --- PASS: TestNodeDevice (0.00s) === RUN TestSecret --- PASS: TestSecret (0.00s) === RUN TestStoragePool --- PASS: TestStoragePool (0.00s) === RUN TestStorageVolume --- PASS: TestStorageVolume (0.00s) === RUN TestRoundTrip --- FAIL: TestRoundTrip (4.98s) xml_test.go:374: testdata/libvirt/tests/qemuhotplugtestdevices/qemuhotplug-ivshmem-plain-detach.xml: /shmem[0]/@role: attribute 'peer' in expected XML missing in actual XML FAIL exit status 1 FAIL _/builds/libvirt/libvirt-go-xml 5.003s section_end:1596510387:step_script ERROR: Job failed: exit code 1  Job #669448867 ( https://gitlab.com/libvirt/libvirt-go-xml/-/jobs/669448867/raw ) Stage: build Name: go_1_11 Trace: Fetching changes... Initialized empty Git repository in /builds/libvirt/libvirt-go-xml/.git/ Created fresh repository. Checking out b3a1a6b8 as master... Skipping Git submodules setup section_end:1596510372:get_sources section_start:1596510372:step_script Executing "step_script" stage of the job script $ go test -timeout 10m -tags xmlroundtrip -v === RUN TestDomainSnapshot --- PASS: TestDomainSnapshot (0.00s) === RUN TestDomain --- PASS: TestDomain (0.01s) === RUN TestNetwork --- PASS: TestNetwork (0.00s) === RUN TestNodeDevice --- PASS: TestNodeDevice (0.00s) === RUN TestSecret --- PASS: TestSecret (0.00s) === RUN TestStoragePool --- PASS: TestStoragePool (0.00s) === RUN TestStorageVolume --- PASS: TestStorageVolume (0.00s) === RUN TestRoundTrip --- FAIL: TestRoundTrip (4.78s) xml_test.go:374: testdata/libvirt/tests/qemuhotplugtestdevices/qemuhotplug-ivshmem-plain-detach.xml: /shmem[0]/@role: attribute 'peer' in expected XML missing in actual XML FAIL exit status 1 FAIL _/builds/libvirt/libvirt-go-xml 4.798s section_end:1596510384:step_script ERROR: Job failed: exit code 1  Job #669448875 ( https://gitlab.com/libvirt/libvirt-go-xml/-/jobs/669448875/raw ) Stage: build Name: go_1_13 Trace: Fetching changes... Initialized empty Git repository in /builds/libvirt/libvirt-go-xml/.git/ Created fresh repository. Checking out b3a1a6b8 as master... Skipping Git submodules setup section_end:1596510372:get_sources section_start:1596510372:step_script Executing "step_script" stage of the job script $ go test -timeout 10m -tags xmlroundtrip -v === RUN TestDomainSnapshot --- PASS: TestDomainSnapshot (0.00s) === RUN TestDomain --- PASS: TestDomain (0.01s) === RUN TestNetwork --- PASS: TestNetwork (0.00s) === RUN TestNodeDevice --- PASS: TestNodeDevice (0.00s) === RUN TestSecret --- PASS: TestSecret (0.00s) === RUN TestStoragePool --- PASS: TestStoragePool (0.00s) === RUN TestStorageVolume --- PASS: TestStorageVolume (0.00s) === RUN TestRoundTrip --- FAIL: TestRoundTrip (4.69s) xml_test.go:374: testdata/libvirt/tests/qemuhotplugtestdevices/qemuhotplug-ivshmem-plain-detach.xml: /shmem[0]/@role: attribute 'peer' in expected XML missing in actual XML FAIL exit status 1 FAIL _/builds/libvirt/libvirt-go-xml 4.709s section_end:1596510384:step_script ERROR: Job failed: exit code 1  Job #669448857 ( https://gitlab.com/libvirt/libvirt-go-xml/-/jobs/669448857/raw ) Stage: build Name: go_1_10 Trace: Fetching changes... Initialized empty Git repository in /builds/libvirt/libvirt-go-xml/.git/ Created fresh repository. Checking out b3a1a6b8 as master... Skipping Git submodules setup section_end:1596510369:get_sources section_start:1596510369:step_script Executing "step_script" stage of the job script $ go test -timeout 10m -tags xmlroundtrip -v === RUN TestDomainSnapshot --- PASS: TestDomainSnapshot (0.00s) === RUN TestDomain --- PASS: TestDomain (0.01s) === RUN TestNetwork --- PASS: TestNetwork (0.00s) === RUN TestNodeDevice --- PASS: TestNodeDevice (0.00s) === RUN TestSecret --- PASS: TestSecret (0.00s) === RUN TestStoragePool --- PASS: TestStoragePool (0.00s) === RUN TestStorageVolume --- PASS: TestStorageVolume (0.00s) === RUN TestRoundTrip --- FAIL: TestRoundTrip (5.63s) xml_test.go:374: testdata/libvirt/tests/qemuhotplugtestdevices/qemuhotplug-ivshmem-plain-detach.xml: /shmem[0]/@role: attribute 'peer' in expected XML missing in actual XML FAIL exit status 1 FAIL _/builds/libvirt/libvirt-go-xml 5.645s section_end:1596510380:step_script ERROR: Job failed: exit code 1  -- You're receiving this email because of your account on gitlab.com.
1 0
0 0
libvirt | Pipeline #173809842 has failed for master | 587a3267
by GitLab 03 Aug '20

03 Aug '20
Your pipeline has failed. Project: libvirt ( https://gitlab.com/libvirt/libvirt ) Branch: master ( https://gitlab.com/libvirt/libvirt/-/commits/master ) Commit: 587a3267 ( https://gitlab.com/libvirt/libvirt/-/commit/587a32672e539e0c120df4a7f488bbc… ) Commit Message: qemu: capabilities: add missing comma Signed-o... Commit Author: Jano Tomko ( https://gitlab.com/jano.tomko ) Pipeline #173809842 ( https://gitlab.com/libvirt/libvirt/-/pipelines/173809842 ) triggered by Jano Tomko ( https://gitlab.com/jano.tomko ) had 1 failed build. Job #668841193 ( https://gitlab.com/libvirt/libvirt/-/jobs/668841193/raw ) Stage: builds Name: x64-macos-1015-build Trace: CI_REPOSITORY_URL: "https://gitlab-ci-token:[MASKED]@gitlab.com/libvirt/libvirt.git" CI_COMMIT_REF_NAME: "master" CI_COMMIT_SHA: "587a32672e539e0c120df4a7f488bbc4a839fd76" PATH: "/usr/local/opt/ccache/libexec:/usr/local/opt/gettext/bin:/usr/local/opt/libpcap/bin:/usr/local/opt/libxslt/bin:/usr/local/opt/rpcgen/bin:$PATH" PKG_CONFIG_PATH: "/usr/local/opt/curl/lib/pkgconfig:/usr/local/opt/libpcap/lib/pkgconfig:/usr/local/opt/libxml2/lib/pkgconfig:/usr/local/opt/ncurses/lib/pkgconfig:/usr/local/opt/readline/lib/pkgconfig" PYTHON: "/usr/local/bin/python3" MAKE: "/usr/local/bin/gmake" build_task: install_script: - brew install augeas autoconf automake bash bash-completion ccache cpanminus cppi curl dbus dnsmasq docutils flake8 gdb gettext git glib gnutls gpatch libiscsi libpcap libssh libssh2 libtool libxml2 libxslt lsof make ncurses ninja perl pkg-config python3 qemu readline rpcgen screen scrub vim xz yajl - /usr/local/bin/pip3 install meson==0.54.0 clone_script: - git clone --depth 100 "$CI_REPOSITORY_URL" . - git fetch origin "$CI_COMMIT_REF_NAME" - git reset --hard "$CI_COMMIT_SHA" build_script: - meson build --prefix=$(pwd)/install-root - if test "$(uname)" = "FreeBSD"; then ninja -C build dist; fi - if test "$(uname)" = "Darwin"; then ninja -C build && ninja -C build install; fi $ cirrus-run ci/cirrus/$NAME.yml Build created: https://cirrus-ci.com/build/6316467803127808 ............................................................ ............................................................ ............................................................ ............................................................ .............................. Build failed: https://cirrus-ci.com/build/6316467803127808 section_end:1596475319:step_script ERROR: Job failed: exit code 1  -- You're receiving this email because of your account on gitlab.com.
1 0
0 0
libvirt | Pipeline #173727297 has failed for master | 21cd1e72
by GitLab 03 Aug '20

03 Aug '20
Your pipeline has failed. Project: libvirt ( https://gitlab.com/libvirt/libvirt ) Branch: master ( https://gitlab.com/libvirt/libvirt/-/commits/master ) Commit: 21cd1e72 ( https://gitlab.com/libvirt/libvirt/-/commit/21cd1e72546dd6a97486a447520b881… ) Commit Message: util: delete virStringListFree Now that everyt... Commit Author: Jano Tomko ( https://gitlab.com/jano.tomko ) Pipeline #173727297 ( https://gitlab.com/libvirt/libvirt/-/pipelines/173727297 ) triggered by Jano Tomko ( https://gitlab.com/jano.tomko ) had 1 failed build. Job #668440446 ( https://gitlab.com/libvirt/libvirt/-/jobs/668440446/raw ) Stage: containers Name: x64-opensuse-151-container Trace: Architecture: x86_64 CPUs: 1 Total Memory: 3.607GiB Name: 5cf286d0549b ID: 45QG:VEYU:DQRW:XBFG:NCJR:R4FS:BYB4:YK6O:E7T7:2QFC:YX2C:6N5T Docker Root Dir: /var/lib/docker Debug Mode: false Registry: https://index.docker.io/v1/ Labels: Experimental: false Insecure Registries: WARNING: API is accessible on http://0.0.0.0:2375 without encryption. Access to the remote API is equivalent to root access on the host. Refer to the 'Docker daemon attack surface' section in the documentation for more information: https://docs.docker.com/engine/security/security/#docker-daemon-attack-surf… WARNING: bridge-nf-call-iptables is disabled WARNING: bridge-nf-call-ip6tables is disabled 127.0.0.0/8 Live Restore Enabled: false Product License: Community Engine $ docker login registry.gitlab.com -u "$CI_REGISTRY_USER" -p "$CI_REGISTRY_PASSWORD" WARNING! Using --password via the CLI is insecure. Use --password-stdin. Error response from daemon: Get https://registry.gitlab.com/v2/: Get https://gitlab.com/jwt/auth?account=gitlab-ci-token&client_id=docker&offlin…: read tcp 172.17.0.3:54428->172.65.251.78:443: read: connection reset by peer section_end:1596462037:step_script section_start:1596462037:after_script Running after_script Running after script... $ docker logout Removing login credentials for https://index.docker.io/v1/ section_end:1596462038:after_script ERROR: Job failed: exit code 1  -- You're receiving this email because of your account on gitlab.com.
1 0
0 0
libvirt-go-xml | Pipeline #170260150 has failed for master | 21e7ade9
by GitLab 24 Jul '20

24 Jul '20
Your pipeline has failed. Project: libvirt-go-xml ( https://gitlab.com/libvirt/libvirt-go-xml ) Branch: master ( https://gitlab.com/libvirt/libvirt-go-xml/-/commits/master ) Commit: 21e7ade9 ( https://gitlab.com/libvirt/libvirt-go-xml/-/commit/21e7ade909379574cf4d57ad… ) Commit Message: Add domain mac address "type" attribute Signed... Commit Author: Daniel Berrange ( https://gitlab.com/berrange ) Pipeline #170260150 ( https://gitlab.com/libvirt/libvirt-go-xml/-/pipelines/170260150 ) triggered by Daniel Berrange ( https://gitlab.com/berrange ) had 5 failed builds. Job #654186731 ( https://gitlab.com/libvirt/libvirt-go-xml/-/jobs/654186731/raw ) Stage: build Name: go_1_12 Trace: Fetching changes... Initialized empty Git repository in /builds/libvirt/libvirt-go-xml/.git/ Created fresh repository. Checking out 21e7ade9 as master... Skipping Git submodules setup section_end:1595559965:get_sources section_start:1595559965:step_script Executing "step_script" stage of the job script $ go test -timeout 10m -tags xmlroundtrip -v === RUN TestDomainSnapshot --- PASS: TestDomainSnapshot (0.00s) === RUN TestDomain --- PASS: TestDomain (0.01s) === RUN TestNetwork --- PASS: TestNetwork (0.00s) === RUN TestNodeDevice --- PASS: TestNodeDevice (0.00s) === RUN TestSecret --- PASS: TestSecret (0.00s) === RUN TestStoragePool --- PASS: TestStoragePool (0.00s) === RUN TestStorageVolume --- PASS: TestStorageVolume (0.00s) === RUN TestRoundTrip --- FAIL: TestRoundTrip (4.43s) xml_test.go:374: testdata/libvirt/tests/genericxml2xmlindata/network-interface-mac-check.xml: /domain[0]/devices[0]/interface[1]/mac[0]/@check: attribute 'yes' in expected XML missing in actual XML FAIL exit status 1 FAIL _/builds/libvirt/libvirt-go-xml 4.445s section_end:1595559976:step_script ERROR: Job failed: exit code 1  Job #654186788 ( https://gitlab.com/libvirt/libvirt-go-xml/-/jobs/654186788/raw ) Stage: build Name: go_1_14 Trace: Fetching changes... Initialized empty Git repository in /builds/libvirt/libvirt-go-xml/.git/ Created fresh repository. Checking out 21e7ade9 as master... Skipping Git submodules setup section_end:1595559963:get_sources section_start:1595559963:step_script Executing "step_script" stage of the job script $ go test -timeout 10m -tags xmlroundtrip -v === RUN TestDomainSnapshot --- PASS: TestDomainSnapshot (0.00s) === RUN TestDomain --- PASS: TestDomain (0.01s) === RUN TestNetwork --- PASS: TestNetwork (0.00s) === RUN TestNodeDevice --- PASS: TestNodeDevice (0.00s) === RUN TestSecret --- PASS: TestSecret (0.00s) === RUN TestStoragePool --- PASS: TestStoragePool (0.00s) === RUN TestStorageVolume --- PASS: TestStorageVolume (0.00s) === RUN TestRoundTrip xml_test.go:374: testdata/libvirt/tests/genericxml2xmlindata/network-interface-mac-check.xml: /domain[0]/devices[0]/interface[1]/mac[0]/@check: attribute 'yes' in expected XML missing in actual XML --- FAIL: TestRoundTrip (4.53s) FAIL exit status 1 FAIL _/builds/libvirt/libvirt-go-xml 4.547s section_end:1595559974:step_script ERROR: Job failed: exit code 1  Job #654186706 ( https://gitlab.com/libvirt/libvirt-go-xml/-/jobs/654186706/raw ) Stage: build Name: go_1_11 Trace: Fetching changes... Initialized empty Git repository in /builds/libvirt/libvirt-go-xml/.git/ Created fresh repository. Checking out 21e7ade9 as master... Skipping Git submodules setup section_end:1595559963:get_sources section_start:1595559963:step_script Executing "step_script" stage of the job script $ go test -timeout 10m -tags xmlroundtrip -v === RUN TestDomainSnapshot --- PASS: TestDomainSnapshot (0.00s) === RUN TestDomain --- PASS: TestDomain (0.01s) === RUN TestNetwork --- PASS: TestNetwork (0.00s) === RUN TestNodeDevice --- PASS: TestNodeDevice (0.00s) === RUN TestSecret --- PASS: TestSecret (0.00s) === RUN TestStoragePool --- PASS: TestStoragePool (0.00s) === RUN TestStorageVolume --- PASS: TestStorageVolume (0.00s) === RUN TestRoundTrip --- FAIL: TestRoundTrip (4.40s) xml_test.go:374: testdata/libvirt/tests/genericxml2xmlindata/network-interface-mac-check.xml: /domain[0]/devices[0]/interface[1]/mac[0]/@check: attribute 'yes' in expected XML missing in actual XML FAIL exit status 1 FAIL _/builds/libvirt/libvirt-go-xml 4.415s section_end:1595559974:step_script ERROR: Job failed: exit code 1  Job #654186763 ( https://gitlab.com/libvirt/libvirt-go-xml/-/jobs/654186763/raw ) Stage: build Name: go_1_13 Trace: Fetching changes... Initialized empty Git repository in /builds/libvirt/libvirt-go-xml/.git/ Created fresh repository. Checking out 21e7ade9 as master... Skipping Git submodules setup section_end:1595559961:get_sources section_start:1595559961:step_script Executing "step_script" stage of the job script $ go test -timeout 10m -tags xmlroundtrip -v === RUN TestDomainSnapshot --- PASS: TestDomainSnapshot (0.00s) === RUN TestDomain --- PASS: TestDomain (0.01s) === RUN TestNetwork --- PASS: TestNetwork (0.00s) === RUN TestNodeDevice --- PASS: TestNodeDevice (0.00s) === RUN TestSecret --- PASS: TestSecret (0.00s) === RUN TestStoragePool --- PASS: TestStoragePool (0.00s) === RUN TestStorageVolume --- PASS: TestStorageVolume (0.00s) === RUN TestRoundTrip --- FAIL: TestRoundTrip (5.09s) xml_test.go:374: testdata/libvirt/tests/genericxml2xmlindata/network-interface-mac-check.xml: /domain[0]/devices[0]/interface[1]/mac[0]/@check: attribute 'yes' in expected XML missing in actual XML FAIL exit status 1 FAIL _/builds/libvirt/libvirt-go-xml 5.105s section_end:1595559973:step_script ERROR: Job failed: exit code 1  Job #654186688 ( https://gitlab.com/libvirt/libvirt-go-xml/-/jobs/654186688/raw ) Stage: build Name: go_1_10 Trace: Fetching changes... Initialized empty Git repository in /builds/libvirt/libvirt-go-xml/.git/ Created fresh repository. Checking out 21e7ade9 as master... Skipping Git submodules setup section_end:1595559960:get_sources section_start:1595559960:step_script Executing "step_script" stage of the job script $ go test -timeout 10m -tags xmlroundtrip -v === RUN TestDomainSnapshot --- PASS: TestDomainSnapshot (0.00s) === RUN TestDomain --- PASS: TestDomain (0.01s) === RUN TestNetwork --- PASS: TestNetwork (0.00s) === RUN TestNodeDevice --- PASS: TestNodeDevice (0.00s) === RUN TestSecret --- PASS: TestSecret (0.00s) === RUN TestStoragePool --- PASS: TestStoragePool (0.00s) === RUN TestStorageVolume --- PASS: TestStorageVolume (0.00s) === RUN TestRoundTrip --- FAIL: TestRoundTrip (5.32s) xml_test.go:374: testdata/libvirt/tests/genericxml2xmlindata/network-interface-mac-check.xml: /domain[0]/devices[0]/interface[1]/mac[0]/@check: attribute 'yes' in expected XML missing in actual XML FAIL exit status 1 FAIL _/builds/libvirt/libvirt-go-xml 5.339s section_end:1595559970:step_script ERROR: Job failed: exit code 1  -- You're receiving this email because of your account on gitlab.com.
1 0
0 0
libvirt | Pipeline #170028119 has failed for master | ec550018
by GitLab 23 Jul '20

23 Jul '20
Your pipeline has failed. Project: libvirt ( https://gitlab.com/libvirt/libvirt ) Branch: master ( https://gitlab.com/libvirt/libvirt/-/commits/master ) Commit: ec550018 ( https://gitlab.com/libvirt/libvirt/-/commit/ec550018104b3b97fc911dcff3b9d69… ) Commit Message: tools: be more paranoid about possibly NULL des... Commit Author: Daniel Berrange ( https://gitlab.com/berrange ) Pipeline #170028119 ( https://gitlab.com/libvirt/libvirt/-/pipelines/170028119 ) triggered by Daniel Berrange ( https://gitlab.com/berrange ) had 1 failed build. Job #653217555 ( https://gitlab.com/libvirt/libvirt/-/jobs/653217555/raw ) Stage: builds Name: x64-freebsd-12-build Trace: $ cirrus-run ci/cirrus/$NAME.yml Build created: https://cirrus-ci.com/build/6133607741784064 ............................................................ ............................................................ ............................................................ ............................................................ ............................................................ ............................................................ ............................................................ ............................................................ ............................................................ ............................................................ ............................................................ ............................................................ ............................................................ ............................................................ ............................................................ ............................................................ ............................................................ ............................................................ ............................................................ ............................................................ ............................................................ ............................................................ ............................................................ ............................................................ ................... Build failed: https://cirrus-ci.com/build/6133607741784064 section_end:1595514746:step_script ERROR: Job failed: exit code 1  -- You're receiving this email because of your account on gitlab.com.
1 0
0 0
libvirt | Pipeline #169996980 has failed for master | a167e95d
by GitLab 23 Jul '20

23 Jul '20
Your pipeline has failed. Project: libvirt ( https://gitlab.com/libvirt/libvirt ) Branch: master ( https://gitlab.com/libvirt/libvirt/-/commits/master ) Commit: a167e95d ( https://gitlab.com/libvirt/libvirt/-/commit/a167e95d178b05a7178d014e16405d3… ) Commit Message: ci: Run 'make distcheck' on FreeBSD The Cirrus... Commit Author: Andrea Bolognani ( https://gitlab.com/abologna ) Pipeline #169996980 ( https://gitlab.com/libvirt/libvirt/-/pipelines/169996980 ) triggered by Andrea Bolognani ( https://gitlab.com/abologna ) had 4 failed builds. Job #653075963 ( https://gitlab.com/libvirt/libvirt/-/jobs/653075963/raw ) Stage: builds Name: mingw64-fedora-rawhide Trace: CC libvirt_driver_la-libvirt-domain.lo CC libvirt_driver_la-libvirt-domain-checkpoint.lo CC libvirt_driver_la-libvirt-domain-snapshot.lo CC libvirt_driver_la-libvirt-host.lo CC libvirt_driver_la-libvirt-interface.lo CC libvirt_driver_la-libvirt-network.lo CC libvirt_driver_la-libvirt-nodedev.lo CC libvirt_driver_la-libvirt-nwfilter.lo CC libvirt_driver_la-libvirt-secret.lo CC libvirt_driver_la-libvirt-storage.lo CC libvirt_driver_la-libvirt-stream.lo CCLD libvirt_driver.la CCLD libvirt.la /usr/lib/gcc/x86_64-w64-mingw32/10.1.1/../../../../x86_64-w64-mingw32/bin/ld: ./.libs/libvirt-net-rpc.a(libvirt_net_rpc_la-virnetsocket.o): in function `memcpy': /usr/x86_64-w64-mingw32/sys-root/mingw/include/string.h:202: undefined reference to `__memcpy_chk' /usr/lib/gcc/x86_64-w64-mingw32/10.1.1/../../../../x86_64-w64-mingw32/bin/ld: ./.libs/libvirt_driver_remote.a(libvirt_driver_remote_la-remote_driver.o): in function `strcpy': /usr/x86_64-w64-mingw32/sys-root/mingw/include/string.h:228: undefined reference to `__memcpy_chk' /usr/lib/gcc/x86_64-w64-mingw32/10.1.1/../../../../x86_64-w64-mingw32/bin/ld: /usr/x86_64-w64-mingw32/sys-root/mingw/include/string.h:228: undefined reference to `__memcpy_chk' /usr/lib/gcc/x86_64-w64-mingw32/10.1.1/../../../../x86_64-w64-mingw32/bin/ld: /usr/x86_64-w64-mingw32/sys-root/mingw/include/string.h:228: undefined reference to `__memcpy_chk' /usr/lib/gcc/x86_64-w64-mingw32/10.1.1/../../../../x86_64-w64-mingw32/bin/ld: /usr/x86_64-w64-mingw32/sys-root/mingw/lib/libmingwex.a(lib64_libmingwex_a-dirent.o):(.text+0x2d6): undefined reference to `__strcpy_chk' collect2: error: ld returned 1 exit status make[3]: *** [Makefile:6899: libvirt.la] Error 1 make[3]: Leaving directory '/builds/libvirt/libvirt/build/src' make[2]: *** [Makefile:6456: all] Error 2 make[2]: Leaving directory '/builds/libvirt/libvirt/build/src' make[1]: *** [Makefile:806: all-recursive] Error 1 make[1]: Leaving directory '/builds/libvirt/libvirt/build' make: *** [Makefile:699: all] Error 2 section_end:1595509962:step_script ERROR: Job failed: exit code 1  Job #653075961 ( https://gitlab.com/libvirt/libvirt/-/jobs/653075961/raw ) Stage: builds Name: mingw32-fedora-rawhide Trace: CC libvirt_driver_la-libvirt-domain.lo CC libvirt_driver_la-libvirt-domain-checkpoint.lo CC libvirt_driver_la-libvirt-domain-snapshot.lo CC libvirt_driver_la-libvirt-host.lo CC libvirt_driver_la-libvirt-interface.lo CC libvirt_driver_la-libvirt-network.lo CC libvirt_driver_la-libvirt-nodedev.lo CC libvirt_driver_la-libvirt-nwfilter.lo CC libvirt_driver_la-libvirt-secret.lo CC libvirt_driver_la-libvirt-storage.lo CC libvirt_driver_la-libvirt-stream.lo CCLD libvirt_driver.la CCLD libvirt.la /usr/lib/gcc/i686-w64-mingw32/10.1.1/../../../../i686-w64-mingw32/bin/ld: ./.libs/libvirt-net-rpc.a(libvirt_net_rpc_la-virnetsocket.o): in function `memcpy': /usr/i686-w64-mingw32/sys-root/mingw/include/string.h:202: undefined reference to `__memcpy_chk' /usr/lib/gcc/i686-w64-mingw32/10.1.1/../../../../i686-w64-mingw32/bin/ld: ./.libs/libvirt_driver_remote.a(libvirt_driver_remote_la-remote_driver.o): in function `strcpy': /usr/i686-w64-mingw32/sys-root/mingw/include/string.h:228: undefined reference to `__memcpy_chk' /usr/lib/gcc/i686-w64-mingw32/10.1.1/../../../../i686-w64-mingw32/bin/ld: /usr/i686-w64-mingw32/sys-root/mingw/include/string.h:228: undefined reference to `__memcpy_chk' /usr/lib/gcc/i686-w64-mingw32/10.1.1/../../../../i686-w64-mingw32/bin/ld: /usr/i686-w64-mingw32/sys-root/mingw/include/string.h:228: undefined reference to `__memcpy_chk' /usr/lib/gcc/i686-w64-mingw32/10.1.1/../../../../i686-w64-mingw32/bin/ld: /usr/i686-w64-mingw32/sys-root/mingw/lib/libmingwex.a(lib32_libmingwex_a-dirent.o):(.text+0x22f): undefined reference to `__strcpy_chk' collect2: error: ld returned 1 exit status make[3]: *** [Makefile:6899: libvirt.la] Error 1 make[3]: Leaving directory '/builds/libvirt/libvirt/build/src' make[2]: *** [Makefile:6456: all] Error 2 make[2]: Leaving directory '/builds/libvirt/libvirt/build/src' make[1]: *** [Makefile:806: all-recursive] Error 1 make[1]: Leaving directory '/builds/libvirt/libvirt/build' make: *** [Makefile:699: all] Error 2 section_end:1595509924:step_script ERROR: Job failed: exit code 1  Job #653075956 ( https://gitlab.com/libvirt/libvirt/-/jobs/653075956/raw ) Stage: builds Name: i686-debian-sid Trace: CC util/libvirt_util_la-virnetdevbridge.lo CC util/libvirt_util_la-virnetdevip.lo In file included from /usr/include/string.h:495, from ../../src/internal.h:28, from ../../src/util/virsocket.h:21, from ../../src/util/virsocketaddr.h:21, from ../../src/util/virnetdevip.h:21, from ../../src/util/virnetdevip.c:21: In function 'memcpy', inlined from 'virNetDevGetifaddrsAddress' at ../../src/util/virnetdevip.c:914:13, inlined from 'virNetDevIPAddrGet' at ../../src/util/virnetdevip.c:962:16: /usr/include/i386-linux-gnu/bits/string_fortified.h:34:10: error: '__builtin_memcpy' offset [16, 27] from the object at 'addr' is out of the bounds of referenced subobject 'inet4' with type 'struct sockaddr_in' at offset 0 [-Werror=array-bounds] 34 | return __builtin___memcpy_chk (__dest, __src, __len, __bos0 (__dest)); | ^~~~~~~~~~~~~~~~~~~~~~~~~~~~~~~~~~~~~~~~~~~~~~~~~~~~~~~~~~~~~~ In file included from ../../src/util/virnetdevip.h:21, from ../../src/util/virnetdevip.c:21: ../../src/util/virnetdevip.c: In function 'virNetDevIPAddrGet': ../../src/util/virsocketaddr.h:29:28: note: subobject 'inet4' declared here 29 | struct sockaddr_in inet4; | ^~~~~ cc1: all warnings being treated as errors make[3]: *** [Makefile:10888: util/libvirt_util_la-virnetdevip.lo] Error 1 make[3]: Leaving directory '/builds/libvirt/libvirt/build/src' make[2]: *** [Makefile:6456: all] Error 2 make[2]: Leaving directory '/builds/libvirt/libvirt/build/src' make[1]: *** [Makefile:806: all-recursive] Error 1 make[1]: Leaving directory '/builds/libvirt/libvirt/build' make: *** [Makefile:699: all] Error 2 section_end:1595509697:step_script ERROR: Job failed: exit code 1  Job #653075954 ( https://gitlab.com/libvirt/libvirt/-/jobs/653075954/raw ) Stage: builds Name: armv7l-debian-sid Trace: CC util/libvirt_util_la-virnetdevbridge.lo CC util/libvirt_util_la-virnetdevip.lo In file included from /usr/include/string.h:495, from ../../src/internal.h:28, from ../../src/util/virsocket.h:21, from ../../src/util/virsocketaddr.h:21, from ../../src/util/virnetdevip.h:21, from ../../src/util/virnetdevip.c:21: In function 'memcpy', inlined from 'virNetDevGetifaddrsAddress' at ../../src/util/virnetdevip.c:914:13, inlined from 'virNetDevIPAddrGet' at ../../src/util/virnetdevip.c:962:16: /usr/include/arm-linux-gnueabihf/bits/string_fortified.h:34:10: error: '__builtin_memcpy' offset [16, 27] from the object at 'addr' is out of the bounds of referenced subobject 'inet4' with type 'struct sockaddr_in' at offset 0 [-Werror=array-bounds] 34 | return __builtin___memcpy_chk (__dest, __src, __len, __bos0 (__dest)); | ^~~~~~~~~~~~~~~~~~~~~~~~~~~~~~~~~~~~~~~~~~~~~~~~~~~~~~~~~~~~~~ In file included from ../../src/util/virnetdevip.h:21, from ../../src/util/virnetdevip.c:21: ../../src/util/virnetdevip.c: In function 'virNetDevIPAddrGet': ../../src/util/virsocketaddr.h:29:28: note: subobject 'inet4' declared here 29 | struct sockaddr_in inet4; | ^~~~~ cc1: all warnings being treated as errors make[3]: *** [Makefile:10888: util/libvirt_util_la-virnetdevip.lo] Error 1 make[3]: Leaving directory '/builds/libvirt/libvirt/build/src' make[2]: *** [Makefile:6456: all] Error 2 make[2]: Leaving directory '/builds/libvirt/libvirt/build/src' make[1]: *** [Makefile:806: all-recursive] Error 1 make[1]: Leaving directory '/builds/libvirt/libvirt/build' make: *** [Makefile:699: all] Error 2 section_end:1595509690:step_script ERROR: Job failed: exit code 1  -- You're receiving this email because of your account on gitlab.com.
1 0
0 0
  • ← Newer
  • 1
  • ...
  • 594
  • 595
  • 596
  • 597
  • 598
  • 599
  • 600
  • ...
  • 1021
  • Older →

HyperKitty Powered by HyperKitty version 1.3.12.