libvirt List Archives
Sign In Sign Up
Manage this list Sign In Sign Up

Keyboard Shortcuts

Thread View

  • j: Next unread message
  • k: Previous unread message
  • j a: Jump to all threads
  • j l: Jump to MailingList overview

CI

Thread Start a new thread
Download
Threads by month
  • ----- 2026 -----
  • September
  • August
  • July
  • June
  • May
  • April
  • March
  • February
  • January
  • ----- 2025 -----
  • December
  • November
  • October
  • September
  • August
  • July
  • June
  • May
  • April
  • March
  • February
  • January
  • ----- 2024 -----
  • December
  • November
  • October
  • September
  • August
  • July
  • June
  • May
  • April
  • March
  • February
  • January
  • ----- 2023 -----
  • December
  • November
  • October
  • September
  • August
  • July
  • June
  • May
  • April
  • March
  • February
  • January
  • ----- 2022 -----
  • December
  • November
  • October
  • September
  • August
  • July
  • June
  • May
  • April
  • March
  • February
  • January
  • ----- 2021 -----
  • December
  • November
  • October
  • September
  • August
  • July
  • June
  • May
  • April
  • March
  • February
  • January
  • ----- 2020 -----
  • December
  • November
  • October
  • September
  • August
  • July
  • June
  • May
  • April
  • March
  • February
  • January
  • ----- 2019 -----
  • December
  • November
  • October
  • September
  • August
  • July
  • June
  • May
  • April
  • March
  • February
  • January
  • ----- 2018 -----
  • December
  • November
  • October
  • September
  • August
  • July
  • June
  • May
  • April
  • March
  • February
  • January
  • ----- 2017 -----
  • December
  • November
  • October
  • September
  • August
  • July
  • June
  • May
  • April
  • March
  • February
  • January
  • ----- 2016 -----
  • December
  • November
  • October
  • September
  • August
  • July
ci@lists.libvirt.org

  • 2 participants
  • 10209 discussions
[Libvirt-ci] Build failed in Jenkins: libvirt-master-check » libvirt-centos-7 #41
by ci@centos.org 26 Oct '23

26 Oct '23
https://ci.centos.org/job/libvirt-master-check/systems=libvirt-centos-7/41/… [...truncated 508 lines...] CCLD test-random_r CCLD test-rawmemchr CCLD test-read CCLD test-readlink CCLD test-recv CCLD test-regex CCLD test-sched CCLD test-select CCLD test-select-fd CCLD test-select-stdin CCLD test-send CCLD test-setenv CCLD test-setlocale1 CCLD test-setlocale2 CCLD test-setsockopt CCLD test-sigaction CCLD test-signal-h CCLD test-signbit CCLD test-sigpipe CCLD test-sigprocmask CCLD test-sleep CCLD test-snprintf CCLD test-sockets CCLD test-spawn CCLD test-stat CCLD test-stat-time CCLD test-stdalign CCLD test-stdbool CCLD test-stddef CCLD test-stdint CCLD test-stdio CCLD test-stdlib CCLD test-strchrnul CCLD test-strerror CCLD test-strerror_r CCLD test-string CCLD test-strings CCLD test-strnlen CCLD test-symlink CCLD test-sys_ioctl CCLD test-sys_select CCLD test-sys_socket CCLD test-sys_stat CCLD test-sys_time CCLD test-sys_types CCLD test-sys_uio CCLD test-sys_utsname CCLD test-sys_wait CCLD test-termios CCLD test-thread_self CCLD test-thread_create CCLD test-time CCLD test-ttyname_r CCLD test-uname CCLD test-unistd CCLD test-unlockpt CCLD test-unsetenv CCLD test-usleep CCLD test-vasnprintf CCLD test-vasprintf CCLD test-verify CCLD test-vsnprintf CCLD test-wchar CCLD test-wcrtomb CCLD test-wcrtomb-w32 CCLD test-wctype-h CCLD test-write CCLD test-xalloc-die make[4]: Leaving directory `<https://ci.centos.org/job/libvirt-master-check/systems=libvirt-centos-7/ws/…'> make check-TESTS make[4]: Entering directory `<https://ci.centos.org/job/libvirt-master-check/systems=libvirt-centos-7/ws/…'> make[5]: Entering directory `<https://ci.centos.org/job/libvirt-master-check/systems=libvirt-centos-7/ws/…'> make[6]: Entering directory `<https://ci.centos.org/job/libvirt-master-check/systems=libvirt-centos-7/ws/…'> make all-recursive make[7]: Entering directory `<https://ci.centos.org/job/libvirt-master-check/systems=libvirt-centos-7/ws/…'> Making all in . make[8]: Entering directory `<https://ci.centos.org/job/libvirt-master-check/systems=libvirt-centos-7/ws/…'> make[8]: Nothing to be done for `all-am'. make[8]: Leaving directory `<https://ci.centos.org/job/libvirt-master-check/systems=libvirt-centos-7/ws/…'> make[7]: Leaving directory `<https://ci.centos.org/job/libvirt-master-check/systems=libvirt-centos-7/ws/…'> make[6]: Leaving directory `<https://ci.centos.org/job/libvirt-master-check/systems=libvirt-centos-7/ws/…'> ============================================================================ Testsuite summary for libvirt 2.3.0 ============================================================================ # TOTAL: 0 # PASS: 0 # SKIP: 0 # XFAIL: 0 # FAIL: 0 # XPASS: 0 # ERROR: 0 ============================================================================ make[5]: Leaving directory `<https://ci.centos.org/job/libvirt-master-check/systems=libvirt-centos-7/ws/…'> make[4]: Leaving directory `<https://ci.centos.org/job/libvirt-master-check/systems=libvirt-centos-7/ws/…'> make[3]: Leaving directory `<https://ci.centos.org/job/libvirt-master-check/systems=libvirt-centos-7/ws/…'> make[2]: Leaving directory `<https://ci.centos.org/job/libvirt-master-check/systems=libvirt-centos-7/ws/…'> make[1]: Leaving directory `<https://ci.centos.org/job/libvirt-master-check/systems=libvirt-centos-7/ws/…'> Making check in tests make[1]: Entering directory `<https://ci.centos.org/job/libvirt-master-check/systems=libvirt-centos-7/ws/…'> make make[2]: Entering directory `<https://ci.centos.org/job/libvirt-master-check/systems=libvirt-centos-7/ws/…'> make[2]: Nothing to be done for `all'. make[2]: Leaving directory `<https://ci.centos.org/job/libvirt-master-check/systems=libvirt-centos-7/ws/…'> make check-TESTS make[2]: Entering directory `<https://ci.centos.org/job/libvirt-master-check/systems=libvirt-centos-7/ws/…'> make[3]: Entering directory `<https://ci.centos.org/job/libvirt-master-check/systems=libvirt-centos-7/ws/…'> PASS: sockettest PASS: virhostcputest PASS: virbuftest PASS: seclabeltest PASS: commandtest PASS: virhashtest PASS: virconftest PASS: utiltest PASS: viratomictest PASS: shunloadtest PASS: virtimetest PASS: viruritest PASS: virkeyfiletest PASS: viralloctest PASS: virauthconfigtest PASS: virbitmaptest PASS: vircryptotest PASS: vircgrouptest PASS: virpcitest PASS: virendiantest PASS: virfiletest PASS: virfirewalltest PASS: viriscsitest PASS: virkeycodetest PASS: virlockspacetest PASS: virlogtest PASS: virrotatingfiletest PASS: virshtest PASS: virstringtest PASS: sysinfotest PASS: virportallocatortest PASS: virkmodtest PASS: vircapstest PASS: virschematest PASS: domainconftest PASS: domaincapstest PASS: virhostdevtest PASS: vircaps2xmltest PASS: virnetdevtest PASS: virnetmessagetest PASS: virtypedparamtest PASS: virnetsockettest PASS: virnetserverclienttest PASS: virnetdaemontest PASS: fchosttest PASS: virnettlssessiontest PASS: scsihosttest PASS: fdstreamtest PASS: virnettlscontexttest PASS: virdbustest PASS: virsystemdtest PASS: virpolkittest PASS: securityselinuxtest PASS: viridentitytest PASS: virdrivermoduletest PASS: securityselinuxlabeltest FAIL: qemuxml2argvtest PASS: qemuargv2xmltest PASS: domainsnapshotxml2xmltest PASS: qemuxml2xmltest PASS: qemuhelptest PASS: qemumonitortest PASS: qemuhotplugtest PASS: qemuagenttest PASS: qemumonitorjsontest PASS: qemucommandutiltest PASS: qemucaps2xmltest PASS: qemucapabilitiestest PASS: lxcxml2xmltest PASS: lxcconf2xmltest PASS: openvzutilstest PASS: esxutilstest PASS: vboxsnapshotxmltest PASS: vmx2xmltest PASS: jsontest PASS: vmwarevertest PASS: xml2vmxtest PASS: networkxml2xmltest PASS: networkxml2xmlupdatetest PASS: networkxml2conftest PASS: networkxml2firewalltest PASS: nwfilterebiptablestest PASS: nwfilterxml2xmltest PASS: nwfilterxml2firewalltest PASS: storagevolxml2argvtest PASS: virscsitest PASS: nsstest PASS: storagevolxml2xmltest PASS: storagepoolxml2xmltest PASS: nodedevxml2xmltest PASS: interfacexml2xmltest PASS: metadatatest PASS: virstoragetest PASS: secretxml2xmltest PASS: cputest PASS: genericxml2xmltest PASS: virusbtest PASS: virnetdevbandwidthtest PASS: objecteventtest PASS: libvirtd-pool PASS: libvirtd-fail PASS: eventtest PASS: virsh-cpuset PASS: virsh-define-dev-segfault SKIP: virsh-optparse PASS: virsh-int-overflow PASS: virsh-read-bufsiz PASS: virsh-schedinfo PASS: virsh-read-non-seekable PASS: virsh-self-test PASS: virsh-start PASS: virsh-undefine PASS: virsh-vcpupin PASS: virsh-uriprecedence make[4]: Entering directory `<https://ci.centos.org/job/libvirt-master-check/systems=libvirt-centos-7/ws/…'> make[4]: Nothing to be done for `all'. make[4]: Leaving directory `<https://ci.centos.org/job/libvirt-master-check/systems=libvirt-centos-7/ws/…'> ============================================================================ Testsuite summary for libvirt 2.3.0 ============================================================================ # TOTAL: 114 # PASS: 112 # SKIP: 1 # XFAIL: 0 # FAIL: 1 # XPASS: 0 # ERROR: 0 ============================================================================ See tests/test-suite.log Please report to libvir-list(a)redhat.com ============================================================================ make[3]: *** [test-suite.log] Error 1 make[3]: Leaving directory `<https://ci.centos.org/job/libvirt-master-check/systems=libvirt-centos-7/ws/…'> make[2]: *** [check-TESTS] Error 2 make[2]: Leaving directory `<https://ci.centos.org/job/libvirt-master-check/systems=libvirt-centos-7/ws/…'> make[1]: *** [check-am] Error 2 make[1]: Leaving directory `<https://ci.centos.org/job/libvirt-master-check/systems=libvirt-centos-7/ws/…'> make: *** [check-recursive] Error 1 + cat test-suite.log cat: test-suite.log: No such file or directory + true + exit 1 Build step 'Execute shell' marked build as failure
1 3
0 0
[Libvirt-ci] Build failed in Jenkins: libvirt-master-check » libvirt-fedora-23 #41
by ci@centos.org 26 Oct '23

26 Oct '23
https://ci.centos.org/job/libvirt-master-check/systems=libvirt-fedora-23/41… [...truncated 499 lines...] CCLD test-ptsname_r CCLD test-raise CCLD test-rawmemchr CCLD test-random_r CCLD test-read CCLD test-readlink CCLD test-recv CCLD test-regex CCLD test-sched CCLD test-select CCLD test-select-fd CCLD test-select-stdin CCLD test-send CCLD test-setenv CCLD test-setlocale1 CCLD test-setlocale2 CCLD test-setsockopt CCLD test-sigaction CCLD test-signal-h CCLD test-signbit CCLD test-sigpipe CCLD test-sigprocmask CCLD test-sleep CCLD test-snprintf CCLD test-sockets CCLD test-spawn CCLD test-stat CCLD test-stat-time CCLD test-stdalign CCLD test-stdbool CCLD test-stddef CCLD test-stdint CCLD test-stdio CCLD test-stdlib CCLD test-strchrnul CCLD test-strerror CCLD test-strerror_r CCLD test-string CCLD test-strings CCLD test-strnlen CCLD test-symlink CCLD test-sys_ioctl CCLD test-sys_select CCLD test-sys_socket CCLD test-sys_stat CCLD test-sys_time CCLD test-sys_types CCLD test-sys_uio CCLD test-sys_utsname CCLD test-sys_wait CCLD test-termios CCLD test-thread_self CCLD test-thread_create CCLD test-ttyname_r CCLD test-time CCLD test-uname CCLD test-unlockpt CCLD test-unistd CCLD test-unsetenv CCLD test-usleep CCLD test-vasnprintf CCLD test-vasprintf CCLD test-verify CCLD test-vsnprintf CCLD test-wchar CCLD test-wcrtomb CCLD test-wcrtomb-w32 CCLD test-wctype-h CCLD test-write CCLD test-xalloc-die make[4]: Leaving directory '<https://ci.centos.org/job/libvirt-master-check/systems=libvirt-fedora-23/ws…'> make check-TESTS make[4]: Entering directory '<https://ci.centos.org/job/libvirt-master-check/systems=libvirt-fedora-23/ws…'> make[5]: Entering directory '<https://ci.centos.org/job/libvirt-master-check/systems=libvirt-fedora-23/ws…'> ============================================================================ Testsuite summary for libvirt 2.3.0 ============================================================================ # TOTAL: 0 # PASS: 0 # SKIP: 0 # XFAIL: 0 # FAIL: 0 # XPASS: 0 # ERROR: 0 ============================================================================ make[5]: Leaving directory '<https://ci.centos.org/job/libvirt-master-check/systems=libvirt-fedora-23/ws…'> make[4]: Leaving directory '<https://ci.centos.org/job/libvirt-master-check/systems=libvirt-fedora-23/ws…'> make[3]: Leaving directory '<https://ci.centos.org/job/libvirt-master-check/systems=libvirt-fedora-23/ws…'> make[2]: Leaving directory '<https://ci.centos.org/job/libvirt-master-check/systems=libvirt-fedora-23/ws…'> make[1]: Leaving directory '<https://ci.centos.org/job/libvirt-master-check/systems=libvirt-fedora-23/ws…'> Making check in tests make[1]: Entering directory '<https://ci.centos.org/job/libvirt-master-check/systems=libvirt-fedora-23/ws…'> make make[2]: Entering directory '<https://ci.centos.org/job/libvirt-master-check/systems=libvirt-fedora-23/ws…'> make[2]: Nothing to be done for 'all'. make[2]: Leaving directory '<https://ci.centos.org/job/libvirt-master-check/systems=libvirt-fedora-23/ws…'> make check-TESTS make[2]: Entering directory '<https://ci.centos.org/job/libvirt-master-check/systems=libvirt-fedora-23/ws…'> make[3]: Entering directory '<https://ci.centos.org/job/libvirt-master-check/systems=libvirt-fedora-23/ws…'> PASS: sockettest PASS: virhostcputest PASS: virbuftest PASS: seclabeltest PASS: commandtest PASS: virhashtest PASS: virconftest PASS: viratomictest PASS: utiltest PASS: shunloadtest PASS: viruritest PASS: virtimetest PASS: virkeyfiletest PASS: viralloctest PASS: virauthconfigtest PASS: virbitmaptest PASS: vircgrouptest PASS: vircryptotest PASS: virpcitest PASS: virendiantest PASS: virfiletest PASS: virfirewalltest PASS: viriscsitest PASS: virkeycodetest PASS: virlockspacetest PASS: virshtest PASS: virlogtest PASS: virrotatingfiletest PASS: virstringtest PASS: virportallocatortest PASS: sysinfotest PASS: virkmodtest PASS: vircapstest PASS: domainconftest PASS: domaincapstest PASS: virhostdevtest PASS: virschematest PASS: vircaps2xmltest PASS: virnetdevtest PASS: virtypedparamtest PASS: virnetmessagetest PASS: virnetdaemontest PASS: virnetsockettest PASS: virnetserverclienttest PASS: fchosttest PASS: virnettlssessiontest PASS: scsihosttest PASS: virnettlscontexttest PASS: fdstreamtest PASS: virdbustest PASS: virsystemdtest PASS: virpolkittest PASS: securityselinuxtest PASS: viridentitytest PASS: virdrivermoduletest PASS: xml2sexprtest PASS: securityselinuxlabeltest PASS: sexpr2xmltest PASS: xmconfigtest PASS: xencapstest FAIL: qemuxml2argvtest PASS: qemuxml2xmltest PASS: qemuargv2xmltest PASS: qemuhelptest PASS: domainsnapshotxml2xmltest PASS: qemumonitortest PASS: qemumonitorjsontest PASS: qemuhotplugtest PASS: qemuagenttest PASS: qemucapabilitiestest PASS: qemucaps2xmltest PASS: lxcxml2xmltest PASS: qemucommandutiltest PASS: lxcconf2xmltest PASS: openvzutilstest PASS: esxutilstest PASS: xlconfigtest PASS: vboxsnapshotxmltest PASS: vmx2xmltest PASS: vmwarevertest PASS: xml2vmxtest PASS: jsontest PASS: networkxml2xmltest PASS: networkxml2xmlupdatetest PASS: networkxml2conftest PASS: networkxml2firewalltest PASS: storagebackendsheepdogtest PASS: nwfilterxml2xmltest PASS: nwfilterebiptablestest PASS: nwfilterxml2firewalltest PASS: storagevolxml2argvtest PASS: virscsitest PASS: nsstest PASS: storagevolxml2xmltest PASS: storagepoolxml2xmltest PASS: nodedevxml2xmltest PASS: interfacexml2xmltest PASS: metadatatest PASS: virstoragetest PASS: secretxml2xmltest PASS: genericxml2xmltest PASS: cputest PASS: virusbtest PASS: virnetdevbandwidthtest PASS: eventtest PASS: objecteventtest PASS: libvirtd-pool PASS: libvirtd-fail PASS: virsh-cpuset PASS: virsh-define-dev-segfault PASS: virsh-int-overflow SKIP: virsh-optparse PASS: virsh-schedinfo PASS: virsh-read-non-seekable PASS: virsh-read-bufsiz PASS: virsh-self-test PASS: virsh-start PASS: virsh-undefine PASS: virsh-uriprecedence PASS: virsh-vcpupin ============================================================================ Testsuite summary for libvirt 2.3.0 ============================================================================ # TOTAL: 120 # PASS: 118 # SKIP: 1 # XFAIL: 0 # FAIL: 1 # XPASS: 0 # ERROR: 0 ============================================================================ See tests/test-suite.log Please report to libvir-list(a)redhat.com ============================================================================ Makefile:5493: recipe for target 'test-suite.log' failed make[3]: *** [test-suite.log] Error 1 make[3]: Leaving directory '<https://ci.centos.org/job/libvirt-master-check/systems=libvirt-fedora-23/ws…'> Makefile:5599: recipe for target 'check-TESTS' failed make[2]: *** [check-TESTS] Error 2 make[2]: Leaving directory '<https://ci.centos.org/job/libvirt-master-check/systems=libvirt-fedora-23/ws…'> Makefile:6540: recipe for target 'check-am' failed make[1]: *** [check-am] Error 2 make[1]: Leaving directory '<https://ci.centos.org/job/libvirt-master-check/systems=libvirt-fedora-23/ws…'> Makefile:2004: recipe for target 'check-recursive' failed make: *** [check-recursive] Error 1 + cat test-suite.log cat: test-suite.log: No such file or directory + true + exit 1 Build step 'Execute shell' marked build as failure
1 3
0 0
[Libvirt-ci] Build failed in Jenkins: libvirt-master-check » libvirt-fedora-22 #41
by ci@centos.org 26 Oct '23

26 Oct '23
https://ci.centos.org/job/libvirt-master-check/systems=libvirt-fedora-22/41… [...truncated 499 lines...] CCLD test-ptsname_r CCLD test-raise CCLD test-random_r CCLD test-rawmemchr CCLD test-read CCLD test-readlink CCLD test-recv CCLD test-regex CCLD test-sched CCLD test-select CCLD test-select-fd CCLD test-select-stdin CCLD test-send CCLD test-setenv CCLD test-setlocale1 CCLD test-setlocale2 CCLD test-setsockopt CCLD test-sigaction CCLD test-signal-h CCLD test-signbit CCLD test-sigpipe CCLD test-sigprocmask CCLD test-sleep CCLD test-snprintf CCLD test-sockets CCLD test-spawn CCLD test-stat CCLD test-stat-time CCLD test-stdalign CCLD test-stdbool CCLD test-stddef CCLD test-stdint CCLD test-stdio CCLD test-stdlib CCLD test-strchrnul CCLD test-strerror CCLD test-strerror_r CCLD test-string CCLD test-strings CCLD test-strnlen CCLD test-symlink CCLD test-sys_ioctl CCLD test-sys_select CCLD test-sys_socket CCLD test-sys_stat CCLD test-sys_time CCLD test-sys_types CCLD test-sys_uio CCLD test-sys_utsname CCLD test-sys_wait CCLD test-termios CCLD test-thread_self CCLD test-thread_create CCLD test-time CCLD test-ttyname_r CCLD test-uname CCLD test-unistd CCLD test-unlockpt CCLD test-unsetenv CCLD test-vasnprintf CCLD test-usleep CCLD test-vasprintf CCLD test-verify CCLD test-vsnprintf CCLD test-wchar CCLD test-wcrtomb CCLD test-wcrtomb-w32 CCLD test-wctype-h CCLD test-write CCLD test-xalloc-die make[4]: Leaving directory '<https://ci.centos.org/job/libvirt-master-check/systems=libvirt-fedora-22/ws…'> make check-TESTS make[4]: Entering directory '<https://ci.centos.org/job/libvirt-master-check/systems=libvirt-fedora-22/ws…'> make[5]: Entering directory '<https://ci.centos.org/job/libvirt-master-check/systems=libvirt-fedora-22/ws…'> ============================================================================ Testsuite summary for libvirt 2.3.0 ============================================================================ # TOTAL: 0 # PASS: 0 # SKIP: 0 # XFAIL: 0 # FAIL: 0 # XPASS: 0 # ERROR: 0 ============================================================================ make[5]: Leaving directory '<https://ci.centos.org/job/libvirt-master-check/systems=libvirt-fedora-22/ws…'> make[4]: Leaving directory '<https://ci.centos.org/job/libvirt-master-check/systems=libvirt-fedora-22/ws…'> make[3]: Leaving directory '<https://ci.centos.org/job/libvirt-master-check/systems=libvirt-fedora-22/ws…'> make[2]: Leaving directory '<https://ci.centos.org/job/libvirt-master-check/systems=libvirt-fedora-22/ws…'> make[1]: Leaving directory '<https://ci.centos.org/job/libvirt-master-check/systems=libvirt-fedora-22/ws…'> Making check in tests make[1]: Entering directory '<https://ci.centos.org/job/libvirt-master-check/systems=libvirt-fedora-22/ws…'> make make[2]: Entering directory '<https://ci.centos.org/job/libvirt-master-check/systems=libvirt-fedora-22/ws…'> make[2]: Nothing to be done for 'all'. make[2]: Leaving directory '<https://ci.centos.org/job/libvirt-master-check/systems=libvirt-fedora-22/ws…'> make check-TESTS make[2]: Entering directory '<https://ci.centos.org/job/libvirt-master-check/systems=libvirt-fedora-22/ws…'> make[3]: Entering directory '<https://ci.centos.org/job/libvirt-master-check/systems=libvirt-fedora-22/ws…'> PASS: sockettest PASS: virhostcputest PASS: virbuftest PASS: commandtest PASS: seclabeltest PASS: virconftest PASS: virhashtest PASS: viratomictest PASS: shunloadtest PASS: utiltest PASS: virtimetest PASS: viruritest PASS: viralloctest PASS: virkeyfiletest PASS: virauthconfigtest PASS: virbitmaptest PASS: vircgrouptest PASS: vircryptotest PASS: virpcitest PASS: virendiantest PASS: virfirewalltest PASS: virfiletest PASS: virkeycodetest PASS: viriscsitest PASS: virlockspacetest PASS: virlogtest PASS: virshtest PASS: virrotatingfiletest PASS: virstringtest PASS: virportallocatortest PASS: sysinfotest PASS: virkmodtest PASS: vircapstest PASS: domaincapstest PASS: domainconftest PASS: vircaps2xmltest PASS: virhostdevtest PASS: virnetdevtest PASS: virschematest PASS: virtypedparamtest PASS: virnetmessagetest PASS: virnetdaemontest PASS: virnetsockettest PASS: virnetserverclienttest PASS: fchosttest PASS: scsihosttest PASS: virnettlscontexttest PASS: virnettlssessiontest PASS: fdstreamtest PASS: virdbustest PASS: virsystemdtest PASS: virpolkittest PASS: securityselinuxtest PASS: viridentitytest PASS: virdrivermoduletest PASS: securityselinuxlabeltest PASS: xml2sexprtest PASS: sexpr2xmltest PASS: xmconfigtest PASS: xencapstest FAIL: qemuxml2argvtest PASS: qemuxml2xmltest PASS: qemuargv2xmltest PASS: qemuhelptest PASS: domainsnapshotxml2xmltest PASS: qemumonitortest PASS: qemumonitorjsontest PASS: xlconfigtest PASS: qemuhotplugtest PASS: qemuagenttest PASS: qemucapabilitiestest PASS: qemucaps2xmltest PASS: qemucommandutiltest PASS: lxcconf2xmltest PASS: lxcxml2xmltest PASS: openvzutilstest PASS: esxutilstest PASS: vboxsnapshotxmltest PASS: vmx2xmltest PASS: xml2vmxtest PASS: vmwarevertest PASS: jsontest PASS: networkxml2xmltest PASS: networkxml2xmlupdatetest PASS: networkxml2conftest PASS: networkxml2firewalltest PASS: storagebackendsheepdogtest PASS: nwfilterxml2xmltest PASS: nwfilterebiptablestest PASS: nwfilterxml2firewalltest PASS: storagevolxml2argvtest PASS: virscsitest PASS: nsstest PASS: storagevolxml2xmltest PASS: storagepoolxml2xmltest PASS: nodedevxml2xmltest PASS: interfacexml2xmltest PASS: virstoragetest PASS: metadatatest PASS: genericxml2xmltest PASS: cputest PASS: secretxml2xmltest PASS: virusbtest PASS: virnetdevbandwidthtest PASS: eventtest PASS: objecteventtest PASS: libvirtd-pool PASS: virsh-cpuset PASS: libvirtd-fail PASS: virsh-define-dev-segfault SKIP: virsh-optparse PASS: virsh-int-overflow PASS: virsh-schedinfo PASS: virsh-read-bufsiz PASS: virsh-read-non-seekable PASS: virsh-self-test PASS: virsh-start PASS: virsh-undefine PASS: virsh-uriprecedence PASS: virsh-vcpupin ============================================================================ Testsuite summary for libvirt 2.3.0 ============================================================================ # TOTAL: 120 # PASS: 118 # SKIP: 1 # XFAIL: 0 # FAIL: 1 # XPASS: 0 # ERROR: 0 ============================================================================ See tests/test-suite.log Please report to libvir-list(a)redhat.com ============================================================================ Makefile:5492: recipe for target 'test-suite.log' failed make[3]: *** [test-suite.log] Error 1 make[3]: Leaving directory '<https://ci.centos.org/job/libvirt-master-check/systems=libvirt-fedora-22/ws…'> Makefile:5598: recipe for target 'check-TESTS' failed make[2]: *** [check-TESTS] Error 2 make[2]: Leaving directory '<https://ci.centos.org/job/libvirt-master-check/systems=libvirt-fedora-22/ws…'> Makefile:6539: recipe for target 'check-am' failed make[1]: *** [check-am] Error 2 make[1]: Leaving directory '<https://ci.centos.org/job/libvirt-master-check/systems=libvirt-fedora-22/ws…'> Makefile:2003: recipe for target 'check-recursive' failed make: *** [check-recursive] Error 1 + cat test-suite.log cat: test-suite.log: No such file or directory + true + exit 1 Build step 'Execute shell' marked build as failure
1 3
0 0
[Libvirt-ci] Build failed in Jenkins: libvirt-master-check » libvirt-centos-6 #41
by ci@centos.org 26 Oct '23

26 Oct '23
https://ci.centos.org/job/libvirt-master-check/systems=libvirt-centos-6/41/… [...truncated 788 lines...] .... 4 OK PASS: fdstreamtest TEST: virdbustest .......... 10 OK PASS: virdbustest TEST: virsystemdtest ................................ 32 OK PASS: virsystemdtest TEST: virpolkittest ...... 6 OK PASS: virpolkittest TEST: securityselinuxtest ....... 7 OK PASS: securityselinuxtest TEST: viridentitytest ...... 6 OK PASS: viridentitytest TEST: securityselinuxlabeltest .... 4 OK PASS: securityselinuxlabeltest TEST: virdrivermoduletest .......... 10 OK PASS: virdrivermoduletest TEST: qemuxml2argvtest ........................................ 40 ........................................ 80 ........................................ 120 ........................................ 160 ........................................ 200 ........................................ 240 ............!........................... 280 ........................................ 320 ........................................ 360 ........................................ 400 ........................................ 440 ........................................ 480 ........................................ 520 ........................................ 560 ........................................ 600 .................................... 636 FAIL FAIL: qemuxml2argvtest TEST: qemuxml2xmltest ........................................ 40 ........................................ 80 ........................................ 120 ........................................ 160 ........................................ 200 ........................................ 240 ........................................ 280 ........................................ 320 ........................................ 360 ........................................ 400 ........................................ 440 ........................................ 480 ........................................ 520 ........................................ 560 ........................................ 600 ........................................ 640 ........................................ 680 ........................................ 720 ........................................ 760 ........................................ 800 ........................................ 840 ........................................ 880 ........................................ 920 ........................................ 960 ........................................ 1000 .. 1002 OK PASS: qemuxml2xmltest TEST: qemuargv2xmltest ........................................ 40 ........................................ 80 ............. 93 OK PASS: qemuargv2xmltest TEST: qemuhelptest .......... 10 OK PASS: qemuhelptest TEST: domainsnapshotxml2xmltest ................. 17 OK PASS: domainsnapshotxml2xmltest TEST: qemumonitortest ... 3 OK PASS: qemumonitortest TEST: qemumonitorjsontest ........................................ 40 ....................................... 79 OK PASS: qemumonitorjsontest TEST: qemuhotplugtest ....................................... 39 OK PASS: qemuhotplugtest TEST: qemuagenttest ........._ 10 OK PASS: qemuagenttest TEST: qemucapabilitiestest ............................ 28 OK PASS: qemucapabilitiestest TEST: qemucaps2xmltest .. 2 OK PASS: qemucaps2xmltest TEST: qemucommandutiltest ................ 16 OK PASS: qemucommandutiltest TEST: lxcxml2xmltest ........... 11 OK PASS: lxcxml2xmltest TEST: lxcconf2xmltest ............. 13 OK PASS: lxcconf2xmltest TEST: openvzutilstest .. 2 OK PASS: openvzutilstest TEST: esxutilstest .... 4 OK PASS: esxutilstest TEST: vboxsnapshotxmltest ..... 5 OK PASS: vboxsnapshotxmltest TEST: vmx2xmltest ........................................ 40 ...................... 62 OK PASS: vmx2xmltest TEST: xml2vmxtest ........................................ 40 ............... 55 OK PASS: xml2vmxtest TEST: vmwarevertest ... 3 OK PASS: vmwarevertest TEST: jsontest ...................................... 38 OK PASS: jsontest TEST: networkxml2xmltest ................................... 35 OK PASS: networkxml2xmltest TEST: networkxml2xmlupdatetest ........................................ 40 . 41 OK PASS: networkxml2xmlupdatetest TEST: networkxml2conftest .................. 18 OK PASS: networkxml2conftest TEST: networkxml2firewalltest ....... 7 OK PASS: networkxml2firewalltest TEST: nwfilterxml2xmltest ........................................ 40 . 41 OK PASS: nwfilterxml2xmltest TEST: nwfilterebiptablestest ....... 7 OK PASS: nwfilterebiptablestest TEST: nwfilterxml2firewalltest ....................................... 39 OK PASS: nwfilterxml2firewalltest TEST: storagevolxml2argvtest ........................ 24 OK PASS: storagevolxml2argvtest TEST: virstoragetest ........................................ 40 ........................................ 80 ........................................ 120 ........................................ 160 ........................................ 200 ....... 207 OK PASS: virstoragetest TEST: virscsitest .. 2 OK PASS: virscsitest TEST: nsstest ..... 5 OK PASS: nsstest TEST: storagevolxml2xmltest ................. 17 OK PASS: storagevolxml2xmltest TEST: storagepoolxml2xmltest ........................ 24 OK PASS: storagepoolxml2xmltest TEST: nodedevxml2xmltest ......................... 25 OK PASS: nodedevxml2xmltest TEST: interfacexml2xmltest .................... 20 OK PASS: interfacexml2xmltest TEST: cputest ........................................ 40 ........................................ 80 ........................................ 120 ........................................ 160 ........................................ 200 ... 203 OK PASS: cputest TEST: metadatatest ............... 15 OK PASS: metadatatest TEST: secretxml2xmltest ..... 5 OK PASS: secretxml2xmltest TEST: genericxml2xmltest ................ 16 OK PASS: genericxml2xmltest TEST: virusbtest ........... 11 OK PASS: virusbtest TEST: virnetdevbandwidthtest ..... 5 OK PASS: virnetdevbandwidthtest TEST: eventtest ............... 15 OK PASS: eventtest TEST: objecteventtest ............ 12 OK PASS: objecteventtest PASS: libvirtd-fail PASS: libvirtd-pool PASS: virsh-cpuset PASS: virsh-define-dev-segfault PASS: virsh-int-overflow ../../tests/virsh-optparse: skipping test: This test is very expensive, so it is disabled by default. To run it anyway, rerun: make check VIR_TEST_EXPENSIVE=1 SKIP: virsh-optparse PASS: virsh-read-bufsiz PASS: virsh-read-non-seekable PASS: virsh-schedinfo TEST: virsh-self-test . 1 OK PASS: virsh-self-test PASS: virsh-start PASS: virsh-undefine TEST: virsh-uriprecedence ........ 8 OK PASS: virsh-uriprecedence PASS: virsh-vcpupin ======================================= 1 of 113 tests failed (1 test was not run) Please report to libvir-list(a)redhat.com ======================================= make[2]: *** [check-TESTS] Error 1 make[2]: Leaving directory `<https://ci.centos.org/job/libvirt-master-check/systems=libvirt-centos-6/ws/…'> make[1]: *** [check-am] Error 2 make[1]: Leaving directory `<https://ci.centos.org/job/libvirt-master-check/systems=libvirt-centos-6/ws/…'> make: *** [check-recursive] Error 1 + cat test-suite.log cat: test-suite.log: No such file or directory + true + exit 1 Build step 'Execute shell' marked build as failure
1 3
0 0
[Libvirt-ci] Build failed in Jenkins: libvirt-master-check » libvirt-fedora-21 #41
by ci@centos.org 26 Oct '23

26 Oct '23
https://ci.centos.org/job/libvirt-master-check/systems=libvirt-fedora-21/41… [...truncated 503 lines...] CCLD test-send CCLD test-setenv CCLD test-setlocale2 CCLD test-setlocale1 CCLD test-setsockopt CCLD test-sigaction CCLD test-signal-h CCLD test-signbit CCLD test-sigpipe CCLD test-sigprocmask CCLD test-sleep CCLD test-snprintf CCLD test-sockets CCLD test-spawn CCLD test-stat CCLD test-stat-time CCLD test-stdalign CCLD test-stdbool CCLD test-stddef CCLD test-stdint CCLD test-stdio CCLD test-stdlib CCLD test-strchrnul CCLD test-strerror CCLD test-strerror_r CCLD test-string CCLD test-strings CCLD test-strnlen CCLD test-symlink CCLD test-sys_ioctl CCLD test-sys_select CCLD test-sys_socket CCLD test-sys_stat CCLD test-sys_time CCLD test-sys_types CCLD test-sys_uio CCLD test-sys_utsname CCLD test-sys_wait CCLD test-termios CCLD test-thread_self CCLD test-thread_create CCLD test-time CCLD test-ttyname_r CCLD test-uname CCLD test-unistd CCLD test-unlockpt CCLD test-unsetenv CCLD test-usleep CCLD test-vasnprintf CCLD test-vasprintf CCLD test-verify CCLD test-vsnprintf CCLD test-wchar CCLD test-wcrtomb CCLD test-wcrtomb-w32 CCLD test-wctype-h CCLD test-write CCLD test-xalloc-die make[4]: Leaving directory '<https://ci.centos.org/job/libvirt-master-check/systems=libvirt-fedora-21/ws…'> make check-TESTS make[4]: Entering directory '<https://ci.centos.org/job/libvirt-master-check/systems=libvirt-fedora-21/ws…'> make[5]: Entering directory '<https://ci.centos.org/job/libvirt-master-check/systems=libvirt-fedora-21/ws…'> make[6]: Entering directory '<https://ci.centos.org/job/libvirt-master-check/systems=libvirt-fedora-21/ws…'> make all-recursive make[7]: Entering directory '<https://ci.centos.org/job/libvirt-master-check/systems=libvirt-fedora-21/ws…'> Making all in . make[8]: Entering directory '<https://ci.centos.org/job/libvirt-master-check/systems=libvirt-fedora-21/ws…'> make[8]: Nothing to be done for 'all-am'. make[8]: Leaving directory '<https://ci.centos.org/job/libvirt-master-check/systems=libvirt-fedora-21/ws…'> make[7]: Leaving directory '<https://ci.centos.org/job/libvirt-master-check/systems=libvirt-fedora-21/ws…'> make[6]: Leaving directory '<https://ci.centos.org/job/libvirt-master-check/systems=libvirt-fedora-21/ws…'> ============================================================================ Testsuite summary for libvirt 2.3.0 ============================================================================ # TOTAL: 0 # PASS: 0 # SKIP: 0 # XFAIL: 0 # FAIL: 0 # XPASS: 0 # ERROR: 0 ============================================================================ make[5]: Leaving directory '<https://ci.centos.org/job/libvirt-master-check/systems=libvirt-fedora-21/ws…'> make[4]: Leaving directory '<https://ci.centos.org/job/libvirt-master-check/systems=libvirt-fedora-21/ws…'> make[3]: Leaving directory '<https://ci.centos.org/job/libvirt-master-check/systems=libvirt-fedora-21/ws…'> make[2]: Leaving directory '<https://ci.centos.org/job/libvirt-master-check/systems=libvirt-fedora-21/ws…'> make[1]: Leaving directory '<https://ci.centos.org/job/libvirt-master-check/systems=libvirt-fedora-21/ws…'> Making check in tests make[1]: Entering directory '<https://ci.centos.org/job/libvirt-master-check/systems=libvirt-fedora-21/ws…'> make make[2]: Entering directory '<https://ci.centos.org/job/libvirt-master-check/systems=libvirt-fedora-21/ws…'> make[2]: Nothing to be done for 'all'. make[2]: Leaving directory '<https://ci.centos.org/job/libvirt-master-check/systems=libvirt-fedora-21/ws…'> make check-TESTS make[2]: Entering directory '<https://ci.centos.org/job/libvirt-master-check/systems=libvirt-fedora-21/ws…'> make[3]: Entering directory '<https://ci.centos.org/job/libvirt-master-check/systems=libvirt-fedora-21/ws…'> PASS: sockettest PASS: virhostcputest PASS: virbuftest PASS: seclabeltest PASS: commandtest PASS: virhashtest PASS: virconftest PASS: viratomictest PASS: shunloadtest PASS: utiltest PASS: virtimetest PASS: viruritest PASS: virkeyfiletest PASS: viralloctest PASS: virauthconfigtest PASS: virbitmaptest PASS: vircryptotest PASS: vircgrouptest PASS: virpcitest PASS: virendiantest PASS: virfiletest PASS: virfirewalltest PASS: viriscsitest PASS: virlockspacetest PASS: virkeycodetest PASS: virshtest PASS: virlogtest PASS: virrotatingfiletest PASS: virstringtest PASS: virportallocatortest PASS: sysinfotest PASS: virkmodtest PASS: vircapstest PASS: domaincapstest PASS: domainconftest PASS: virhostdevtest PASS: vircaps2xmltest PASS: virschematest PASS: virtypedparamtest PASS: virnetdevtest PASS: virnetmessagetest PASS: virnetsockettest PASS: virnetdaemontest PASS: virnetserverclienttest PASS: fchosttest PASS: scsihosttest PASS: virnettlssessiontest PASS: fdstreamtest PASS: virdbustest PASS: virsystemdtest PASS: virpolkittest PASS: securityselinuxtest PASS: virnettlscontexttest PASS: viridentitytest PASS: xml2sexprtest PASS: securityselinuxlabeltest PASS: virdrivermoduletest PASS: xmconfigtest PASS: sexpr2xmltest PASS: xencapstest PASS: xlconfigtest PASS: qemuargv2xmltest FAIL: qemuxml2argvtest PASS: qemuhelptest PASS: qemuxml2xmltest PASS: domainsnapshotxml2xmltest PASS: qemumonitortest PASS: qemumonitorjsontest PASS: qemuhotplugtest PASS: qemuagenttest PASS: qemucaps2xmltest PASS: qemucommandutiltest PASS: qemucapabilitiestest PASS: lxcxml2xmltest PASS: openvzutilstest PASS: lxcconf2xmltest PASS: esxutilstest PASS: vboxsnapshotxmltest PASS: vmx2xmltest PASS: jsontest PASS: xml2vmxtest PASS: vmwarevertest PASS: networkxml2xmltest PASS: networkxml2xmlupdatetest PASS: networkxml2conftest PASS: networkxml2firewalltest PASS: nwfilterxml2xmltest PASS: storagebackendsheepdogtest PASS: nwfilterebiptablestest PASS: nwfilterxml2firewalltest PASS: storagevolxml2argvtest PASS: virscsitest PASS: nsstest PASS: storagevolxml2xmltest PASS: storagepoolxml2xmltest PASS: nodedevxml2xmltest PASS: interfacexml2xmltest PASS: metadatatest PASS: cputest PASS: secretxml2xmltest PASS: virstoragetest PASS: genericxml2xmltest PASS: virusbtest PASS: virnetdevbandwidthtest PASS: objecteventtest PASS: libvirtd-pool PASS: eventtest PASS: libvirtd-fail PASS: virsh-int-overflow PASS: virsh-define-dev-segfault PASS: virsh-cpuset SKIP: virsh-optparse PASS: virsh-schedinfo PASS: virsh-read-non-seekable PASS: virsh-read-bufsiz PASS: virsh-self-test PASS: virsh-start PASS: virsh-undefine PASS: virsh-uriprecedence PASS: virsh-vcpupin make[4]: Entering directory '<https://ci.centos.org/job/libvirt-master-check/systems=libvirt-fedora-21/ws…'> make[4]: Nothing to be done for 'all'. make[4]: Leaving directory '<https://ci.centos.org/job/libvirt-master-check/systems=libvirt-fedora-21/ws…'> ============================================================================ Testsuite summary for libvirt 2.3.0 ============================================================================ # TOTAL: 120 # PASS: 118 # SKIP: 1 # XFAIL: 0 # FAIL: 1 # XPASS: 0 # ERROR: 0 ============================================================================ See tests/test-suite.log Please report to libvir-list(a)redhat.com ============================================================================ Makefile:5482: recipe for target 'test-suite.log' failed make[3]: *** [test-suite.log] Error 1 make[3]: Leaving directory '<https://ci.centos.org/job/libvirt-master-check/systems=libvirt-fedora-21/ws…'> Makefile:5588: recipe for target 'check-TESTS' failed make[2]: *** [check-TESTS] Error 2 make[2]: Leaving directory '<https://ci.centos.org/job/libvirt-master-check/systems=libvirt-fedora-21/ws…'> Makefile:6529: recipe for target 'check-am' failed make[1]: *** [check-am] Error 2 make[1]: Leaving directory '<https://ci.centos.org/job/libvirt-master-check/systems=libvirt-fedora-21/ws…'> Makefile:1994: recipe for target 'check-recursive' failed make: *** [check-recursive] Error 1 + cat test-suite.log cat: test-suite.log: No such file or directory + true + exit 1 Build step 'Execute shell' marked build as failure
1 3
0 0
[Libvirt-ci] Build failed in Jenkins: libvirt-master-rpm » libvirt-fedora-rawhide #40
by ci@centos.org 26 Oct '23

26 Oct '23
See <https://ci.centos.org/job/libvirt-master-rpm/systems=libvirt-fedora-rawhide…> ------------------------------------------ Started by upstream project "libvirt-master-rpm" build number 40 originally caused by: Started by upstream project "libvirt-master-check" build number 40 originally caused by: Started by upstream project "libvirt-master-syntax-check" build number 43 originally caused by: Started by upstream project "libvirt-master-build" build number 51 originally caused by: Started by an SCM change [EnvInject] - Loading node environment variables. Building remotely on libvirt-fedora-rawhide (libvirt) in workspace <https://ci.centos.org/job/libvirt-master-rpm/systems=libvirt-fedora-rawhide…> [libvirt-fedora-rawhide] $ /bin/sh -xe /tmp/hudson9042868223192375257.sh + MAKE=make ++ uname + unamestr=Linux + '[' Linux = FreeBSD ']' + cd build + sed -i -e 's/BuildRequires: libvirt.*devel.*//' libvirt.spec + sed -i -e 's/BuildRequires: pkgconfig(libvirt.*).*//' libvirt.spec + rm -f '*.tar.xz' + make -j3 dist make dist-xz am__post_remove_distdir='@:' make[1]: Entering directory '<https://ci.centos.org/job/libvirt-master-rpm/systems=libvirt-fedora-rawhide…'> GEN NEWS vulnerable_makefile_CVE-2012-3386 2.04 vulnerable_makefile_CVE-2012-3386 if test -d "libvirt-2.3.0"; then find "libvirt-2.3.0" -type d ! -perm -200 -exec chmod u+w {} ';' && rm -rf "libvirt-2.3.0" || { sleep 5 && rm -rf "libvirt-2.3.0"; }; else :; fi test -d "libvirt-2.3.0" || mkdir "libvirt-2.3.0" (cd gnulib/lib && make top_distdir=../../libvirt-2.3.0 distdir=../../libvirt-2.3.0/gnulib/lib \ am__remove_distdir=: am__skip_length_check=: am__skip_mode_fix=: distdir) make[2]: Entering directory '<https://ci.centos.org/job/libvirt-master-rpm/systems=libvirt-fedora-rawhide…'> make[2]: Leaving directory '<https://ci.centos.org/job/libvirt-master-rpm/systems=libvirt-fedora-rawhide…'> (cd include/libvirt && make top_distdir=../../libvirt-2.3.0 distdir=../../libvirt-2.3.0/include/libvirt \ am__remove_distdir=: am__skip_length_check=: am__skip_mode_fix=: distdir) make[2]: Entering directory '<https://ci.centos.org/job/libvirt-master-rpm/systems=libvirt-fedora-rawhide…'> make[2]: Leaving directory '<https://ci.centos.org/job/libvirt-master-rpm/systems=libvirt-fedora-rawhide…'> (cd src && make top_distdir=../libvirt-2.3.0 distdir=../libvirt-2.3.0/src \ am__remove_distdir=: am__skip_length_check=: am__skip_mode_fix=: distdir) make[2]: Entering directory '<https://ci.centos.org/job/libvirt-master-rpm/systems=libvirt-fedora-rawhide…'> cp: error writing '../libvirt-2.3.0/src/conf/snapshot_conf.c': No space left on device Makefile:10737: recipe for target 'distdir' failed make[2]: *** [distdir] Error 1 make[2]: Leaving directory '<https://ci.centos.org/job/libvirt-master-rpm/systems=libvirt-fedora-rawhide…'> Makefile:2104: recipe for target 'distdir' failed make[1]: *** [distdir] Error 1 make[1]: Leaving directory '<https://ci.centos.org/job/libvirt-master-rpm/systems=libvirt-fedora-rawhide…'> Makefile:2205: recipe for target 'dist' failed make: *** [dist] Error 2 Build step 'Execute shell' marked build as failure
1 1
0 0
[Libvirt-ci] Build failed in Jenkins: libvirt-sandbox-master-build » libvirt-fedora-rawhide #41
by ci@centos.org 26 Oct '23

26 Oct '23
See <https://ci.centos.org/job/libvirt-sandbox-master-build/systems=libvirt-fedo…> ------------------------------------------ Started by upstream project "libvirt-sandbox-master-build" build number 41 originally caused by: Started by upstream project "libvirt-glib-master-build" build number 41 originally caused by: Started by upstream project "libvirt-master-build" build number 51 originally caused by: Started by an SCM change [EnvInject] - Loading node environment variables. Building remotely on libvirt-fedora-rawhide (libvirt) in workspace <https://ci.centos.org/job/libvirt-sandbox-master-build/systems=libvirt-fedo…> > git rev-parse --is-inside-work-tree # timeout=10 Fetching changes from the remote Git repository > git config remote.origin.url git://n64.pufty.ci.centos.org/libvirt-sandbox.git # timeout=10 ERROR: Error fetching remote repo 'origin' hudson.plugins.git.GitException: Failed to fetch from git://n64.pufty.ci.centos.org/libvirt-sandbox.git at hudson.plugins.git.GitSCM.fetchFrom(GitSCM.java:810) at hudson.plugins.git.GitSCM.retrieveChanges(GitSCM.java:1066) at hudson.plugins.git.GitSCM.checkout(GitSCM.java:1097) at hudson.scm.SCM.checkout(SCM.java:485) at hudson.model.AbstractProject.checkout(AbstractProject.java:1269) at hudson.model.AbstractBuild$AbstractBuildExecution.defaultCheckout(AbstractBuild.java:607) at jenkins.scm.SCMCheckoutStrategy.checkout(SCMCheckoutStrategy.java:86) at hudson.model.AbstractBuild$AbstractBuildExecution.run(AbstractBuild.java:529) at hudson.model.Run.execute(Run.java:1738) at hudson.matrix.MatrixRun.run(MatrixRun.java:146) at hudson.model.ResourceController.execute(ResourceController.java:98) at hudson.model.Executor.run(Executor.java:410) Caused by: hudson.plugins.git.GitException: Command "git config remote.origin.url git://n64.pufty.ci.centos.org/libvirt-sandbox.git" returned status code 4: stdout: stderr: error: failed to write new configuration file <https://ci.centos.org/job/libvirt-sandbox-master-build/systems=libvirt-fedo…> at org.jenkinsci.plugins.gitclient.CliGitAPIImpl.launchCommandIn(CliGitAPIImpl.java:1719) at org.jenkinsci.plugins.gitclient.CliGitAPIImpl.launchCommandIn(CliGitAPIImpl.java:1695) at org.jenkinsci.plugins.gitclient.CliGitAPIImpl.launchCommandIn(CliGitAPIImpl.java:1691) at org.jenkinsci.plugins.gitclient.CliGitAPIImpl.launchCommand(CliGitAPIImpl.java:1321) at org.jenkinsci.plugins.gitclient.CliGitAPIImpl.launchCommand(CliGitAPIImpl.java:1333) at org.jenkinsci.plugins.gitclient.CliGitAPIImpl.setRemoteUrl(CliGitAPIImpl.java:1035) at hudson.plugins.git.GitAPI.setRemoteUrl(GitAPI.java:160) at sun.reflect.NativeMethodAccessorImpl.invoke0(Native Method) at sun.reflect.NativeMethodAccessorImpl.invoke(NativeMethodAccessorImpl.java:62) at sun.reflect.DelegatingMethodAccessorImpl.invoke(DelegatingMethodAccessorImpl.java:43) at java.lang.reflect.Method.invoke(Method.java:498) at hudson.remoting.RemoteInvocationHandler$RPCRequest.perform(RemoteInvocationHandler.java:320) at hudson.remoting.RemoteInvocationHandler$RPCRequest.call(RemoteInvocationHandler.java:295) at hudson.remoting.RemoteInvocationHandler$RPCRequest.call(RemoteInvocationHandler.java:254) at hudson.remoting.UserRequest.perform(UserRequest.java:121) at hudson.remoting.UserRequest.perform(UserRequest.java:49) at hudson.remoting.Request$2.run(Request.java:324) at hudson.remoting.InterceptingExecutorService$1.call(InterceptingExecutorService.java:68) at java.util.concurrent.FutureTask.run(FutureTask.java:266) at java.util.concurrent.ThreadPoolExecutor.runWorker(ThreadPoolExecutor.java:1142) at java.util.concurrent.ThreadPoolExecutor$Worker.run(ThreadPoolExecutor.java:617) at hudson.remoting.Engine$1$1.run(Engine.java:63) at java.lang.Thread.run(Thread.java:745) at ......remote call to libvirt-fedora-rawhide(Native Method) at hudson.remoting.Channel.attachCallSiteStackTrace(Channel.java:1416) at hudson.remoting.UserResponse.retrieve(UserRequest.java:220) at hudson.remoting.Channel.call(Channel.java:781) at hudson.remoting.RemoteInvocationHandler.invoke(RemoteInvocationHandler.java:250) at com.sun.proxy.$Proxy57.setRemoteUrl(Unknown Source) at org.jenkinsci.plugins.gitclient.RemoteGitImpl.setRemoteUrl(RemoteGitImpl.java:298) at hudson.plugins.git.GitSCM.fetchFrom(GitSCM.java:798) ... 11 more ERROR: null
1 1
0 0
[Libvirt-ci] Build failed in Jenkins: virt-viewer-master-build » libvirt-fedora-rawhide #41
by ci@centos.org 26 Oct '23

26 Oct '23
See <https://ci.centos.org/job/virt-viewer-master-build/systems=libvirt-fedora-r…> ------------------------------------------ Started by upstream project "virt-viewer-master-build" build number 41 originally caused by: Started by upstream project "libvirt-glib-master-build" build number 41 originally caused by: Started by upstream project "libvirt-master-build" build number 51 originally caused by: Started by an SCM change [EnvInject] - Loading node environment variables. Building remotely on libvirt-fedora-rawhide (libvirt) in workspace <https://ci.centos.org/job/virt-viewer-master-build/systems=libvirt-fedora-r…> > git rev-parse --is-inside-work-tree # timeout=10 Fetching changes from the remote Git repository > git config remote.origin.url git://n64.pufty.ci.centos.org/virt-viewer.git # timeout=10 ERROR: Error fetching remote repo 'origin' hudson.plugins.git.GitException: Failed to fetch from git://n64.pufty.ci.centos.org/virt-viewer.git at hudson.plugins.git.GitSCM.fetchFrom(GitSCM.java:810) at hudson.plugins.git.GitSCM.retrieveChanges(GitSCM.java:1066) at hudson.plugins.git.GitSCM.checkout(GitSCM.java:1097) at hudson.scm.SCM.checkout(SCM.java:485) at hudson.model.AbstractProject.checkout(AbstractProject.java:1269) at hudson.model.AbstractBuild$AbstractBuildExecution.defaultCheckout(AbstractBuild.java:607) at jenkins.scm.SCMCheckoutStrategy.checkout(SCMCheckoutStrategy.java:86) at hudson.model.AbstractBuild$AbstractBuildExecution.run(AbstractBuild.java:529) at hudson.model.Run.execute(Run.java:1738) at hudson.matrix.MatrixRun.run(MatrixRun.java:146) at hudson.model.ResourceController.execute(ResourceController.java:98) at hudson.model.Executor.run(Executor.java:410) Caused by: hudson.plugins.git.GitException: Command "git config remote.origin.url git://n64.pufty.ci.centos.org/virt-viewer.git" returned status code 4: stdout: stderr: error: failed to write new configuration file <https://ci.centos.org/job/virt-viewer-master-build/systems=libvirt-fedora-r…> at org.jenkinsci.plugins.gitclient.CliGitAPIImpl.launchCommandIn(CliGitAPIImpl.java:1719) at org.jenkinsci.plugins.gitclient.CliGitAPIImpl.launchCommandIn(CliGitAPIImpl.java:1695) at org.jenkinsci.plugins.gitclient.CliGitAPIImpl.launchCommandIn(CliGitAPIImpl.java:1691) at org.jenkinsci.plugins.gitclient.CliGitAPIImpl.launchCommand(CliGitAPIImpl.java:1321) at org.jenkinsci.plugins.gitclient.CliGitAPIImpl.launchCommand(CliGitAPIImpl.java:1333) at org.jenkinsci.plugins.gitclient.CliGitAPIImpl.setRemoteUrl(CliGitAPIImpl.java:1035) at hudson.plugins.git.GitAPI.setRemoteUrl(GitAPI.java:160) at sun.reflect.NativeMethodAccessorImpl.invoke0(Native Method) at sun.reflect.NativeMethodAccessorImpl.invoke(NativeMethodAccessorImpl.java:62) at sun.reflect.DelegatingMethodAccessorImpl.invoke(DelegatingMethodAccessorImpl.java:43) at java.lang.reflect.Method.invoke(Method.java:498) at hudson.remoting.RemoteInvocationHandler$RPCRequest.perform(RemoteInvocationHandler.java:320) at hudson.remoting.RemoteInvocationHandler$RPCRequest.call(RemoteInvocationHandler.java:295) at hudson.remoting.RemoteInvocationHandler$RPCRequest.call(RemoteInvocationHandler.java:254) at hudson.remoting.UserRequest.perform(UserRequest.java:121) at hudson.remoting.UserRequest.perform(UserRequest.java:49) at hudson.remoting.Request$2.run(Request.java:324) at hudson.remoting.InterceptingExecutorService$1.call(InterceptingExecutorService.java:68) at java.util.concurrent.FutureTask.run(FutureTask.java:266) at java.util.concurrent.ThreadPoolExecutor.runWorker(ThreadPoolExecutor.java:1142) at java.util.concurrent.ThreadPoolExecutor$Worker.run(ThreadPoolExecutor.java:617) at hudson.remoting.Engine$1$1.run(Engine.java:63) at java.lang.Thread.run(Thread.java:745) at ......remote call to libvirt-fedora-rawhide(Native Method) at hudson.remoting.Channel.attachCallSiteStackTrace(Channel.java:1416) at hudson.remoting.UserResponse.retrieve(UserRequest.java:220) at hudson.remoting.Channel.call(Channel.java:781) at hudson.remoting.RemoteInvocationHandler.invoke(RemoteInvocationHandler.java:250) at com.sun.proxy.$Proxy57.setRemoteUrl(Unknown Source) at org.jenkinsci.plugins.gitclient.RemoteGitImpl.setRemoteUrl(RemoteGitImpl.java:298) at hudson.plugins.git.GitSCM.fetchFrom(GitSCM.java:798) ... 11 more ERROR: null
1 1
0 0
[Libvirt-ci] Build failed in Jenkins: libvirt-glib-master-syntax-check » libvirt-fedora-rawhide #40
by ci@centos.org 26 Oct '23

26 Oct '23
See <https://ci.centos.org/job/libvirt-glib-master-syntax-check/systems=libvirt-…> ------------------------------------------ Started by upstream project "libvirt-glib-master-syntax-check" build number 40 originally caused by: Started by upstream project "libvirt-glib-master-build" build number 41 originally caused by: Started by upstream project "libvirt-master-build" build number 51 originally caused by: Started by an SCM change [EnvInject] - Loading node environment variables. Building remotely on libvirt-fedora-rawhide (libvirt) in workspace <https://ci.centos.org/job/libvirt-glib-master-syntax-check/systems=libvirt-…> [libvirt-fedora-rawhide] $ /bin/sh -xe /tmp/hudson323471798103489480.sh + MAKE=make ++ uname + unamestr=Linux + '[' Linux = FreeBSD ']' + cd build + make -j3 syntax-check GFDL_version Wundef_boolean TAB_in_indentation avoid_attribute_unused_in_header date: write error: No space left on device ../maint.mk:148: recipe for target 'sc_TAB_in_indentation.m' failed make: *** [sc_TAB_in_indentation.m] Error 1 make: *** Waiting for unfinished jobs.... date: write error: No space left on device ../maint.mk:148: recipe for target 'sc_GFDL_version.m' failed make: *** [sc_GFDL_version.m] Error 1 date: write error: No space left on device ../maint.mk:148: recipe for target 'sc_avoid_attribute_unused_in_header.m' failed make: *** [sc_avoid_attribute_unused_in_header.m] Error 1 Build step 'Execute shell' marked build as failure
1 1
0 0
[Libvirt-ci] Build failed in Jenkins: libvirt-python-master-rpm » libvirt-fedora-rawhide #38
by ci@centos.org 26 Oct '23

26 Oct '23
See <https://ci.centos.org/job/libvirt-python-master-rpm/systems=libvirt-fedora-…> ------------------------------------------ Started by upstream project "libvirt-python-master-rpm" build number 38 originally caused by: Started by upstream project "libvirt-python-master-check" build number 38 originally caused by: Started by upstream project "libvirt-python-master-build" build number 42 originally caused by: Started by upstream project "libvirt-master-build" build number 51 originally caused by: Started by an SCM change [EnvInject] - Loading node environment variables. Building remotely on libvirt-fedora-rawhide (libvirt) in workspace <https://ci.centos.org/job/libvirt-python-master-rpm/systems=libvirt-fedora-…> [libvirt-fedora-rawhide] $ /bin/sh -xe /tmp/hudson9156155210997695230.sh + sed -i -e 's/BuildRequires: libvirt.*devel.*//' libvirt-python.spec.in + python setup.py rpm running rpm running sdist running check reading manifest template 'MANIFEST.in' warning: no files found matching 'MANIFEST' writing manifest file 'MANIFEST' creating libvirt-python-2.2.0 creating libvirt-python-2.2.0/examples creating libvirt-python-2.2.0/examples/guest-vcpus creating libvirt-python-2.2.0/tests making hard links in libvirt-python-2.2.0... hard linking AUTHORS -> libvirt-python-2.2.0 hard linking COPYING -> libvirt-python-2.2.0 hard linking COPYING.LESSER -> libvirt-python-2.2.0 hard linking ChangeLog -> libvirt-python-2.2.0 hard linking NEWS -> libvirt-python-2.2.0 hard linking README -> libvirt-python-2.2.0 hard linking generator.py -> libvirt-python-2.2.0 hard linking libvirt-lxc-override-api.xml -> libvirt-python-2.2.0 hard linking libvirt-lxc-override.c -> libvirt-python-2.2.0 hard linking libvirt-override-api.xml -> libvirt-python-2.2.0 hard linking libvirt-override-virConnect.py -> libvirt-python-2.2.0 hard linking libvirt-override-virDomain.py -> libvirt-python-2.2.0 hard linking libvirt-override-virDomainSnapshot.py -> libvirt-python-2.2.0 hard linking libvirt-override-virStoragePool.py -> libvirt-python-2.2.0 hard linking libvirt-override-virStream.py -> libvirt-python-2.2.0 hard linking libvirt-override.c -> libvirt-python-2.2.0 hard linking libvirt-override.py -> libvirt-python-2.2.0 hard linking libvirt-python.spec -> libvirt-python-2.2.0 hard linking libvirt-qemu-override-api.xml -> libvirt-python-2.2.0 hard linking libvirt-qemu-override.c -> libvirt-python-2.2.0 hard linking libvirt-utils.c -> libvirt-python-2.2.0 hard linking libvirt-utils.h -> libvirt-python-2.2.0 hard linking sanitytest.py -> libvirt-python-2.2.0 hard linking setup.py -> libvirt-python-2.2.0 hard linking tox.ini -> libvirt-python-2.2.0 hard linking typewrappers.c -> libvirt-python-2.2.0 hard linking typewrappers.h -> libvirt-python-2.2.0 hard linking examples/consolecallback.py -> libvirt-python-2.2.0/examples hard linking examples/dominfo.py -> libvirt-python-2.2.0/examples hard linking examples/domipaddrs.py -> libvirt-python-2.2.0/examples hard linking examples/domrestore.py -> libvirt-python-2.2.0/examples hard linking examples/domsave.py -> libvirt-python-2.2.0/examples hard linking examples/domstart.py -> libvirt-python-2.2.0/examples hard linking examples/esxlist.py -> libvirt-python-2.2.0/examples hard linking examples/event-test.py -> libvirt-python-2.2.0/examples hard linking examples/nodestats.py -> libvirt-python-2.2.0/examples hard linking examples/topology.py -> libvirt-python-2.2.0/examples hard linking examples/guest-vcpus/guest-vcpu-daemon.py -> libvirt-python-2.2.0/examples/guest-vcpus hard linking examples/guest-vcpus/guest-vcpu.py -> libvirt-python-2.2.0/examples/guest-vcpus hard linking tests/test_conn.py -> libvirt-python-2.2.0/tests hard linking tests/test_domain.py -> libvirt-python-2.2.0/tests creating dist Creating tar archive removing 'libvirt-python-2.2.0' (and everything under it) /usr/bin/rpmbuild -ta --clean dist/libvirt-python-2.2.0.tar.gz Executing(%prep): /bin/sh -e /var/tmp/rpm-tmp.i9FG0x + umask 022 + cd /home/jenkins/rpmbuild/BUILD + cd /home/jenkins/rpmbuild/BUILD + rm -rf libvirt-python-2.2.0 + /usr/bin/gzip -dc <https://ci.centos.org/job/libvirt-python-master-rpm/systems=libvirt-fedora-…> + /usr/bin/tar -xof - + STATUS=0 + '[' 0 -ne 0 ']' + cd libvirt-python-2.2.0 + /usr/bin/chmod -Rf a+rX,u+w,g-w,o-w . + find examples -type f -exec chmod 0644 '{}' ';' + exit 0 Executing(%build): /bin/sh -e /var/tmp/rpm-tmp.uervgs + umask 022 + cd /home/jenkins/rpmbuild/BUILD + cd libvirt-python-2.2.0 + CFLAGS='-O2 -g -pipe -Wall -Werror=format-security -Wp,-D_FORTIFY_SOURCE=2 -fexceptions -fstack-protector-strong --param=ssp-buffer-size=4 -grecord-gcc-switches -specs=/usr/lib/rpm/redhat/redhat-hardened-cc1 -m64 -mtune=generic' + /usr/bin/python setup.py build running build /usr/bin/pkg-config --print-errors --atleast-version=0.9.11 libvirt /usr/bin/python generator.py libvirt /home/jenkins/build/libvirt/share/libvirt/api/libvirt-api.xml Found 415 functions in /home/jenkins/build/libvirt/share/libvirt/api/libvirt-api.xml Found 0 functions in libvirt-override-api.xml Generated 343 wrapper functions /usr/bin/python generator.py libvirt-qemu /home/jenkins/build/libvirt/share/libvirt/api/libvirt-qemu-api.xml Found 5 functions in /home/jenkins/build/libvirt/share/libvirt/api/libvirt-qemu-api.xml Found 0 functions in libvirt-qemu-override-api.xml Generated 3 wrapper functions /usr/bin/pkg-config --atleast-version=1.0.2 libvirt /usr/bin/python generator.py libvirt-lxc /home/jenkins/build/libvirt/share/libvirt/api/libvirt-lxc-api.xml Found 4 functions in /home/jenkins/build/libvirt/share/libvirt/api/libvirt-lxc-api.xml Found 0 functions in libvirt-lxc-override-api.xml Generated 2 wrapper functions running build_py creating build/lib.linux-x86_64-2.7 copying build/libvirt.py -> build/lib.linux-x86_64-2.7 copying build/libvirt_qemu.py -> build/lib.linux-x86_64-2.7 copying build/libvirt_lxc.py -> build/lib.linux-x86_64-2.7 running build_ext building 'libvirtmod' extension creating build/temp.linux-x86_64-2.7 creating build/temp.linux-x86_64-2.7/build gcc -pthread -fno-strict-aliasing -O2 -g -pipe -Wall -Werror=format-security -Wp,-D_FORTIFY_SOURCE=2 -fexceptions -fstack-protector-strong --param=ssp-buffer-size=4 -grecord-gcc-switches -specs=/usr/lib/rpm/redhat/redhat-hardened-cc1 -m64 -mtune=generic -D_GNU_SOURCE -fPIC -fwrapv -DNDEBUG -O2 -g -pipe -Wall -Werror=format-security -Wp,-D_FORTIFY_SOURCE=2 -fexceptions -fstack-protector-strong --param=ssp-buffer-size=4 -grecord-gcc-switches -specs=/usr/lib/rpm/redhat/redhat-hardened-cc1 -m64 -mtune=generic -D_GNU_SOURCE -fPIC -fwrapv -O2 -g -pipe -Wall -Werror=format-security -Wp,-D_FORTIFY_SOURCE=2 -fexceptions -fstack-protector-strong --param=ssp-buffer-size=4 -grecord-gcc-switches -specs=/usr/lib/rpm/redhat/redhat-hardened-cc1 -m64 -mtune=generic -fPIC -I. -I/usr/include/python2.7 -c libvirt-override.c -o build/temp.linux-x86_64-2.7/libvirt-override.o gcc -pthread -fno-strict-aliasing -O2 -g -pipe -Wall -Werror=format-security -Wp,-D_FORTIFY_SOURCE=2 -fexceptions -fstack-protector-strong --param=ssp-buffer-size=4 -grecord-gcc-switches -specs=/usr/lib/rpm/redhat/redhat-hardened-cc1 -m64 -mtune=generic -D_GNU_SOURCE -fPIC -fwrapv -DNDEBUG -O2 -g -pipe -Wall -Werror=format-security -Wp,-D_FORTIFY_SOURCE=2 -fexceptions -fstack-protector-strong --param=ssp-buffer-size=4 -grecord-gcc-switches -specs=/usr/lib/rpm/redhat/redhat-hardened-cc1 -m64 -mtune=generic -D_GNU_SOURCE -fPIC -fwrapv -O2 -g -pipe -Wall -Werror=format-security -Wp,-D_FORTIFY_SOURCE=2 -fexceptions -fstack-protector-strong --param=ssp-buffer-size=4 -grecord-gcc-switches -specs=/usr/lib/rpm/redhat/redhat-hardened-cc1 -m64 -mtune=generic -fPIC -I. -I/usr/include/python2.7 -c build/libvirt.c -o build/temp.linux-x86_64-2.7/build/libvirt.o gcc -pthread -fno-strict-aliasing -O2 -g -pipe -Wall -Werror=format-security -Wp,-D_FORTIFY_SOURCE=2 -fexceptions -fstack-protector-strong --param=ssp-buffer-size=4 -grecord-gcc-switches -specs=/usr/lib/rpm/redhat/redhat-hardened-cc1 -m64 -mtune=generic -D_GNU_SOURCE -fPIC -fwrapv -DNDEBUG -O2 -g -pipe -Wall -Werror=format-security -Wp,-D_FORTIFY_SOURCE=2 -fexceptions -fstack-protector-strong --param=ssp-buffer-size=4 -grecord-gcc-switches -specs=/usr/lib/rpm/redhat/redhat-hardened-cc1 -m64 -mtune=generic -D_GNU_SOURCE -fPIC -fwrapv -O2 -g -pipe -Wall -Werror=format-security -Wp,-D_FORTIFY_SOURCE=2 -fexceptions -fstack-protector-strong --param=ssp-buffer-size=4 -grecord-gcc-switches -specs=/usr/lib/rpm/redhat/redhat-hardened-cc1 -m64 -mtune=generic -fPIC -I. -I/usr/include/python2.7 -c typewrappers.c -o build/temp.linux-x86_64-2.7/typewrappers.o gcc -pthread -fno-strict-aliasing -O2 -g -pipe -Wall -Werror=format-security -Wp,-D_FORTIFY_SOURCE=2 -fexceptions -fstack-protector-strong --param=ssp-buffer-size=4 -grecord-gcc-switches -specs=/usr/lib/rpm/redhat/redhat-hardened-cc1 -m64 -mtune=generic -D_GNU_SOURCE -fPIC -fwrapv -DNDEBUG -O2 -g -pipe -Wall -Werror=format-security -Wp,-D_FORTIFY_SOURCE=2 -fexceptions -fstack-protector-strong --param=ssp-buffer-size=4 -grecord-gcc-switches -specs=/usr/lib/rpm/redhat/redhat-hardened-cc1 -m64 -mtune=generic -D_GNU_SOURCE -fPIC -fwrapv -O2 -g -pipe -Wall -Werror=format-security -Wp,-D_FORTIFY_SOURCE=2 -fexceptions -fstack-protector-strong --param=ssp-buffer-size=4 -grecord-gcc-switches -specs=/usr/lib/rpm/redhat/redhat-hardened-cc1 -m64 -mtune=generic -fPIC -I. -I/usr/include/python2.7 -c libvirt-utils.c -o build/temp.linux-x86_64-2.7/libvirt-utils.o gcc -pthread -shared -Wl,-z,relro -specs=/usr/lib/rpm/redhat/redhat-hardened-ld -O2 -g -pipe -Wall -Werror=format-security -Wp,-D_FORTIFY_SOURCE=2 -fexceptions -fstack-protector-strong --param=ssp-buffer-size=4 -grecord-gcc-switches -specs=/usr/lib/rpm/redhat/redhat-hardened-cc1 -m64 -mtune=generic build/temp.linux-x86_64-2.7/libvirt-override.o build/temp.linux-x86_64-2.7/build/libvirt.o build/temp.linux-x86_64-2.7/typewrappers.o build/temp.linux-x86_64-2.7/libvirt-utils.o -L/usr/lib64 -lvirt -lpython2.7 -o build/lib.linux-x86_64-2.7/libvirtmod.so -L/home/jenkins/build/libvirt/lib building 'libvirtmod_qemu' extension gcc -pthread -fno-strict-aliasing -O2 -g -pipe -Wall -Werror=format-security -Wp,-D_FORTIFY_SOURCE=2 -fexceptions -fstack-protector-strong --param=ssp-buffer-size=4 -grecord-gcc-switches -specs=/usr/lib/rpm/redhat/redhat-hardened-cc1 -m64 -mtune=generic -D_GNU_SOURCE -fPIC -fwrapv -DNDEBUG -O2 -g -pipe -Wall -Werror=format-security -Wp,-D_FORTIFY_SOURCE=2 -fexceptions -fstack-protector-strong --param=ssp-buffer-size=4 -grecord-gcc-switches -specs=/usr/lib/rpm/redhat/redhat-hardened-cc1 -m64 -mtune=generic -D_GNU_SOURCE -fPIC -fwrapv -O2 -g -pipe -Wall -Werror=format-security -Wp,-D_FORTIFY_SOURCE=2 -fexceptions -fstack-protector-strong --param=ssp-buffer-size=4 -grecord-gcc-switches -specs=/usr/lib/rpm/redhat/redhat-hardened-cc1 -m64 -mtune=generic -fPIC -I. -I/usr/include/python2.7 -c libvirt-qemu-override.c -o build/temp.linux-x86_64-2.7/libvirt-qemu-override.o gcc -pthread -fno-strict-aliasing -O2 -g -pipe -Wall -Werror=format-security -Wp,-D_FORTIFY_SOURCE=2 -fexceptions -fstack-protector-strong --param=ssp-buffer-size=4 -grecord-gcc-switches -specs=/usr/lib/rpm/redhat/redhat-hardened-cc1 -m64 -mtune=generic -D_GNU_SOURCE -fPIC -fwrapv -DNDEBUG -O2 -g -pipe -Wall -Werror=format-security -Wp,-D_FORTIFY_SOURCE=2 -fexceptions -fstack-protector-strong --param=ssp-buffer-size=4 -grecord-gcc-switches -specs=/usr/lib/rpm/redhat/redhat-hardened-cc1 -m64 -mtune=generic -D_GNU_SOURCE -fPIC -fwrapv -O2 -g -pipe -Wall -Werror=format-security -Wp,-D_FORTIFY_SOURCE=2 -fexceptions -fstack-protector-strong --param=ssp-buffer-size=4 -grecord-gcc-switches -specs=/usr/lib/rpm/redhat/redhat-hardened-cc1 -m64 -mtune=generic -fPIC -I. -I/usr/include/python2.7 -c build/libvirt-qemu.c -o build/temp.linux-x86_64-2.7/build/libvirt-qemu.o gcc -pthread -fno-strict-aliasing -O2 -g -pipe -Wall -Werror=format-security -Wp,-D_FORTIFY_SOURCE=2 -fexceptions -fstack-protector-strong --param=ssp-buffer-size=4 -grecord-gcc-switches -specs=/usr/lib/rpm/redhat/redhat-hardened-cc1 -m64 -mtune=generic -D_GNU_SOURCE -fPIC -fwrapv -DNDEBUG -O2 -g -pipe -Wall -Werror=format-security -Wp,-D_FORTIFY_SOURCE=2 -fexceptions -fstack-protector-strong --param=ssp-buffer-size=4 -grecord-gcc-switches -specs=/usr/lib/rpm/redhat/redhat-hardened-cc1 -m64 -mtune=generic -D_GNU_SOURCE -fPIC -fwrapv -O2 -g -pipe -Wall -Werror=format-security -Wp,-D_FORTIFY_SOURCE=2 -fexceptions -fstack-protector-strong --param=ssp-buffer-size=4 -grecord-gcc-switches -specs=/usr/lib/rpm/redhat/redhat-hardened-cc1 -m64 -mtune=generic -fPIC -I. -I/usr/include/python2.7 -c typewrappers.c -o build/temp.linux-x86_64-2.7/typewrappers.o gcc -pthread -fno-strict-aliasing -O2 -g -pipe -Wall -Werror=format-security -Wp,-D_FORTIFY_SOURCE=2 -fexceptions -fstack-protector-strong --param=ssp-buffer-size=4 -grecord-gcc-switches -specs=/usr/lib/rpm/redhat/redhat-hardened-cc1 -m64 -mtune=generic -D_GNU_SOURCE -fPIC -fwrapv -DNDEBUG -O2 -g -pipe -Wall -Werror=format-security -Wp,-D_FORTIFY_SOURCE=2 -fexceptions -fstack-protector-strong --param=ssp-buffer-size=4 -grecord-gcc-switches -specs=/usr/lib/rpm/redhat/redhat-hardened-cc1 -m64 -mtune=generic -D_GNU_SOURCE -fPIC -fwrapv -O2 -g -pipe -Wall -Werror=format-security -Wp,-D_FORTIFY_SOURCE=2 -fexceptions -fstack-protector-strong --param=ssp-buffer-size=4 -grecord-gcc-switches -specs=/usr/lib/rpm/redhat/redhat-hardened-cc1 -m64 -mtune=generic -fPIC -I. -I/usr/include/python2.7 -c libvirt-utils.c -o build/temp.linux-x86_64-2.7/libvirt-utils.o gcc -pthread -shared -Wl,-z,relro -specs=/usr/lib/rpm/redhat/redhat-hardened-ld -O2 -g -pipe -Wall -Werror=format-security -Wp,-D_FORTIFY_SOURCE=2 -fexceptions -fstack-protector-strong --param=ssp-buffer-size=4 -grecord-gcc-switches -specs=/usr/lib/rpm/redhat/redhat-hardened-cc1 -m64 -mtune=generic build/temp.linux-x86_64-2.7/libvirt-qemu-override.o build/temp.linux-x86_64-2.7/build/libvirt-qemu.o build/temp.linux-x86_64-2.7/typewrappers.o build/temp.linux-x86_64-2.7/libvirt-utils.o -L/usr/lib64 -lvirt-qemu -lpython2.7 -o build/lib.linux-x86_64-2.7/libvirtmod_qemu.so -L/home/jenkins/build/libvirt/lib building 'libvirtmod_lxc' extension gcc -pthread -fno-strict-aliasing -O2 -g -pipe -Wall -Werror=format-security -Wp,-D_FORTIFY_SOURCE=2 -fexceptions -fstack-protector-strong --param=ssp-buffer-size=4 -grecord-gcc-switches -specs=/usr/lib/rpm/redhat/redhat-hardened-cc1 -m64 -mtune=generic -D_GNU_SOURCE -fPIC -fwrapv -DNDEBUG -O2 -g -pipe -Wall -Werror=format-security -Wp,-D_FORTIFY_SOURCE=2 -fexceptions -fstack-protector-strong --param=ssp-buffer-size=4 -grecord-gcc-switches -specs=/usr/lib/rpm/redhat/redhat-hardened-cc1 -m64 -mtune=generic -D_GNU_SOURCE -fPIC -fwrapv -O2 -g -pipe -Wall -Werror=format-security -Wp,-D_FORTIFY_SOURCE=2 -fexceptions -fstack-protector-strong --param=ssp-buffer-size=4 -grecord-gcc-switches -specs=/usr/lib/rpm/redhat/redhat-hardened-cc1 -m64 -mtune=generic -fPIC -I. -I/usr/include/python2.7 -c libvirt-lxc-override.c -o build/temp.linux-x86_64-2.7/libvirt-lxc-override.o gcc -pthread -fno-strict-aliasing -O2 -g -pipe -Wall -Werror=format-security -Wp,-D_FORTIFY_SOURCE=2 -fexceptions -fstack-protector-strong --param=ssp-buffer-size=4 -grecord-gcc-switches -specs=/usr/lib/rpm/redhat/redhat-hardened-cc1 -m64 -mtune=generic -D_GNU_SOURCE -fPIC -fwrapv -DNDEBUG -O2 -g -pipe -Wall -Werror=format-security -Wp,-D_FORTIFY_SOURCE=2 -fexceptions -fstack-protector-strong --param=ssp-buffer-size=4 -grecord-gcc-switches -specs=/usr/lib/rpm/redhat/redhat-hardened-cc1 -m64 -mtune=generic -D_GNU_SOURCE -fPIC -fwrapv -O2 -g -pipe -Wall -Werror=format-security -Wp,-D_FORTIFY_SOURCE=2 -fexceptions -fstack-protector-strong --param=ssp-buffer-size=4 -grecord-gcc-switches -specs=/usr/lib/rpm/redhat/redhat-hardened-cc1 -m64 -mtune=generic -fPIC -I. -I/usr/include/python2.7 -c build/libvirt-lxc.c -o build/temp.linux-x86_64-2.7/build/libvirt-lxc.o gcc -pthread -fno-strict-aliasing -O2 -g -pipe -Wall -Werror=format-security -Wp,-D_FORTIFY_SOURCE=2 -fexceptions -fstack-protector-strong --param=ssp-buffer-size=4 -grecord-gcc-switches -specs=/usr/lib/rpm/redhat/redhat-hardened-cc1 -m64 -mtune=generic -D_GNU_SOURCE -fPIC -fwrapv -DNDEBUG -O2 -g -pipe -Wall -Werror=format-security -Wp,-D_FORTIFY_SOURCE=2 -fexceptions -fstack-protector-strong --param=ssp-buffer-size=4 -grecord-gcc-switches -specs=/usr/lib/rpm/redhat/redhat-hardened-cc1 -m64 -mtune=generic -D_GNU_SOURCE -fPIC -fwrapv -O2 -g -pipe -Wall -Werror=format-security -Wp,-D_FORTIFY_SOURCE=2 -fexceptions -fstack-protector-strong --param=ssp-buffer-size=4 -grecord-gcc-switches -specs=/usr/lib/rpm/redhat/redhat-hardened-cc1 -m64 -mtune=generic -fPIC -I. -I/usr/include/python2.7 -c typewrappers.c -o build/temp.linux-x86_64-2.7/typewrappers.o gcc -pthread -fno-strict-aliasing -O2 -g -pipe -Wall -Werror=format-security -Wp,-D_FORTIFY_SOURCE=2 -fexceptions -fstack-protector-strong --param=ssp-buffer-size=4 -grecord-gcc-switches -specs=/usr/lib/rpm/redhat/redhat-hardened-cc1 -m64 -mtune=generic -D_GNU_SOURCE -fPIC -fwrapv -DNDEBUG -O2 -g -pipe -Wall -Werror=format-security -Wp,-D_FORTIFY_SOURCE=2 -fexceptions -fstack-protector-strong --param=ssp-buffer-size=4 -grecord-gcc-switches -specs=/usr/lib/rpm/redhat/redhat-hardened-cc1 -m64 -mtune=generic -D_GNU_SOURCE -fPIC -fwrapv -O2 -g -pipe -Wall -Werror=format-security -Wp,-D_FORTIFY_SOURCE=2 -fexceptions -fstack-protector-strong --param=ssp-buffer-size=4 -grecord-gcc-switches -specs=/usr/lib/rpm/redhat/redhat-hardened-cc1 -m64 -mtune=generic -fPIC -I. -I/usr/include/python2.7 -c libvirt-utils.c -o build/temp.linux-x86_64-2.7/libvirt-utils.o gcc -pthread -shared -Wl,-z,relro -specs=/usr/lib/rpm/redhat/redhat-hardened-ld -O2 -g -pipe -Wall -Werror=format-security -Wp,-D_FORTIFY_SOURCE=2 -fexceptions -fstack-protector-strong --param=ssp-buffer-size=4 -grecord-gcc-switches -specs=/usr/lib/rpm/redhat/redhat-hardened-cc1 -m64 -mtune=generic build/temp.linux-x86_64-2.7/libvirt-lxc-override.o build/temp.linux-x86_64-2.7/build/libvirt-lxc.o build/temp.linux-x86_64-2.7/typewrappers.o build/temp.linux-x86_64-2.7/libvirt-utils.o -L/usr/lib64 -lvirt-lxc -lpython2.7 -o build/lib.linux-x86_64-2.7/libvirtmod_lxc.so -L/home/jenkins/build/libvirt/lib + CFLAGS='-O2 -g -pipe -Wall -Werror=format-security -Wp,-D_FORTIFY_SOURCE=2 -fexceptions -fstack-protector-strong --param=ssp-buffer-size=4 -grecord-gcc-switches -specs=/usr/lib/rpm/redhat/redhat-hardened-cc1 -m64 -mtune=generic' + /usr/bin/python3 setup.py build running build /usr/bin/pkg-config --print-errors --atleast-version=0.9.11 libvirt /usr/bin/python3 generator.py libvirt /home/jenkins/build/libvirt/share/libvirt/api/libvirt-api.xml Found 415 functions in /home/jenkins/build/libvirt/share/libvirt/api/libvirt-api.xml Found 0 functions in libvirt-override-api.xml Generated 343 wrapper functions /usr/bin/python3 generator.py libvirt-qemu /home/jenkins/build/libvirt/share/libvirt/api/libvirt-qemu-api.xml Found 5 functions in /home/jenkins/build/libvirt/share/libvirt/api/libvirt-qemu-api.xml Found 0 functions in libvirt-qemu-override-api.xml Generated 3 wrapper functions /usr/bin/pkg-config --atleast-version=1.0.2 libvirt /usr/bin/python3 generator.py libvirt-lxc /home/jenkins/build/libvirt/share/libvirt/api/libvirt-lxc-api.xml Found 4 functions in /home/jenkins/build/libvirt/share/libvirt/api/libvirt-lxc-api.xml Found 0 functions in libvirt-lxc-override-api.xml Generated 2 wrapper functions running build_py creating build/lib.linux-x86_64-3.5 copying build/libvirt.py -> build/lib.linux-x86_64-3.5 copying build/libvirt_qemu.py -> build/lib.linux-x86_64-3.5 copying build/libvirt_lxc.py -> build/lib.linux-x86_64-3.5 running build_ext building 'libvirtmod' extension creating build/temp.linux-x86_64-3.5 creating build/temp.linux-x86_64-3.5/build gcc -pthread -DDYNAMIC_ANNOTATIONS_ENABLED=1 -DNDEBUG -O2 -g -pipe -Wall -Werror=format-security -Wp,-D_FORTIFY_SOURCE=2 -fexceptions -fstack-protector-strong --param=ssp-buffer-size=4 -grecord-gcc-switches -specs=/usr/lib/rpm/redhat/redhat-hardened-cc1 -m64 -mtune=generic -D_GNU_SOURCE -fPIC -fwrapv -O2 -g -pipe -Wall -Werror=format-security -Wp,-D_FORTIFY_SOURCE=2 -fexceptions -fstack-protector-strong --param=ssp-buffer-size=4 -grecord-gcc-switches -specs=/usr/lib/rpm/redhat/redhat-hardened-cc1 -m64 -mtune=generic -fPIC -I. -I/usr/include/python3.5m -c libvirt-override.c -o build/temp.linux-x86_64-3.5/libvirt-override.o gcc -pthread -DDYNAMIC_ANNOTATIONS_ENABLED=1 -DNDEBUG -O2 -g -pipe -Wall -Werror=format-security -Wp,-D_FORTIFY_SOURCE=2 -fexceptions -fstack-protector-strong --param=ssp-buffer-size=4 -grecord-gcc-switches -specs=/usr/lib/rpm/redhat/redhat-hardened-cc1 -m64 -mtune=generic -D_GNU_SOURCE -fPIC -fwrapv -O2 -g -pipe -Wall -Werror=format-security -Wp,-D_FORTIFY_SOURCE=2 -fexceptions -fstack-protector-strong --param=ssp-buffer-size=4 -grecord-gcc-switches -specs=/usr/lib/rpm/redhat/redhat-hardened-cc1 -m64 -mtune=generic -fPIC -I. -I/usr/include/python3.5m -c build/libvirt.c -o build/temp.linux-x86_64-3.5/build/libvirt.o gcc -pthread -DDYNAMIC_ANNOTATIONS_ENABLED=1 -DNDEBUG -O2 -g -pipe -Wall -Werror=format-security -Wp,-D_FORTIFY_SOURCE=2 -fexceptions -fstack-protector-strong --param=ssp-buffer-size=4 -grecord-gcc-switches -specs=/usr/lib/rpm/redhat/redhat-hardened-cc1 -m64 -mtune=generic -D_GNU_SOURCE -fPIC -fwrapv -O2 -g -pipe -Wall -Werror=format-security -Wp,-D_FORTIFY_SOURCE=2 -fexceptions -fstack-protector-strong --param=ssp-buffer-size=4 -grecord-gcc-switches -specs=/usr/lib/rpm/redhat/redhat-hardened-cc1 -m64 -mtune=generic -fPIC -I. -I/usr/include/python3.5m -c typewrappers.c -o build/temp.linux-x86_64-3.5/typewrappers.o gcc -pthread -DDYNAMIC_ANNOTATIONS_ENABLED=1 -DNDEBUG -O2 -g -pipe -Wall -Werror=format-security -Wp,-D_FORTIFY_SOURCE=2 -fexceptions -fstack-protector-strong --param=ssp-buffer-size=4 -grecord-gcc-switches -specs=/usr/lib/rpm/redhat/redhat-hardened-cc1 -m64 -mtune=generic -D_GNU_SOURCE -fPIC -fwrapv -O2 -g -pipe -Wall -Werror=format-security -Wp,-D_FORTIFY_SOURCE=2 -fexceptions -fstack-protector-strong --param=ssp-buffer-size=4 -grecord-gcc-switches -specs=/usr/lib/rpm/redhat/redhat-hardened-cc1 -m64 -mtune=generic -fPIC -I. -I/usr/include/python3.5m -c libvirt-utils.c -o build/temp.linux-x86_64-3.5/libvirt-utils.o gcc -pthread -shared -Wl,-z,relro -specs=/usr/lib/rpm/redhat/redhat-hardened-ld -O2 -g -pipe -Wall -Werror=format-security -Wp,-D_FORTIFY_SOURCE=2 -fexceptions -fstack-protector-strong --param=ssp-buffer-size=4 -grecord-gcc-switches -specs=/usr/lib/rpm/redhat/redhat-hardened-cc1 -m64 -mtune=generic build/temp.linux-x86_64-3.5/libvirt-override.o build/temp.linux-x86_64-3.5/build/libvirt.o build/temp.linux-x86_64-3.5/typewrappers.o build/temp.linux-x86_64-3.5/libvirt-utils.o -L/usr/lib64 -lvirt -lpython3.5m -o build/lib.linux-x86_64-3.5/libvirtmod.cpython-35m-x86_64-linux-gnu.so -L/home/jenkins/build/libvirt/lib building 'libvirtmod_qemu' extension gcc -pthread -DDYNAMIC_ANNOTATIONS_ENABLED=1 -DNDEBUG -O2 -g -pipe -Wall -Werror=format-security -Wp,-D_FORTIFY_SOURCE=2 -fexceptions -fstack-protector-strong --param=ssp-buffer-size=4 -grecord-gcc-switches -specs=/usr/lib/rpm/redhat/redhat-hardened-cc1 -m64 -mtune=generic -D_GNU_SOURCE -fPIC -fwrapv -O2 -g -pipe -Wall -Werror=format-security -Wp,-D_FORTIFY_SOURCE=2 -fexceptions -fstack-protector-strong --param=ssp-buffer-size=4 -grecord-gcc-switches -specs=/usr/lib/rpm/redhat/redhat-hardened-cc1 -m64 -mtune=generic -fPIC -I. -I/usr/include/python3.5m -c libvirt-qemu-override.c -o build/temp.linux-x86_64-3.5/libvirt-qemu-override.o gcc -pthread -DDYNAMIC_ANNOTATIONS_ENABLED=1 -DNDEBUG -O2 -g -pipe -Wall -Werror=format-security -Wp,-D_FORTIFY_SOURCE=2 -fexceptions -fstack-protector-strong --param=ssp-buffer-size=4 -grecord-gcc-switches -specs=/usr/lib/rpm/redhat/redhat-hardened-cc1 -m64 -mtune=generic -D_GNU_SOURCE -fPIC -fwrapv -O2 -g -pipe -Wall -Werror=format-security -Wp,-D_FORTIFY_SOURCE=2 -fexceptions -fstack-protector-strong --param=ssp-buffer-size=4 -grecord-gcc-switches -specs=/usr/lib/rpm/redhat/redhat-hardened-cc1 -m64 -mtune=generic -fPIC -I. -I/usr/include/python3.5m -c build/libvirt-qemu.c -o build/temp.linux-x86_64-3.5/build/libvirt-qemu.o gcc -pthread -DDYNAMIC_ANNOTATIONS_ENABLED=1 -DNDEBUG -O2 -g -pipe -Wall -Werror=format-security -Wp,-D_FORTIFY_SOURCE=2 -fexceptions -fstack-protector-strong --param=ssp-buffer-size=4 -grecord-gcc-switches -specs=/usr/lib/rpm/redhat/redhat-hardened-cc1 -m64 -mtune=generic -D_GNU_SOURCE -fPIC -fwrapv -O2 -g -pipe -Wall -Werror=format-security -Wp,-D_FORTIFY_SOURCE=2 -fexceptions -fstack-protector-strong --param=ssp-buffer-size=4 -grecord-gcc-switches -specs=/usr/lib/rpm/redhat/redhat-hardened-cc1 -m64 -mtune=generic -fPIC -I. -I/usr/include/python3.5m -c typewrappers.c -o build/temp.linux-x86_64-3.5/typewrappers.o gcc -pthread -DDYNAMIC_ANNOTATIONS_ENABLED=1 -DNDEBUG -O2 -g -pipe -Wall -Werror=format-security -Wp,-D_FORTIFY_SOURCE=2 -fexceptions -fstack-protector-strong --param=ssp-buffer-size=4 -grecord-gcc-switches -specs=/usr/lib/rpm/redhat/redhat-hardened-cc1 -m64 -mtune=generic -D_GNU_SOURCE -fPIC -fwrapv -O2 -g -pipe -Wall -Werror=format-security -Wp,-D_FORTIFY_SOURCE=2 -fexceptions -fstack-protector-strong --param=ssp-buffer-size=4 -grecord-gcc-switches -specs=/usr/lib/rpm/redhat/redhat-hardened-cc1 -m64 -mtune=generic -fPIC -I. -I/usr/include/python3.5m -c libvirt-utils.c -o build/temp.linux-x86_64-3.5/libvirt-utils.o gcc -pthread -shared -Wl,-z,relro -specs=/usr/lib/rpm/redhat/redhat-hardened-ld -O2 -g -pipe -Wall -Werror=format-security -Wp,-D_FORTIFY_SOURCE=2 -fexceptions -fstack-protector-strong --param=ssp-buffer-size=4 -grecord-gcc-switches -specs=/usr/lib/rpm/redhat/redhat-hardened-cc1 -m64 -mtune=generic build/temp.linux-x86_64-3.5/libvirt-qemu-override.o build/temp.linux-x86_64-3.5/build/libvirt-qemu.o build/temp.linux-x86_64-3.5/typewrappers.o build/temp.linux-x86_64-3.5/libvirt-utils.o -L/usr/lib64 -lvirt-qemu -lpython3.5m -o build/lib.linux-x86_64-3.5/libvirtmod_qemu.cpython-35m-x86_64-linux-gnu.so -L/home/jenkins/build/libvirt/lib building 'libvirtmod_lxc' extension gcc -pthread -DDYNAMIC_ANNOTATIONS_ENABLED=1 -DNDEBUG -O2 -g -pipe -Wall -Werror=format-security -Wp,-D_FORTIFY_SOURCE=2 -fexceptions -fstack-protector-strong --param=ssp-buffer-size=4 -grecord-gcc-switches -specs=/usr/lib/rpm/redhat/redhat-hardened-cc1 -m64 -mtune=generic -D_GNU_SOURCE -fPIC -fwrapv -O2 -g -pipe -Wall -Werror=format-security -Wp,-D_FORTIFY_SOURCE=2 -fexceptions -fstack-protector-strong --param=ssp-buffer-size=4 -grecord-gcc-switches -specs=/usr/lib/rpm/redhat/redhat-hardened-cc1 -m64 -mtune=generic -fPIC -I. -I/usr/include/python3.5m -c libvirt-lxc-override.c -o build/temp.linux-x86_64-3.5/libvirt-lxc-override.o gcc -pthread -DDYNAMIC_ANNOTATIONS_ENABLED=1 -DNDEBUG -O2 -g -pipe -Wall -Werror=format-security -Wp,-D_FORTIFY_SOURCE=2 -fexceptions -fstack-protector-strong --param=ssp-buffer-size=4 -grecord-gcc-switches -specs=/usr/lib/rpm/redhat/redhat-hardened-cc1 -m64 -mtune=generic -D_GNU_SOURCE -fPIC -fwrapv -O2 -g -pipe -Wall -Werror=format-security -Wp,-D_FORTIFY_SOURCE=2 -fexceptions -fstack-protector-strong --param=ssp-buffer-size=4 -grecord-gcc-switches -specs=/usr/lib/rpm/redhat/redhat-hardened-cc1 -m64 -mtune=generic -fPIC -I. -I/usr/include/python3.5m -c build/libvirt-lxc.c -o build/temp.linux-x86_64-3.5/build/libvirt-lxc.o gcc -pthread -DDYNAMIC_ANNOTATIONS_ENABLED=1 -DNDEBUG -O2 -g -pipe -Wall -Werror=format-security -Wp,-D_FORTIFY_SOURCE=2 -fexceptions -fstack-protector-strong --param=ssp-buffer-size=4 -grecord-gcc-switches -specs=/usr/lib/rpm/redhat/redhat-hardened-cc1 -m64 -mtune=generic -D_GNU_SOURCE -fPIC -fwrapv -O2 -g -pipe -Wall -Werror=format-security -Wp,-D_FORTIFY_SOURCE=2 -fexceptions -fstack-protector-strong --param=ssp-buffer-size=4 -grecord-gcc-switches -specs=/usr/lib/rpm/redhat/redhat-hardened-cc1 -m64 -mtune=generic -fPIC -I. -I/usr/include/python3.5m -c typewrappers.c -o build/temp.linux-x86_64-3.5/typewrappers.o gcc -pthread -DDYNAMIC_ANNOTATIONS_ENABLED=1 -DNDEBUG -O2 -g -pipe -Wall -Werror=format-security -Wp,-D_FORTIFY_SOURCE=2 -fexceptions -fstack-protector-strong --param=ssp-buffer-size=4 -grecord-gcc-switches -specs=/usr/lib/rpm/redhat/redhat-hardened-cc1 -m64 -mtune=generic -D_GNU_SOURCE -fPIC -fwrapv -O2 -g -pipe -Wall -Werror=format-security -Wp,-D_FORTIFY_SOURCE=2 -fexceptions -fstack-protector-strong --param=ssp-buffer-size=4 -grecord-gcc-switches -specs=/usr/lib/rpm/redhat/redhat-hardened-cc1 -m64 -mtune=generic -fPIC -I. -I/usr/include/python3.5m -c libvirt-utils.c -o build/temp.linux-x86_64-3.5/libvirt-utils.o gcc -pthread -shared -Wl,-z,relro -specs=/usr/lib/rpm/redhat/redhat-hardened-ld -O2 -g -pipe -Wall -Werror=format-security -Wp,-D_FORTIFY_SOURCE=2 -fexceptions -fstack-protector-strong --param=ssp-buffer-size=4 -grecord-gcc-switches -specs=/usr/lib/rpm/redhat/redhat-hardened-cc1 -m64 -mtune=generic build/temp.linux-x86_64-3.5/libvirt-lxc-override.o build/temp.linux-x86_64-3.5/build/libvirt-lxc.o build/temp.linux-x86_64-3.5/typewrappers.o build/temp.linux-x86_64-3.5/libvirt-utils.o -L/usr/lib64 -lvirt-lxc -lpython3.5m -o build/lib.linux-x86_64-3.5/libvirtmod_lxc.cpython-35m-x86_64-linux-gnu.so -L/home/jenkins/build/libvirt/lib + exit 0 Executing(%install): /bin/sh -e /var/tmp/rpm-tmp.sslC64 + umask 022 + cd /home/jenkins/rpmbuild/BUILD + '[' /home/jenkins/rpmbuild/BUILDROOT/libvirt-python-2.2.0-1.fc26.x86_64 '!=' / ']' + rm -rf /home/jenkins/rpmbuild/BUILDROOT/libvirt-python-2.2.0-1.fc26.x86_64 ++ dirname /home/jenkins/rpmbuild/BUILDROOT/libvirt-python-2.2.0-1.fc26.x86_64 + mkdir -p /home/jenkins/rpmbuild/BUILDROOT + mkdir /home/jenkins/rpmbuild/BUILDROOT/libvirt-python-2.2.0-1.fc26.x86_64 + cd libvirt-python-2.2.0 + /usr/bin/python setup.py install --skip-build --root=/home/jenkins/rpmbuild/BUILDROOT/libvirt-python-2.2.0-1.fc26.x86_64 running install running install_lib creating /home/jenkins/rpmbuild/BUILDROOT/libvirt-python-2.2.0-1.fc26.x86_64/usr creating /home/jenkins/rpmbuild/BUILDROOT/libvirt-python-2.2.0-1.fc26.x86_64/usr/lib64 creating /home/jenkins/rpmbuild/BUILDROOT/libvirt-python-2.2.0-1.fc26.x86_64/usr/lib64/python2.7 creating /home/jenkins/rpmbuild/BUILDROOT/libvirt-python-2.2.0-1.fc26.x86_64/usr/lib64/python2.7/site-packages copying build/lib.linux-x86_64-2.7/libvirt_lxc.py -> /home/jenkins/rpmbuild/BUILDROOT/libvirt-python-2.2.0-1.fc26.x86_64/usr/lib64/python2.7/site-packages copying build/lib.linux-x86_64-2.7/libvirtmod_qemu.so -> /home/jenkins/rpmbuild/BUILDROOT/libvirt-python-2.2.0-1.fc26.x86_64/usr/lib64/python2.7/site-packages copying build/lib.linux-x86_64-2.7/libvirtmod_lxc.so -> /home/jenkins/rpmbuild/BUILDROOT/libvirt-python-2.2.0-1.fc26.x86_64/usr/lib64/python2.7/site-packages copying build/lib.linux-x86_64-2.7/libvirt.py -> /home/jenkins/rpmbuild/BUILDROOT/libvirt-python-2.2.0-1.fc26.x86_64/usr/lib64/python2.7/site-packages copying build/lib.linux-x86_64-2.7/libvirtmod.so -> /home/jenkins/rpmbuild/BUILDROOT/libvirt-python-2.2.0-1.fc26.x86_64/usr/lib64/python2.7/site-packages copying build/lib.linux-x86_64-2.7/libvirt_qemu.py -> /home/jenkins/rpmbuild/BUILDROOT/libvirt-python-2.2.0-1.fc26.x86_64/usr/lib64/python2.7/site-packages byte-compiling /home/jenkins/rpmbuild/BUILDROOT/libvirt-python-2.2.0-1.fc26.x86_64/usr/lib64/python2.7/site-packages/libvirt_lxc.py to libvirt_lxc.pyc byte-compiling /home/jenkins/rpmbuild/BUILDROOT/libvirt-python-2.2.0-1.fc26.x86_64/usr/lib64/python2.7/site-packages/libvirt.py to libvirt.pyc byte-compiling /home/jenkins/rpmbuild/BUILDROOT/libvirt-python-2.2.0-1.fc26.x86_64/usr/lib64/python2.7/site-packages/libvirt_qemu.py to libvirt_qemu.pyc running install_egg_info Writing /home/jenkins/rpmbuild/BUILDROOT/libvirt-python-2.2.0-1.fc26.x86_64/usr/lib64/python2.7/site-packages/libvirt_python-2.2.0-py2.7.egg-info + /usr/bin/python3 setup.py install --skip-build --root=/home/jenkins/rpmbuild/BUILDROOT/libvirt-python-2.2.0-1.fc26.x86_64 running install running install_lib creating /home/jenkins/rpmbuild/BUILDROOT/libvirt-python-2.2.0-1.fc26.x86_64/usr/lib64/python3.5 creating /home/jenkins/rpmbuild/BUILDROOT/libvirt-python-2.2.0-1.fc26.x86_64/usr/lib64/python3.5/site-packages copying build/lib.linux-x86_64-3.5/libvirt_lxc.py -> /home/jenkins/rpmbuild/BUILDROOT/libvirt-python-2.2.0-1.fc26.x86_64/usr/lib64/python3.5/site-packages copying build/lib.linux-x86_64-3.5/libvirtmod_qemu.cpython-35m-x86_64-linux-gnu.so -> /home/jenkins/rpmbuild/BUILDROOT/libvirt-python-2.2.0-1.fc26.x86_64/usr/lib64/python3.5/site-packages copying build/lib.linux-x86_64-3.5/libvirt.py -> /home/jenkins/rpmbuild/BUILDROOT/libvirt-python-2.2.0-1.fc26.x86_64/usr/lib64/python3.5/site-packages copying build/lib.linux-x86_64-3.5/libvirtmod.cpython-35m-x86_64-linux-gnu.so -> /home/jenkins/rpmbuild/BUILDROOT/libvirt-python-2.2.0-1.fc26.x86_64/usr/lib64/python3.5/site-packages copying build/lib.linux-x86_64-3.5/libvirtmod_lxc.cpython-35m-x86_64-linux-gnu.so -> /home/jenkins/rpmbuild/BUILDROOT/libvirt-python-2.2.0-1.fc26.x86_64/usr/lib64/python3.5/site-packages copying build/lib.linux-x86_64-3.5/libvirt_qemu.py -> /home/jenkins/rpmbuild/BUILDROOT/libvirt-python-2.2.0-1.fc26.x86_64/usr/lib64/python3.5/site-packages byte-compiling /home/jenkins/rpmbuild/BUILDROOT/libvirt-python-2.2.0-1.fc26.x86_64/usr/lib64/python3.5/site-packages/libvirt_lxc.py to libvirt_lxc.cpython-35.pyc byte-compiling /home/jenkins/rpmbuild/BUILDROOT/libvirt-python-2.2.0-1.fc26.x86_64/usr/lib64/python3.5/site-packages/libvirt.py to libvirt.cpython-35.pyc byte-compiling /home/jenkins/rpmbuild/BUILDROOT/libvirt-python-2.2.0-1.fc26.x86_64/usr/lib64/python3.5/site-packages/libvirt_qemu.py to libvirt_qemu.cpython-35.pyc running install_egg_info Writing /home/jenkins/rpmbuild/BUILDROOT/libvirt-python-2.2.0-1.fc26.x86_64/usr/lib64/python3.5/site-packages/libvirt_python-2.2.0-py3.5.egg-info + rm -f /home/jenkins/rpmbuild/BUILDROOT/libvirt-python-2.2.0-1.fc26.x86_64/usr/lib64/python2.7/site-packages/libvirt_python-2.2.0-py2.7.egg-info /home/jenkins/rpmbuild/BUILDROOT/libvirt-python-2.2.0-1.fc26.x86_64/usr/lib64/python3.5/site-packages/libvirt_python-2.2.0-py3.5.egg-info + /usr/lib/rpm/find-debuginfo.sh --strict-build-id -m --run-dwz --dwz-low-mem-die-limit 10000000 --dwz-max-die-limit 110000000 /home/jenkins/rpmbuild/BUILD/libvirt-python-2.2.0 extracting debug info from /home/jenkins/rpmbuild/BUILDROOT/libvirt-python-2.2.0-1.fc26.x86_64/usr/lib64/python2.7/site-packages/libvirtmod_qemu.so extracting debug info from /home/jenkins/rpmbuild/BUILDROOT/libvirt-python-2.2.0-1.fc26.x86_64/usr/lib64/python2.7/site-packages/libvirtmod_lxc.so extracting debug info from /home/jenkins/rpmbuild/BUILDROOT/libvirt-python-2.2.0-1.fc26.x86_64/usr/lib64/python2.7/site-packages/libvirtmod.so extracting debug info from /home/jenkins/rpmbuild/BUILDROOT/libvirt-python-2.2.0-1.fc26.x86_64/usr/lib64/python3.5/site-packages/libvirtmod_qemu.cpython-35m-x86_64-linux-gnu.so extracting debug info from /home/jenkins/rpmbuild/BUILDROOT/libvirt-python-2.2.0-1.fc26.x86_64/usr/lib64/python3.5/site-packages/libvirtmod.cpython-35m-x86_64-linux-gnu.so extracting debug info from /home/jenkins/rpmbuild/BUILDROOT/libvirt-python-2.2.0-1.fc26.x86_64/usr/lib64/python3.5/site-packages/libvirtmod_lxc.cpython-35m-x86_64-linux-gnu.so /usr/lib/rpm/sepdebugcrcfix: Updated 6 CRC32s, 0 CRC32s did match. 951 blocks + /usr/lib/rpm/check-buildroot + /usr/lib/rpm/brp-compress + /usr/lib/rpm/brp-strip-static-archive /usr/bin/strip + /usr/lib/rpm/brp-python-bytecompile /usr/bin/python 1 Bytecompiling .py files below /home/jenkins/rpmbuild/BUILDROOT/libvirt-python-2.2.0-1.fc26.x86_64/usr/lib64/python2.7 using /usr/bin/python2.7 Bytecompiling .py files below /home/jenkins/rpmbuild/BUILDROOT/libvirt-python-2.2.0-1.fc26.x86_64/usr/lib64/python3.5 using /usr/bin/python3.5 *** Error compiling '/home/jenkins/rpmbuild/BUILDROOT/libvirt-python-2.2.0-1.fc26.x86_64/usr/lib64/python3.5/site-packages/libvirt.py'... OSError: [Errno 28] No space left on device *** Error compiling '/home/jenkins/rpmbuild/BUILDROOT/libvirt-python-2.2.0-1.fc26.x86_64/usr/lib64/python3.5/site-packages/libvirt_lxc.py'... OSError: [Errno 28] No space left on device *** Error compiling '/home/jenkins/rpmbuild/BUILDROOT/libvirt-python-2.2.0-1.fc26.x86_64/usr/lib64/python3.5/site-packages/libvirt_qemu.py'... OSError: [Errno 28] No space left on device error: Bad exit status from /var/tmp/rpm-tmp.sslC64 (%install) RPM build errors: Bad exit status from /var/tmp/rpm-tmp.sslC64 (%install) error: command '/usr/bin/rpmbuild' failed with exit status 1 Build step 'Execute shell' marked build as failure
1 1
0 0
  • ← Newer
  • 1
  • ...
  • 524
  • 525
  • 526
  • 527
  • 528
  • 529
  • 530
  • ...
  • 1021
  • Older →

HyperKitty Powered by HyperKitty version 1.3.12.