libvirt List Archives
Sign In Sign Up
Manage this list Sign In Sign Up

Keyboard Shortcuts

Thread View

  • j: Next unread message
  • k: Previous unread message
  • j a: Jump to all threads
  • j l: Jump to MailingList overview

CI

Thread Start a new thread
Download
Threads by month
  • ----- 2026 -----
  • September
  • August
  • July
  • June
  • May
  • April
  • March
  • February
  • January
  • ----- 2025 -----
  • December
  • November
  • October
  • September
  • August
  • July
  • June
  • May
  • April
  • March
  • February
  • January
  • ----- 2024 -----
  • December
  • November
  • October
  • September
  • August
  • July
  • June
  • May
  • April
  • March
  • February
  • January
  • ----- 2023 -----
  • December
  • November
  • October
  • September
  • August
  • July
  • June
  • May
  • April
  • March
  • February
  • January
  • ----- 2022 -----
  • December
  • November
  • October
  • September
  • August
  • July
  • June
  • May
  • April
  • March
  • February
  • January
  • ----- 2021 -----
  • December
  • November
  • October
  • September
  • August
  • July
  • June
  • May
  • April
  • March
  • February
  • January
  • ----- 2020 -----
  • December
  • November
  • October
  • September
  • August
  • July
  • June
  • May
  • April
  • March
  • February
  • January
  • ----- 2019 -----
  • December
  • November
  • October
  • September
  • August
  • July
  • June
  • May
  • April
  • March
  • February
  • January
  • ----- 2018 -----
  • December
  • November
  • October
  • September
  • August
  • July
  • June
  • May
  • April
  • March
  • February
  • January
  • ----- 2017 -----
  • December
  • November
  • October
  • September
  • August
  • July
  • June
  • May
  • April
  • March
  • February
  • January
  • ----- 2016 -----
  • December
  • November
  • October
  • September
  • August
  • July
ci@lists.libvirt.org

  • 2 participants
  • 10209 discussions
[Libvirt-ci] Build failed in Jenkins: virt-manager-master-build » libvirt-fedora-24 #113
by ci@centos.org 26 Oct '23

26 Oct '23
https://ci.centos.org/job/virt-manager-master-build/systems=libvirt-fedora-… [...truncated 176 lines...] copying ui/fsdetails.ui -> /home/jenkins/build/libvirt/share/virt-manager/ui copying ui/gfxdetails.ui -> /home/jenkins/build/libvirt/share/virt-manager/ui copying ui/host.ui -> /home/jenkins/build/libvirt/share/virt-manager/ui copying ui/manager.ui -> /home/jenkins/build/libvirt/share/virt-manager/ui copying ui/migrate.ui -> /home/jenkins/build/libvirt/share/virt-manager/ui copying ui/netlist.ui -> /home/jenkins/build/libvirt/share/virt-manager/ui copying ui/preferences.ui -> /home/jenkins/build/libvirt/share/virt-manager/ui copying ui/snapshots.ui -> /home/jenkins/build/libvirt/share/virt-manager/ui copying ui/storagebrowse.ui -> /home/jenkins/build/libvirt/share/virt-manager/ui copying ui/storagelist.ui -> /home/jenkins/build/libvirt/share/virt-manager/ui copying man/virt-manager.1 -> /home/jenkins/build/libvirt/share/man/man1 copying man/virt-install.1 -> /home/jenkins/build/libvirt/share/man/man1 copying man/virt-clone.1 -> /home/jenkins/build/libvirt/share/man/man1 copying man/virt-convert.1 -> /home/jenkins/build/libvirt/share/man/man1 copying man/virt-xml.1 -> /home/jenkins/build/libvirt/share/man/man1 creating /home/jenkins/build/libvirt/share/virt-manager/virtManager copying virtManager/__init__.py -> /home/jenkins/build/libvirt/share/virt-manager/virtManager copying virtManager/about.py -> /home/jenkins/build/libvirt/share/virt-manager/virtManager copying virtManager/addhardware.py -> /home/jenkins/build/libvirt/share/virt-manager/virtManager copying virtManager/addstorage.py -> /home/jenkins/build/libvirt/share/virt-manager/virtManager copying virtManager/asyncjob.py -> /home/jenkins/build/libvirt/share/virt-manager/virtManager copying virtManager/baseclass.py -> /home/jenkins/build/libvirt/share/virt-manager/virtManager copying virtManager/choosecd.py -> /home/jenkins/build/libvirt/share/virt-manager/virtManager copying virtManager/clone.py -> /home/jenkins/build/libvirt/share/virt-manager/virtManager copying virtManager/config.py -> /home/jenkins/build/libvirt/share/virt-manager/virtManager copying virtManager/connect.py -> /home/jenkins/build/libvirt/share/virt-manager/virtManager copying virtManager/connectauth.py -> /home/jenkins/build/libvirt/share/virt-manager/virtManager copying virtManager/connection.py -> /home/jenkins/build/libvirt/share/virt-manager/virtManager copying virtManager/console.py -> /home/jenkins/build/libvirt/share/virt-manager/virtManager copying virtManager/create.py -> /home/jenkins/build/libvirt/share/virt-manager/virtManager copying virtManager/createinterface.py -> /home/jenkins/build/libvirt/share/virt-manager/virtManager copying virtManager/createnet.py -> /home/jenkins/build/libvirt/share/virt-manager/virtManager copying virtManager/createpool.py -> /home/jenkins/build/libvirt/share/virt-manager/virtManager copying virtManager/createvol.py -> /home/jenkins/build/libvirt/share/virt-manager/virtManager copying virtManager/delete.py -> /home/jenkins/build/libvirt/share/virt-manager/virtManager copying virtManager/details.py -> /home/jenkins/build/libvirt/share/virt-manager/virtManager copying virtManager/domain.py -> /home/jenkins/build/libvirt/share/virt-manager/virtManager copying virtManager/engine.py -> /home/jenkins/build/libvirt/share/virt-manager/virtManager copying virtManager/error.py -> /home/jenkins/build/libvirt/share/virt-manager/virtManager copying virtManager/fsdetails.py -> /home/jenkins/build/libvirt/share/virt-manager/virtManager copying virtManager/gfxdetails.py -> /home/jenkins/build/libvirt/share/virt-manager/virtManager copying virtManager/graphwidgets.py -> /home/jenkins/build/libvirt/share/virt-manager/virtManager copying virtManager/host.py -> /home/jenkins/build/libvirt/share/virt-manager/virtManager copying virtManager/inspection.py -> /home/jenkins/build/libvirt/share/virt-manager/virtManager copying virtManager/interface.py -> /home/jenkins/build/libvirt/share/virt-manager/virtManager copying virtManager/keyring.py -> /home/jenkins/build/libvirt/share/virt-manager/virtManager copying virtManager/libvirtobject.py -> /home/jenkins/build/libvirt/share/virt-manager/virtManager copying virtManager/manager.py -> /home/jenkins/build/libvirt/share/virt-manager/virtManager copying virtManager/mediacombo.py -> /home/jenkins/build/libvirt/share/virt-manager/virtManager copying virtManager/migrate.py -> /home/jenkins/build/libvirt/share/virt-manager/virtManager copying virtManager/module_trace.py -> /home/jenkins/build/libvirt/share/virt-manager/virtManager copying virtManager/netlist.py -> /home/jenkins/build/libvirt/share/virt-manager/virtManager copying virtManager/network.py -> /home/jenkins/build/libvirt/share/virt-manager/virtManager copying virtManager/nodedev.py -> /home/jenkins/build/libvirt/share/virt-manager/virtManager copying virtManager/packageutils.py -> /home/jenkins/build/libvirt/share/virt-manager/virtManager copying virtManager/preferences.py -> /home/jenkins/build/libvirt/share/virt-manager/virtManager copying virtManager/serialcon.py -> /home/jenkins/build/libvirt/share/virt-manager/virtManager copying virtManager/snapshots.py -> /home/jenkins/build/libvirt/share/virt-manager/virtManager copying virtManager/sshtunnels.py -> /home/jenkins/build/libvirt/share/virt-manager/virtManager copying virtManager/storagebrowse.py -> /home/jenkins/build/libvirt/share/virt-manager/virtManager copying virtManager/storagelist.py -> /home/jenkins/build/libvirt/share/virt-manager/virtManager copying virtManager/storagepool.py -> /home/jenkins/build/libvirt/share/virt-manager/virtManager copying virtManager/systray.py -> /home/jenkins/build/libvirt/share/virt-manager/virtManager copying virtManager/uiutil.py -> /home/jenkins/build/libvirt/share/virt-manager/virtManager copying virtManager/viewers.py -> /home/jenkins/build/libvirt/share/virt-manager/virtManager copying virtManager/vmmenu.py -> /home/jenkins/build/libvirt/share/virt-manager/virtManager creating /home/jenkins/build/libvirt/share/virt-manager/virtcli copying virtcli/__init__.py -> /home/jenkins/build/libvirt/share/virt-manager/virtcli copying virtcli/cliconfig.py -> /home/jenkins/build/libvirt/share/virt-manager/virtcli copying virtcli/cli.cfg -> /home/jenkins/build/libvirt/share/virt-manager/virtcli creating /home/jenkins/build/libvirt/share/virt-manager/virtinst copying virtinst/__init__.py -> /home/jenkins/build/libvirt/share/virt-manager/virtinst copying virtinst/capabilities.py -> /home/jenkins/build/libvirt/share/virt-manager/virtinst copying virtinst/cli.py -> /home/jenkins/build/libvirt/share/virt-manager/virtinst copying virtinst/clock.py -> /home/jenkins/build/libvirt/share/virt-manager/virtinst copying virtinst/cloner.py -> /home/jenkins/build/libvirt/share/virt-manager/virtinst copying virtinst/connection.py -> /home/jenkins/build/libvirt/share/virt-manager/virtinst copying virtinst/cpu.py -> /home/jenkins/build/libvirt/share/virt-manager/virtinst copying virtinst/device.py -> /home/jenkins/build/libvirt/share/virt-manager/virtinst copying virtinst/deviceaudio.py -> /home/jenkins/build/libvirt/share/virt-manager/virtinst copying virtinst/devicechar.py -> /home/jenkins/build/libvirt/share/virt-manager/virtinst copying virtinst/devicecontroller.py -> /home/jenkins/build/libvirt/share/virt-manager/virtinst copying virtinst/devicedisk.py -> /home/jenkins/build/libvirt/share/virt-manager/virtinst copying virtinst/devicefilesystem.py -> /home/jenkins/build/libvirt/share/virt-manager/virtinst copying virtinst/devicegraphics.py -> /home/jenkins/build/libvirt/share/virt-manager/virtinst copying virtinst/devicehostdev.py -> /home/jenkins/build/libvirt/share/virt-manager/virtinst copying virtinst/deviceinput.py -> /home/jenkins/build/libvirt/share/virt-manager/virtinst copying virtinst/deviceinterface.py -> /home/jenkins/build/libvirt/share/virt-manager/virtinst copying virtinst/devicememballoon.py -> /home/jenkins/build/libvirt/share/virt-manager/virtinst copying virtinst/devicepanic.py -> /home/jenkins/build/libvirt/share/virt-manager/virtinst copying virtinst/deviceredirdev.py -> /home/jenkins/build/libvirt/share/virt-manager/virtinst copying virtinst/devicerng.py -> /home/jenkins/build/libvirt/share/virt-manager/virtinst copying virtinst/devicesmartcard.py -> /home/jenkins/build/libvirt/share/virt-manager/virtinst copying virtinst/devicetpm.py -> /home/jenkins/build/libvirt/share/virt-manager/virtinst copying virtinst/devicevideo.py -> /home/jenkins/build/libvirt/share/virt-manager/virtinst copying virtinst/devicewatchdog.py -> /home/jenkins/build/libvirt/share/virt-manager/virtinst copying virtinst/diskbackend.py -> /home/jenkins/build/libvirt/share/virt-manager/virtinst copying virtinst/distroinstaller.py -> /home/jenkins/build/libvirt/share/virt-manager/virtinst copying virtinst/domainblkiotune.py -> /home/jenkins/build/libvirt/share/virt-manager/virtinst copying virtinst/domainfeatures.py -> /home/jenkins/build/libvirt/share/virt-manager/virtinst copying virtinst/domainmemorybacking.py -> /home/jenkins/build/libvirt/share/virt-manager/virtinst copying virtinst/domainmemorytune.py -> /home/jenkins/build/libvirt/share/virt-manager/virtinst copying virtinst/domainnumatune.py -> /home/jenkins/build/libvirt/share/virt-manager/virtinst copying virtinst/domainresource.py -> /home/jenkins/build/libvirt/share/virt-manager/virtinst copying virtinst/domcapabilities.py -> /home/jenkins/build/libvirt/share/virt-manager/virtinst copying virtinst/guest.py -> /home/jenkins/build/libvirt/share/virt-manager/virtinst copying virtinst/hostkeymap.py -> /home/jenkins/build/libvirt/share/virt-manager/virtinst copying virtinst/idmap.py -> /home/jenkins/build/libvirt/share/virt-manager/virtinst copying virtinst/initrdinject.py -> /home/jenkins/build/libvirt/share/virt-manager/virtinst copying virtinst/installer.py -> /home/jenkins/build/libvirt/share/virt-manager/virtinst copying virtinst/interface.py -> /home/jenkins/build/libvirt/share/virt-manager/virtinst copying virtinst/kernelupload.py -> /home/jenkins/build/libvirt/share/virt-manager/virtinst copying virtinst/network.py -> /home/jenkins/build/libvirt/share/virt-manager/virtinst copying virtinst/nodedev.py -> /home/jenkins/build/libvirt/share/virt-manager/virtinst copying virtinst/osdict.py -> /home/jenkins/build/libvirt/share/virt-manager/virtinst copying virtinst/osxml.py -> /home/jenkins/build/libvirt/share/virt-manager/virtinst copying virtinst/pm.py -> /home/jenkins/build/libvirt/share/virt-manager/virtinst copying virtinst/pollhelpers.py -> /home/jenkins/build/libvirt/share/virt-manager/virtinst copying virtinst/progress.py -> /home/jenkins/build/libvirt/share/virt-manager/virtinst copying virtinst/seclabel.py -> /home/jenkins/build/libvirt/share/virt-manager/virtinst copying virtinst/snapshot.py -> /home/jenkins/build/libvirt/share/virt-manager/virtinst copying virtinst/storage.py -> /home/jenkins/build/libvirt/share/virt-manager/virtinst copying virtinst/support.py -> /home/jenkins/build/libvirt/share/virt-manager/virtinst copying virtinst/sysinfo.py -> /home/jenkins/build/libvirt/share/virt-manager/virtinst copying virtinst/uri.py -> /home/jenkins/build/libvirt/share/virt-manager/virtinst copying virtinst/urlfetcher.py -> /home/jenkins/build/libvirt/share/virt-manager/virtinst copying virtinst/util.py -> /home/jenkins/build/libvirt/share/virt-manager/virtinst copying virtinst/xmlbuilder.py -> /home/jenkins/build/libvirt/share/virt-manager/virtinst creating /home/jenkins/build/libvirt/share/virt-manager/virtconv copying virtconv/__init__.py -> /home/jenkins/build/libvirt/share/virt-manager/virtconv copying virtconv/formats.py -> /home/jenkins/build/libvirt/share/virt-manager/virtconv copying virtconv/ovf.py -> /home/jenkins/build/libvirt/share/virt-manager/virtconv copying virtconv/vmx.py -> /home/jenkins/build/libvirt/share/virt-manager/virtconv creating /home/jenkins/build/libvirt/share/virt-manager/icons creating /home/jenkins/build/libvirt/share/virt-manager/icons/hicolor creating /home/jenkins/build/libvirt/share/virt-manager/icons/hicolor/16x16 creating /home/jenkins/build/libvirt/share/virt-manager/icons/hicolor/16x16/actions copying data/icons/16x16/actions/icon_console.png -> /home/jenkins/build/libvirt/share/virt-manager/icons/hicolor/16x16/actions copying data/icons/16x16/actions/vm_new.png -> /home/jenkins/build/libvirt/share/virt-manager/icons/hicolor/16x16/actions creating /home/jenkins/build/libvirt/share/icons creating /home/jenkins/build/libvirt/share/icons/hicolor creating /home/jenkins/build/libvirt/share/icons/hicolor/16x16 creating /home/jenkins/build/libvirt/share/icons/hicolor/16x16/apps copying data/icons/16x16/apps/virt-manager.png -> /home/jenkins/build/libvirt/share/icons/hicolor/16x16/apps creating /home/jenkins/build/libvirt/share/virt-manager/icons/hicolor/22x22 creating /home/jenkins/build/libvirt/share/virt-manager/icons/hicolor/22x22/actions copying data/icons/22x22/actions/icon_console.png -> /home/jenkins/build/libvirt/share/virt-manager/icons/hicolor/22x22/actions copying data/icons/22x22/actions/icon_details.png -> /home/jenkins/build/libvirt/share/virt-manager/icons/hicolor/22x22/actions copying data/icons/22x22/actions/vm_new.png -> /home/jenkins/build/libvirt/share/virt-manager/icons/hicolor/22x22/actions creating /home/jenkins/build/libvirt/share/icons/hicolor/22x22 creating /home/jenkins/build/libvirt/share/icons/hicolor/22x22/apps copying data/icons/22x22/apps/virt-manager.png -> /home/jenkins/build/libvirt/share/icons/hicolor/22x22/apps creating /home/jenkins/build/libvirt/share/virt-manager/icons/hicolor/22x22/devices copying data/icons/22x22/devices/device_cpu.png -> /home/jenkins/build/libvirt/share/virt-manager/icons/hicolor/22x22/devices copying data/icons/22x22/devices/device_mem.png -> /home/jenkins/build/libvirt/share/virt-manager/icons/hicolor/22x22/devices copying data/icons/22x22/devices/device_pci.png -> /home/jenkins/build/libvirt/share/virt-manager/icons/hicolor/22x22/devices copying data/icons/22x22/devices/device_serial.png -> /home/jenkins/build/libvirt/share/virt-manager/icons/hicolor/22x22/devices copying data/icons/22x22/devices/device_usb.png -> /home/jenkins/build/libvirt/share/virt-manager/icons/hicolor/22x22/devices creating /home/jenkins/build/libvirt/share/virt-manager/icons/hicolor/22x22/status copying data/icons/22x22/status/state_paused.png -> /home/jenkins/build/libvirt/share/virt-manager/icons/hicolor/22x22/status copying data/icons/22x22/status/state_running.png -> /home/jenkins/build/libvirt/share/virt-manager/icons/hicolor/22x22/status copying data/icons/22x22/status/state_shutoff.png -> /home/jenkins/build/libvirt/share/virt-manager/icons/hicolor/22x22/status creating /home/jenkins/build/libvirt/share/virt-manager/icons/hicolor/24x24 creating /home/jenkins/build/libvirt/share/virt-manager/icons/hicolor/24x24/actions copying data/icons/24x24/actions/icon_console.png -> /home/jenkins/build/libvirt/share/virt-manager/icons/hicolor/24x24/actions copying data/icons/24x24/actions/vm_clone_wizard.png -> /home/jenkins/build/libvirt/share/virt-manager/icons/hicolor/24x24/actions copying data/icons/24x24/actions/vm_new.png -> /home/jenkins/build/libvirt/share/virt-manager/icons/hicolor/24x24/actions creating /home/jenkins/build/libvirt/share/icons/hicolor/24x24 creating /home/jenkins/build/libvirt/share/icons/hicolor/24x24/apps copying data/icons/24x24/apps/virt-manager.png -> /home/jenkins/build/libvirt/share/icons/hicolor/24x24/apps creating /home/jenkins/build/libvirt/share/icons/hicolor/256x256 creating /home/jenkins/build/libvirt/share/icons/hicolor/256x256/apps copying data/icons/256x256/apps/virt-manager.png -> /home/jenkins/build/libvirt/share/icons/hicolor/256x256/apps creating /home/jenkins/build/libvirt/share/virt-manager/icons/hicolor/32x32 creating /home/jenkins/build/libvirt/share/virt-manager/icons/hicolor/32x32/actions copying data/icons/32x32/actions/icon_console.png -> /home/jenkins/build/libvirt/share/virt-manager/icons/hicolor/32x32/actions copying data/icons/32x32/actions/vm_new.png -> /home/jenkins/build/libvirt/share/virt-manager/icons/hicolor/32x32/actions creating /home/jenkins/build/libvirt/share/icons/hicolor/32x32 creating /home/jenkins/build/libvirt/share/icons/hicolor/32x32/apps copying data/icons/32x32/apps/virt-manager.png -> /home/jenkins/build/libvirt/share/icons/hicolor/32x32/apps creating /home/jenkins/build/libvirt/share/virt-manager/icons/hicolor/32x32/status copying data/icons/32x32/status/state_paused.png -> /home/jenkins/build/libvirt/share/virt-manager/icons/hicolor/32x32/status copying data/icons/32x32/status/state_running.png -> /home/jenkins/build/libvirt/share/virt-manager/icons/hicolor/32x32/status copying data/icons/32x32/status/state_shutoff.png -> /home/jenkins/build/libvirt/share/virt-manager/icons/hicolor/32x32/status creating /home/jenkins/build/libvirt/share/virt-manager/icons/hicolor/48x48 creating /home/jenkins/build/libvirt/share/virt-manager/icons/hicolor/48x48/actions copying data/icons/48x48/actions/vm_clone_wizard.png -> /home/jenkins/build/libvirt/share/virt-manager/icons/hicolor/48x48/actions copying data/icons/48x48/actions/vm_delete_wizard.png -> /home/jenkins/build/libvirt/share/virt-manager/icons/hicolor/48x48/actions copying data/icons/48x48/actions/vm_import_wizard.png -> /home/jenkins/build/libvirt/share/virt-manager/icons/hicolor/48x48/actions copying data/icons/48x48/actions/vm_new_wizard.png -> /home/jenkins/build/libvirt/share/virt-manager/icons/hicolor/48x48/actions creating /home/jenkins/build/libvirt/share/icons/hicolor/48x48 creating /home/jenkins/build/libvirt/share/icons/hicolor/48x48/apps copying data/icons/48x48/apps/virt-manager.png -> /home/jenkins/build/libvirt/share/icons/hicolor/48x48/apps copying build/mo/as/LC_MESSAGES/virt-manager.mo -> /home/jenkins/build/libvirt/share/locale/as/LC_MESSAGES copying build/mo/bg/LC_MESSAGES/virt-manager.mo -> /home/jenkins/build/libvirt/share/locale/bg/LC_MESSAGES copying build/mo/bn_IN/LC_MESSAGES/virt-manager.mo -> /home/jenkins/build/libvirt/share/locale/bn_IN/LC_MESSAGES copying build/mo/bs/LC_MESSAGES/virt-manager.mo -> /home/jenkins/build/libvirt/share/locale/bs/LC_MESSAGES copying build/mo/ca/LC_MESSAGES/virt-manager.mo -> /home/jenkins/build/libvirt/share/locale/ca/LC_MESSAGES creating /home/jenkins/build/libvirt/share/locale/cmn creating /home/jenkins/build/libvirt/share/locale/cmn/LC_MESSAGES copying build/mo/cmn/LC_MESSAGES/virt-manager.mo -> /home/jenkins/build/libvirt/share/locale/cmn/LC_MESSAGES copying build/mo/cs/LC_MESSAGES/virt-manager.mo -> /home/jenkins/build/libvirt/share/locale/cs/LC_MESSAGES copying build/mo/da/LC_MESSAGES/virt-manager.mo -> /home/jenkins/build/libvirt/share/locale/da/LC_MESSAGES copying build/mo/de/LC_MESSAGES/virt-manager.mo -> /home/jenkins/build/libvirt/share/locale/de/LC_MESSAGES copying build/mo/en_GB/LC_MESSAGES/virt-manager.mo -> /home/jenkins/build/libvirt/share/locale/en_GB/LC_MESSAGES copying build/mo/es/LC_MESSAGES/virt-manager.mo -> /home/jenkins/build/libvirt/share/locale/es/LC_MESSAGES copying build/mo/fi/LC_MESSAGES/virt-manager.mo -> /home/jenkins/build/libvirt/share/locale/fi/LC_MESSAGES copying build/mo/fr/LC_MESSAGES/virt-manager.mo -> /home/jenkins/build/libvirt/share/locale/fr/LC_MESSAGES copying build/mo/gu/LC_MESSAGES/virt-manager.mo -> /home/jenkins/build/libvirt/share/locale/gu/LC_MESSAGES copying build/mo/hi/LC_MESSAGES/virt-manager.mo -> /home/jenkins/build/libvirt/share/locale/hi/LC_MESSAGES copying build/mo/hr/LC_MESSAGES/virt-manager.mo -> /home/jenkins/build/libvirt/share/locale/hr/LC_MESSAGES copying build/mo/hu/LC_MESSAGES/virt-manager.mo -> /home/jenkins/build/libvirt/share/locale/hu/LC_MESSAGES copying build/mo/is/LC_MESSAGES/virt-manager.mo -> /home/jenkins/build/libvirt/share/locale/is/LC_MESSAGES copying build/mo/it/LC_MESSAGES/virt-manager.mo -> /home/jenkins/build/libvirt/share/locale/it/LC_MESSAGES copying build/mo/ja/LC_MESSAGES/virt-manager.mo -> /home/jenkins/build/libvirt/share/locale/ja/LC_MESSAGES copying build/mo/kn/LC_MESSAGES/virt-manager.mo -> /home/jenkins/build/libvirt/share/locale/kn/LC_MESSAGES copying build/mo/ko/LC_MESSAGES/virt-manager.mo -> /home/jenkins/build/libvirt/share/locale/ko/LC_MESSAGES copying build/mo/ml/LC_MESSAGES/virt-manager.mo -> /home/jenkins/build/libvirt/share/locale/ml/LC_MESSAGES copying build/mo/mr/LC_MESSAGES/virt-manager.mo -> /home/jenkins/build/libvirt/share/locale/mr/LC_MESSAGES copying build/mo/ms/LC_MESSAGES/virt-manager.mo -> /home/jenkins/build/libvirt/share/locale/ms/LC_MESSAGES copying build/mo/nb/LC_MESSAGES/virt-manager.mo -> /home/jenkins/build/libvirt/share/locale/nb/LC_MESSAGES copying build/mo/nl/LC_MESSAGES/virt-manager.mo -> /home/jenkins/build/libvirt/share/locale/nl/LC_MESSAGES copying build/mo/or/LC_MESSAGES/virt-manager.mo -> /home/jenkins/build/libvirt/share/locale/or/LC_MESSAGES copying build/mo/pa/LC_MESSAGES/virt-manager.mo -> /home/jenkins/build/libvirt/share/locale/pa/LC_MESSAGES copying build/mo/pl/LC_MESSAGES/virt-manager.mo -> /home/jenkins/build/libvirt/share/locale/pl/LC_MESSAGES copying build/mo/pt/LC_MESSAGES/virt-manager.mo -> /home/jenkins/build/libvirt/share/locale/pt/LC_MESSAGES copying build/mo/pt_BR/LC_MESSAGES/virt-manager.mo -> /home/jenkins/build/libvirt/share/locale/pt_BR/LC_MESSAGES copying build/mo/ro/LC_MESSAGES/virt-manager.mo -> /home/jenkins/build/libvirt/share/locale/ro/LC_MESSAGES copying build/mo/ru/LC_MESSAGES/virt-manager.mo -> /home/jenkins/build/libvirt/share/locale/ru/LC_MESSAGES copying build/mo/sk/LC_MESSAGES/virt-manager.mo -> /home/jenkins/build/libvirt/share/locale/sk/LC_MESSAGES copying build/mo/sr/LC_MESSAGES/virt-manager.mo -> /home/jenkins/build/libvirt/share/locale/sr/LC_MESSAGES copying build/mo/sr(a)latin/LC_MESSAGES/virt-manager.mo -> /home/jenkins/build/libvirt/share/locale/sr@latin/LC_MESSAGES copying build/mo/sv/LC_MESSAGES/virt-manager.mo -> /home/jenkins/build/libvirt/share/locale/sv/LC_MESSAGES copying build/mo/ta/LC_MESSAGES/virt-manager.mo -> /home/jenkins/build/libvirt/share/locale/ta/LC_MESSAGES copying build/mo/te/LC_MESSAGES/virt-manager.mo -> /home/jenkins/build/libvirt/share/locale/te/LC_MESSAGES copying build/mo/tr/LC_MESSAGES/virt-manager.mo -> /home/jenkins/build/libvirt/share/locale/tr/LC_MESSAGES copying build/mo/uk/LC_MESSAGES/virt-manager.mo -> /home/jenkins/build/libvirt/share/locale/uk/LC_MESSAGES copying build/mo/vi/LC_MESSAGES/virt-manager.mo -> /home/jenkins/build/libvirt/share/locale/vi/LC_MESSAGES copying build/mo/zh_CN/LC_MESSAGES/virt-manager.mo -> /home/jenkins/build/libvirt/share/locale/zh_CN/LC_MESSAGES copying build/mo/zh_TW/LC_MESSAGES/virt-manager.mo -> /home/jenkins/build/libvirt/share/locale/zh_TW/LC_MESSAGES creating /home/jenkins/build/libvirt/share/applications copying build/share/applications/virt-manager.desktop -> /home/jenkins/build/libvirt/share/applications creating /home/jenkins/build/libvirt/share/appdata copying build/share/appdata/virt-manager.appdata.xml -> /home/jenkins/build/libvirt/share/appdata running gtk-update-icon-cache gtk-update-icon-cache -q -t /home/jenkins/build/libvirt/share/icons/hicolor unable to execute 'gtk-update-icon-cache': No such file or directory error: command 'gtk-update-icon-cache' failed with exit status 1 Build step 'Execute shell' marked build as failure
1 1
0 0
[Libvirt-ci] Build failed in Jenkins: libvirt-python-master-check » libvirt-fedora-24 #92
by ci@centos.org 26 Oct '23

26 Oct '23
https://ci.centos.org/job/libvirt-python-master-check/systems=libvirt-fedor… Started by upstream project "libvirt-python-master-check" build number 92 originally caused by: Started by upstream project "libvirt-python-master-build" build number 98 originally caused by: Started by user Libvirt project [EnvInject] - Loading node environment variables. Building remotely on libvirt-fedora-24 (libvirt) in workspace <https://ci.centos.org/job/libvirt-python-master-check/systems=libvirt-fedor…> [libvirt-fedora-24] $ /bin/sh -xe /tmp/hudson3749749364369497551.sh + python setup.py test running test /bin/python sanitytest.py build/lib.linux-x86_64-2.7 /home/jenkins/build/libvirt/share/libvirt/api/libvirt-api.xml Traceback (most recent call last): File "sanitytest.py", line 4, in <module> import lxml ImportError: No module named lxml error: command '/bin/python' failed with exit status 1 Build step 'Execute shell' marked build as failure
1 2
0 0
[Libvirt-ci] Build failed in Jenkins: libvirt-perl-master-test » libvirt-fedora-24 #95
by ci@centos.org 26 Oct '23

26 Oct '23
https://ci.centos.org/job/libvirt-perl-master-test/systems=libvirt-fedora-2… Started by upstream project "libvirt-perl-master-test" build number 95 originally caused by: Started by upstream project "libvirt-perl-master-build" build number 106 originally caused by: Started by user Libvirt project [EnvInject] - Loading node environment variables. Building remotely on libvirt-fedora-24 (libvirt) in workspace <https://ci.centos.org/job/libvirt-perl-master-test/systems=libvirt-fedora-2…> [libvirt-fedora-24] $ /bin/sh -xe /tmp/hudson8908353130401834431.sh + make -j3 test TEST_MAINTAINER=1 PERL_DL_NONLAZY=1 "/usr/bin/perl" "-MExtUtils::Command::MM" "-MTest::Harness" "-e" "undef *Test::Harness::Switches; test_harness(0, 'blib/lib', 'blib/arch')" t/*.t Can't locate Test/More.pm in @INC (you may need to install the Test::More module) (@INC contains: <https://ci.centos.org/job/libvirt-perl-master-test/systems=libvirt-fedora-2…> <https://ci.centos.org/job/libvirt-perl-master-test/systems=libvirt-fedora-2…> /home/jenkins/build/libvirt/lib/perl5 /home/jenkins/build/libvirt/lib64/perl5 /home/jenkins/build/libvirt/lib/perl5 /home/jenkins/build/libvirt/lib64/perl5 /usr/local/lib64/perl5 /usr/local/share/perl5 /usr/lib64/perl5/vendor_perl /usr/share/perl5/vendor_perl /usr/lib64/perl5 /usr/share/perl5 .) at t/005-pod.t line 1. BEGIN failed--compilation aborted at t/005-pod.t line 1. t/005-pod.t ............ Dubious, test returned 2 (wstat 512, 0x200) No subtests run Can't locate Test/More.pm in @INC (you may need to install the Test::More module) (@INC contains: <https://ci.centos.org/job/libvirt-perl-master-test/systems=libvirt-fedora-2…> <https://ci.centos.org/job/libvirt-perl-master-test/systems=libvirt-fedora-2…> /home/jenkins/build/libvirt/lib/perl5 /home/jenkins/build/libvirt/lib64/perl5 /home/jenkins/build/libvirt/lib/perl5 /home/jenkins/build/libvirt/lib64/perl5 /usr/local/lib64/perl5 /usr/local/share/perl5 /usr/lib64/perl5/vendor_perl /usr/share/perl5/vendor_perl /usr/lib64/perl5 /usr/share/perl5 .) at t/010-pod-coverage.t line 4. BEGIN failed--compilation aborted at t/010-pod-coverage.t line 4. t/010-pod-coverage.t ... Dubious, test returned 2 (wstat 512, 0x200) No subtests run Can't locate Test/More.pm in @INC (you may need to install the Test::More module) (@INC contains: <https://ci.centos.org/job/libvirt-perl-master-test/systems=libvirt-fedora-2…> <https://ci.centos.org/job/libvirt-perl-master-test/systems=libvirt-fedora-2…> /home/jenkins/build/libvirt/lib/perl5 /home/jenkins/build/libvirt/lib64/perl5 /home/jenkins/build/libvirt/lib/perl5 /home/jenkins/build/libvirt/lib64/perl5 /usr/local/lib64/perl5 /usr/local/share/perl5 /usr/lib64/perl5/vendor_perl /usr/share/perl5/vendor_perl /usr/lib64/perl5 /usr/share/perl5 .) at t/015-changes.t line 4. BEGIN failed--compilation aborted at t/015-changes.t line 4. t/015-changes.t ........ Dubious, test returned 2 (wstat 512, 0x200) No subtests run Can't locate Test/More.pm in @INC (you may need to install the Test::More module) (@INC contains: <https://ci.centos.org/job/libvirt-perl-master-test/systems=libvirt-fedora-2…> <https://ci.centos.org/job/libvirt-perl-master-test/systems=libvirt-fedora-2…> /home/jenkins/build/libvirt/lib/perl5 /home/jenkins/build/libvirt/lib64/perl5 /home/jenkins/build/libvirt/lib/perl5 /home/jenkins/build/libvirt/lib64/perl5 /usr/local/lib64/perl5 /usr/local/share/perl5 /usr/lib64/perl5/vendor_perl /usr/share/perl5/vendor_perl /usr/lib64/perl5 /usr/share/perl5 .) at t/020-constants.t line 5. BEGIN failed--compilation aborted at t/020-constants.t line 5. t/020-constants.t ...... Dubious, test returned 2 (wstat 512, 0x200) No subtests run Can't locate XML/XPath.pm in @INC (you may need to install the XML::XPath module) (@INC contains: <https://ci.centos.org/job/libvirt-perl-master-test/systems=libvirt-fedora-2…> <https://ci.centos.org/job/libvirt-perl-master-test/systems=libvirt-fedora-2…> /home/jenkins/build/libvirt/lib/perl5 /home/jenkins/build/libvirt/lib64/perl5 /home/jenkins/build/libvirt/lib/perl5 /home/jenkins/build/libvirt/lib64/perl5 /usr/local/lib64/perl5 /usr/local/share/perl5 /usr/lib64/perl5/vendor_perl /usr/share/perl5/vendor_perl /usr/lib64/perl5 /usr/share/perl5 .) at t/030-api-coverage.t line 5. BEGIN failed--compilation aborted at t/030-api-coverage.t line 5. t/030-api-coverage.t ... Dubious, test returned 2 (wstat 512, 0x200) No subtests run Can't locate Test/More.pm in @INC (you may need to install the Test::More module) (@INC contains: <https://ci.centos.org/job/libvirt-perl-master-test/systems=libvirt-fedora-2…> <https://ci.centos.org/job/libvirt-perl-master-test/systems=libvirt-fedora-2…> /home/jenkins/build/libvirt/lib/perl5 /home/jenkins/build/libvirt/lib64/perl5 /home/jenkins/build/libvirt/lib/perl5 /home/jenkins/build/libvirt/lib64/perl5 /usr/local/lib64/perl5 /usr/local/share/perl5 /usr/lib64/perl5/vendor_perl /usr/share/perl5/vendor_perl /usr/lib64/perl5 /usr/share/perl5 .) at t/100-connect.t line 6. BEGIN failed--compilation aborted at t/100-connect.t line 6. t/100-connect.t ........ Dubious, test returned 2 (wstat 512, 0x200) No subtests run Can't locate Test/More.pm in @INC (you may need to install the Test::More module) (@INC contains: <https://ci.centos.org/job/libvirt-perl-master-test/systems=libvirt-fedora-2…> <https://ci.centos.org/job/libvirt-perl-master-test/systems=libvirt-fedora-2…> /home/jenkins/build/libvirt/lib/perl5 /home/jenkins/build/libvirt/lib64/perl5 /home/jenkins/build/libvirt/lib/perl5 /home/jenkins/build/libvirt/lib64/perl5 /usr/local/lib64/perl5 /usr/local/share/perl5 /usr/lib64/perl5/vendor_perl /usr/share/perl5/vendor_perl /usr/lib64/perl5 /usr/share/perl5 .) at t/200-domains.t line 6. BEGIN failed--compilation aborted at t/200-domains.t line 6. t/200-domains.t ........ Dubious, test returned 2 (wstat 512, 0x200) No subtests run Can't locate Test/More.pm in @INC (you may need to install the Test::More module) (@INC contains: <https://ci.centos.org/job/libvirt-perl-master-test/systems=libvirt-fedora-2…> <https://ci.centos.org/job/libvirt-perl-master-test/systems=libvirt-fedora-2…> /home/jenkins/build/libvirt/lib/perl5 /home/jenkins/build/libvirt/lib64/perl5 /home/jenkins/build/libvirt/lib/perl5 /home/jenkins/build/libvirt/lib64/perl5 /usr/local/lib64/perl5 /usr/local/share/perl5 /usr/lib64/perl5/vendor_perl /usr/share/perl5/vendor_perl /usr/lib64/perl5 /usr/share/perl5 .) at t/300-networks.t line 6. BEGIN failed--compilation aborted at t/300-networks.t line 6. t/300-networks.t ....... Dubious, test returned 2 (wstat 512, 0x200) No subtests run Can't locate Test/More.pm in @INC (you may need to install the Test::More module) (@INC contains: <https://ci.centos.org/job/libvirt-perl-master-test/systems=libvirt-fedora-2…> <https://ci.centos.org/job/libvirt-perl-master-test/systems=libvirt-fedora-2…> /home/jenkins/build/libvirt/lib/perl5 /home/jenkins/build/libvirt/lib64/perl5 /home/jenkins/build/libvirt/lib/perl5 /home/jenkins/build/libvirt/lib64/perl5 /usr/local/lib64/perl5 /usr/local/share/perl5 /usr/lib64/perl5/vendor_perl /usr/share/perl5/vendor_perl /usr/lib64/perl5 /usr/share/perl5 .) at t/400-storage-pools.t line 6. BEGIN failed--compilation aborted at t/400-storage-pools.t line 6. t/400-storage-pools.t .. Dubious, test returned 2 (wstat 512, 0x200) No subtests run Can't locate Test/More.pm in @INC (you may need to install the Test::More module) (@INC contains: <https://ci.centos.org/job/libvirt-perl-master-test/systems=libvirt-fedora-2…> <https://ci.centos.org/job/libvirt-perl-master-test/systems=libvirt-fedora-2…> /home/jenkins/build/libvirt/lib/perl5 /home/jenkins/build/libvirt/lib64/perl5 /home/jenkins/build/libvirt/lib/perl5 /home/jenkins/build/libvirt/lib64/perl5 /usr/local/lib64/perl5 /usr/local/share/perl5 /usr/lib64/perl5/vendor_perl /usr/share/perl5/vendor_perl /usr/lib64/perl5 /usr/share/perl5 .) at t/500-storage-vols.t line 6. BEGIN failed--compilation aborted at t/500-storage-vols.t line 6. t/500-storage-vols.t ... Dubious, test returned 2 (wstat 512, 0x200) No subtests run Can't locate Test/More.pm in @INC (you may need to install the Test::More module) (@INC contains: <https://ci.centos.org/job/libvirt-perl-master-test/systems=libvirt-fedora-2…> <https://ci.centos.org/job/libvirt-perl-master-test/systems=libvirt-fedora-2…> /home/jenkins/build/libvirt/lib/perl5 /home/jenkins/build/libvirt/lib64/perl5 /home/jenkins/build/libvirt/lib/perl5 /home/jenkins/build/libvirt/lib64/perl5 /usr/local/lib64/perl5 /usr/local/share/perl5 /usr/lib64/perl5/vendor_perl /usr/share/perl5/vendor_perl /usr/lib64/perl5 /usr/share/perl5 .) at t/600-interfaces.t line 6. BEGIN failed--compilation aborted at t/600-interfaces.t line 6. t/600-interfaces.t ..... Dubious, test returned 2 (wstat 512, 0x200) No subtests run Can't locate Test/More.pm in @INC (you may need to install the Test::More module) (@INC contains: <https://ci.centos.org/job/libvirt-perl-master-test/systems=libvirt-fedora-2…> <https://ci.centos.org/job/libvirt-perl-master-test/systems=libvirt-fedora-2…> /home/jenkins/build/libvirt/lib/perl5 /home/jenkins/build/libvirt/lib64/perl5 /home/jenkins/build/libvirt/lib/perl5 /home/jenkins/build/libvirt/lib64/perl5 /usr/local/lib64/perl5 /usr/local/share/perl5 /usr/lib64/perl5/vendor_perl /usr/share/perl5/vendor_perl /usr/lib64/perl5 /usr/share/perl5 .) at t/800-events.t line 6. BEGIN failed--compilation aborted at t/800-events.t line 6. t/800-events.t ......... Dubious, test returned 2 (wstat 512, 0x200) No subtests run Test Summary Report ------------------- t/005-pod.t (Wstat: 512 Tests: 0 Failed: 0) Non-zero exit status: 2 Parse errors: No plan found in TAP output t/010-pod-coverage.t (Wstat: 512 Tests: 0 Failed: 0) Non-zero exit status: 2 Parse errors: No plan found in TAP output t/015-changes.t (Wstat: 512 Tests: 0 Failed: 0) Non-zero exit status: 2 Parse errors: No plan found in TAP output t/020-constants.t (Wstat: 512 Tests: 0 Failed: 0) Non-zero exit status: 2 Parse errors: No plan found in TAP output t/030-api-coverage.t (Wstat: 512 Tests: 0 Failed: 0) Non-zero exit status: 2 Parse errors: No plan found in TAP output t/100-connect.t (Wstat: 512 Tests: 0 Failed: 0) Non-zero exit status: 2 Parse errors: No plan found in TAP output t/200-domains.t (Wstat: 512 Tests: 0 Failed: 0) Non-zero exit status: 2 Parse errors: No plan found in TAP output t/300-networks.t (Wstat: 512 Tests: 0 Failed: 0) Non-zero exit status: 2 Parse errors: No plan found in TAP output t/400-storage-pools.t (Wstat: 512 Tests: 0 Failed: 0) Non-zero exit status: 2 Parse errors: No plan found in TAP output t/500-storage-vols.t (Wstat: 512 Tests: 0 Failed: 0) Non-zero exit status: 2 Parse errors: No plan found in TAP output t/600-interfaces.t (Wstat: 512 Tests: 0 Failed: 0) Non-zero exit status: 2 Parse errors: No plan found in TAP output t/800-events.t (Wstat: 512 Tests: 0 Failed: 0) Non-zero exit status: 2 Parse errors: No plan found in TAP output Files=12, Tests=0, 0 wallclock secs ( 0.07 usr 0.03 sys + 0.08 cusr 0.05 csys = 0.23 CPU) Result: FAIL Failed 12/12 test programs. 0/0 subtests failed. Makefile:1030: recipe for target 'test_dynamic' failed make: *** [test_dynamic] Error 2 Build step 'Execute shell' marked build as failure
1 2
0 0
[Libvirt-ci] Build failed in Jenkins: libvirt-tck-master-build » libvirt-fedora-24 #100
by ci@centos.org 26 Oct '23

26 Oct '23
https://ci.centos.org/job/libvirt-tck-master-build/systems=libvirt-fedora-2… Started by upstream project "libvirt-tck-master-build" build number 100 originally caused by: Started by upstream project "libvirt-perl-master-build" build number 106 originally caused by: Started by user Libvirt project [EnvInject] - Loading node environment variables. Building remotely on libvirt-fedora-24 (libvirt) in workspace <https://ci.centos.org/job/libvirt-tck-master-build/systems=libvirt-fedora-2…> Cloning the remote Git repository Cloning repository git://n64.pufty.ci.centos.org/libvirt-tck.git > git init <https://ci.centos.org/job/libvirt-tck-master-build/systems=libvirt-fedora-2…> # timeout=10 Fetching upstream changes from git://n64.pufty.ci.centos.org/libvirt-tck.git > git --version # timeout=10 > git -c core.askpass=true fetch --tags --progress git://n64.pufty.ci.centos.org/libvirt-tck.git +refs/heads/*:refs/remotes/origin/* > git config remote.origin.url git://n64.pufty.ci.centos.org/libvirt-tck.git # timeout=10 > git config --add remote.origin.fetch +refs/heads/*:refs/remotes/origin/* # timeout=10 > git config remote.origin.url git://n64.pufty.ci.centos.org/libvirt-tck.git # timeout=10 Fetching upstream changes from git://n64.pufty.ci.centos.org/libvirt-tck.git > git -c core.askpass=true fetch --tags --progress git://n64.pufty.ci.centos.org/libvirt-tck.git +refs/heads/*:refs/remotes/origin/* Checking out Revision 140f1da092e4d0213f5f460f6f62478d77709c02 (refs/remotes/origin/master) > git config core.sparsecheckout # timeout=10 > git checkout -f 140f1da092e4d0213f5f460f6f62478d77709c02 First time build. Skipping changelog. Cleaning workspace > git rev-parse --verify HEAD # timeout=10 Resetting working tree > git reset --hard # timeout=10 > git clean -fdx # timeout=10 [libvirt-fedora-24] $ /bin/sh -xe /tmp/hudson6156481916500153095.sh + perl Build.PL install_base=/home/jenkins/build/libvirt Can't locate Module/Build.pm in @INC (you may need to install the Module::Build module) (@INC contains: /home/jenkins/build/libvirt/lib/perl5 /home/jenkins/build/libvirt/lib64/perl5 /usr/local/lib64/perl5 /usr/local/share/perl5 /usr/lib64/perl5/vendor_perl /usr/share/perl5/vendor_perl /usr/lib64/perl5 /usr/share/perl5 .) at Build.PL line 15. BEGIN failed--compilation aborted at Build.PL line 15. Build step 'Execute shell' marked build as failure
1 1
0 0
[Libvirt-ci] Build failed in Jenkins: osinfo-db-master-build » libvirt-fedora-24 #7
by ci@centos.org 26 Oct '23

26 Oct '23
https://ci.centos.org/job/osinfo-db-master-build/systems=libvirt-fedora-24/… Started by upstream project "osinfo-db-master-build" build number 7 originally caused by: Started by an SCM change [EnvInject] - Loading node environment variables. Building remotely on libvirt-fedora-24 (libvirt) in workspace <https://ci.centos.org/job/osinfo-db-master-build/systems=libvirt-fedora-24/…> Cloning the remote Git repository Cloning repository git://n64.pufty.ci.centos.org/osinfo-db.git > git init <https://ci.centos.org/job/osinfo-db-master-build/systems=libvirt-fedora-24/…> # timeout=10 Fetching upstream changes from git://n64.pufty.ci.centos.org/osinfo-db.git > git --version # timeout=10 > git -c core.askpass=true fetch --tags --progress git://n64.pufty.ci.centos.org/osinfo-db.git +refs/heads/*:refs/remotes/origin/* > git config remote.origin.url git://n64.pufty.ci.centos.org/osinfo-db.git # timeout=10 > git config --add remote.origin.fetch +refs/heads/*:refs/remotes/origin/* # timeout=10 > git config remote.origin.url git://n64.pufty.ci.centos.org/osinfo-db.git # timeout=10 Fetching upstream changes from git://n64.pufty.ci.centos.org/osinfo-db.git > git -c core.askpass=true fetch --tags --progress git://n64.pufty.ci.centos.org/osinfo-db.git +refs/heads/*:refs/remotes/origin/* Checking out Revision ec8c6d800dcd535a5f31a53a22877c25f43819f7 (refs/remotes/origin/master) > git config core.sparsecheckout # timeout=10 > git checkout -f ec8c6d800dcd535a5f31a53a22877c25f43819f7 First time build. Skipping changelog. Cleaning workspace > git rev-parse --verify HEAD # timeout=10 Resetting working tree > git reset --hard # timeout=10 > git clean -fdx # timeout=10 [libvirt-fedora-24] $ /bin/sh -xe /tmp/hudson1725572893791834134.sh + export PATH=/home/jenkins/build/libvirt/bin:/home/jenkins/build/libvirt/bin:/sbin:/bin:/usr/sbin:/usr/bin:/usr/local/sbin:/home/jenkins/.local/bin:/home/jenkins/bin + PATH=/home/jenkins/build/libvirt/bin:/home/jenkins/build/libvirt/bin:/sbin:/bin:/usr/sbin:/usr/bin:/usr/local/sbin:/home/jenkins/.local/bin:/home/jenkins/bin + make -j3 all I18N data/install-script/opensuse.org/opensuse-autoyast-jeos.xml I18N data/install-script/ubuntu.com/ubuntu-preseed-jeos.xml /bin/sh: intltool-merge: command not found Makefile:65: recipe for target 'data/install-script/opensuse.org/opensuse-autoyast-jeos.xml' failed make: *** [data/install-script/opensuse.org/opensuse-autoyast-jeos.xml] Error 127 make: *** Waiting for unfinished jobs.... /bin/sh: intltool-merge: command not found Makefile:65: recipe for target 'data/install-script/ubuntu.com/ubuntu-preseed-jeos.xml' failed make: *** [data/install-script/ubuntu.com/ubuntu-preseed-jeos.xml] Error 127 I18N data/install-script/opensuse.org/opensuse-autoyast-desktop.xml /bin/sh: intltool-merge: command not found Makefile:65: recipe for target 'data/install-script/opensuse.org/opensuse-autoyast-desktop.xml' failed make: *** [data/install-script/opensuse.org/opensuse-autoyast-desktop.xml] Error 127 Build step 'Execute shell' marked build as failure
1 2
0 0
[Libvirt-ci] Build failed in Jenkins: osinfo-db-tools-master-build » libvirt-fedora-24 #2
by ci@centos.org 26 Oct '23

26 Oct '23
https://ci.centos.org/job/osinfo-db-tools-master-build/systems=libvirt-fedo… Started by upstream project "osinfo-db-tools-master-build" build number 2 originally caused by: Started by an SCM change [EnvInject] - Loading node environment variables. Building remotely on libvirt-fedora-24 (libvirt) in workspace <https://ci.centos.org/job/osinfo-db-tools-master-build/systems=libvirt-fedo…> Cloning the remote Git repository Cloning repository git://n64.pufty.ci.centos.org/osinfo-db-tools.git > git init <https://ci.centos.org/job/osinfo-db-tools-master-build/systems=libvirt-fedo…> # timeout=10 Fetching upstream changes from git://n64.pufty.ci.centos.org/osinfo-db-tools.git > git --version # timeout=10 > git -c core.askpass=true fetch --tags --progress git://n64.pufty.ci.centos.org/osinfo-db-tools.git +refs/heads/*:refs/remotes/origin/* > git config remote.origin.url git://n64.pufty.ci.centos.org/osinfo-db-tools.git # timeout=10 > git config --add remote.origin.fetch +refs/heads/*:refs/remotes/origin/* # timeout=10 > git config remote.origin.url git://n64.pufty.ci.centos.org/osinfo-db-tools.git # timeout=10 Fetching upstream changes from git://n64.pufty.ci.centos.org/osinfo-db-tools.git > git -c core.askpass=true fetch --tags --progress git://n64.pufty.ci.centos.org/osinfo-db-tools.git +refs/heads/*:refs/remotes/origin/* Checking out Revision 985d4621315a91cad3703a4ba625c5d0b0bedd14 (refs/remotes/origin/master) > git config core.sparsecheckout # timeout=10 > git checkout -f 985d4621315a91cad3703a4ba625c5d0b0bedd14 First time build. Skipping changelog. Cleaning workspace > git rev-parse --verify HEAD # timeout=10 Resetting working tree > git reset --hard # timeout=10 > git clean -fdx # timeout=10 [libvirt-fedora-24] $ /bin/sh -xe /tmp/hudson4780418638211449122.sh + MAKE=make ++ uname + unamestr=Linux + '[' Linux = FreeBSD ']' + mkdir build + cd build + ../autogen.sh --prefix=/home/jenkins/build/libvirt which: no gnome-autogen.sh in (/home/jenkins/build/libvirt/bin:/sbin:/bin:/usr/sbin:/usr/bin:/usr/local/sbin:/home/jenkins/.local/bin:/home/jenkins/bin) You need to install gnome-common from the GNOME git Build step 'Execute shell' marked build as failure
1 3
0 0
[Libvirt-ci] Build failed in Jenkins: libvirt-python-master-build » libvirt-fedora-24 #96
by ci@centos.org 26 Oct '23

26 Oct '23
https://ci.centos.org/job/libvirt-python-master-build/systems=libvirt-fedor… Started by upstream project "libvirt-python-master-build" build number 96 originally caused by: Started by upstream project "libvirt-master-build" build number 154 originally caused by: Started by an SCM change [EnvInject] - Loading node environment variables. Building remotely on libvirt-fedora-24 (libvirt) in workspace <https://ci.centos.org/job/libvirt-python-master-build/systems=libvirt-fedor…> Cloning the remote Git repository Cloning repository git://n64.pufty.ci.centos.org/libvirt-python.git > git init <https://ci.centos.org/job/libvirt-python-master-build/systems=libvirt-fedor…> # timeout=10 Fetching upstream changes from git://n64.pufty.ci.centos.org/libvirt-python.git > git --version # timeout=10 > git -c core.askpass=true fetch --tags --progress git://n64.pufty.ci.centos.org/libvirt-python.git +refs/heads/*:refs/remotes/origin/* > git config remote.origin.url git://n64.pufty.ci.centos.org/libvirt-python.git # timeout=10 > git config --add remote.origin.fetch +refs/heads/*:refs/remotes/origin/* # timeout=10 > git config remote.origin.url git://n64.pufty.ci.centos.org/libvirt-python.git # timeout=10 Fetching upstream changes from git://n64.pufty.ci.centos.org/libvirt-python.git > git -c core.askpass=true fetch --tags --progress git://n64.pufty.ci.centos.org/libvirt-python.git +refs/heads/*:refs/remotes/origin/* Checking out Revision 0061566872ed3fdf7b0ec101c20d3ddb78093a06 (refs/remotes/origin/master) > git config core.sparsecheckout # timeout=10 > git checkout -f 0061566872ed3fdf7b0ec101c20d3ddb78093a06 First time build. Skipping changelog. Cleaning workspace > git rev-parse --verify HEAD # timeout=10 Resetting working tree > git reset --hard # timeout=10 > git clean -fdx # timeout=10 [libvirt-fedora-24] $ /bin/sh -xe /tmp/hudson5596820156225161197.sh + python setup.py build running build /bin/pkg-config --print-errors --atleast-version=0.9.11 libvirt /bin/python generator.py libvirt /home/jenkins/build/libvirt/share/libvirt/api/libvirt-api.xml Found 415 functions in /home/jenkins/build/libvirt/share/libvirt/api/libvirt-api.xml Found 0 functions in libvirt-override-api.xml Generated 343 wrapper functions /bin/python generator.py libvirt-qemu /home/jenkins/build/libvirt/share/libvirt/api/libvirt-qemu-api.xml Found 5 functions in /home/jenkins/build/libvirt/share/libvirt/api/libvirt-qemu-api.xml Found 0 functions in libvirt-qemu-override-api.xml Generated 3 wrapper functions /bin/pkg-config --atleast-version=1.0.2 libvirt /bin/python generator.py libvirt-lxc /home/jenkins/build/libvirt/share/libvirt/api/libvirt-lxc-api.xml Found 4 functions in /home/jenkins/build/libvirt/share/libvirt/api/libvirt-lxc-api.xml Found 0 functions in libvirt-lxc-override-api.xml Generated 2 wrapper functions running build_py creating build/lib.linux-x86_64-2.7 copying build/libvirt.py -> build/lib.linux-x86_64-2.7 copying build/libvirt_qemu.py -> build/lib.linux-x86_64-2.7 copying build/libvirt_lxc.py -> build/lib.linux-x86_64-2.7 running build_ext building 'libvirtmod' extension creating build/temp.linux-x86_64-2.7 creating build/temp.linux-x86_64-2.7/build gcc -pthread -fno-strict-aliasing -O2 -g -pipe -Wall -Werror=format-security -Wp,-D_FORTIFY_SOURCE=2 -fexceptions -fstack-protector-strong --param=ssp-buffer-size=4 -grecord-gcc-switches -specs=/usr/lib/rpm/redhat/redhat-hardened-cc1 -m64 -mtune=generic -D_GNU_SOURCE -fPIC -fwrapv -DNDEBUG -O2 -g -pipe -Wall -Werror=format-security -Wp,-D_FORTIFY_SOURCE=2 -fexceptions -fstack-protector-strong --param=ssp-buffer-size=4 -grecord-gcc-switches -specs=/usr/lib/rpm/redhat/redhat-hardened-cc1 -m64 -mtune=generic -D_GNU_SOURCE -fPIC -fwrapv -fPIC -I. -I/usr/include/python2.7 -c libvirt-override.c -o build/temp.linux-x86_64-2.7/libvirt-override.o libvirt-override.c:20:20: fatal error: Python.h: No such file or directory #include <Python.h> ^ compilation terminated. error: command 'gcc' failed with exit status 1 Build step 'Execute shell' marked build as failure
1 2
0 0
[Libvirt-ci] Build failed in Jenkins: libvirt-perl-master-build » libvirt-fedora-24 #104
by ci@centos.org 26 Oct '23

26 Oct '23
https://ci.centos.org/job/libvirt-perl-master-build/systems=libvirt-fedora-… Started by upstream project "libvirt-perl-master-build" build number 104 originally caused by: Started by upstream project "libvirt-master-build" build number 154 originally caused by: Started by an SCM change [EnvInject] - Loading node environment variables. Building remotely on libvirt-fedora-24 (libvirt) in workspace <https://ci.centos.org/job/libvirt-perl-master-build/systems=libvirt-fedora-…> Cloning the remote Git repository Cloning repository git://n64.pufty.ci.centos.org/libvirt-perl.git > git init <https://ci.centos.org/job/libvirt-perl-master-build/systems=libvirt-fedora-…> # timeout=10 Fetching upstream changes from git://n64.pufty.ci.centos.org/libvirt-perl.git > git --version # timeout=10 > git -c core.askpass=true fetch --tags --progress git://n64.pufty.ci.centos.org/libvirt-perl.git +refs/heads/*:refs/remotes/origin/* > git config remote.origin.url git://n64.pufty.ci.centos.org/libvirt-perl.git # timeout=10 > git config --add remote.origin.fetch +refs/heads/*:refs/remotes/origin/* # timeout=10 > git config remote.origin.url git://n64.pufty.ci.centos.org/libvirt-perl.git # timeout=10 Fetching upstream changes from git://n64.pufty.ci.centos.org/libvirt-perl.git > git -c core.askpass=true fetch --tags --progress git://n64.pufty.ci.centos.org/libvirt-perl.git +refs/heads/*:refs/remotes/origin/* Checking out Revision 9e68f99b38ceba387353e4069337eb4f76309e81 (refs/remotes/origin/master) > git config core.sparsecheckout # timeout=10 > git checkout -f 9e68f99b38ceba387353e4069337eb4f76309e81 First time build. Skipping changelog. Cleaning workspace > git rev-parse --verify HEAD # timeout=10 Resetting working tree > git reset --hard # timeout=10 > git clean -fdx # timeout=10 [libvirt-fedora-24] $ /bin/sh -xe /tmp/hudson1185764679703796015.sh + perl Makefile.PL PREFIX=/home/jenkins/build/libvirt Can't locate ExtUtils/MakeMaker.pm in @INC (you may need to install the ExtUtils::MakeMaker module) (@INC contains: /home/jenkins/build/libvirt/lib/perl5 /home/jenkins/build/libvirt/lib64/perl5 /usr/local/lib64/perl5 /usr/local/share/perl5 /usr/lib64/perl5/vendor_perl /usr/share/perl5/vendor_perl /usr/lib64/perl5 /usr/share/perl5 .) at Makefile.PL line 2. BEGIN failed--compilation aborted at Makefile.PL line 2. Build step 'Execute shell' marked build as failure
1 2
0 0
[Libvirt-ci] Jenkins build is back to normal : libvirt-master-build » libvirt-freebsd #154
by ci@centos.org 26 Oct '23

26 Oct '23
https://ci.centos.org/job/libvirt-master-build/systems=libvirt-freebsd/154/
1 0
0 0
[Libvirt-ci] Build failed in Jenkins: libvirt-master-build » libvirt-debian #152
by ci@centos.org 26 Oct '23

26 Oct '23
https://ci.centos.org/job/libvirt-master-build/systems=libvirt-debian/152/-… Started by upstream project "libvirt-master-build" build number 152 originally caused by: Started by an SCM change [EnvInject] - Loading node environment variables. Building remotely on libvirt-debian (libvirt) in workspace <https://ci.centos.org/job/libvirt-master-build/systems=libvirt-debian/ws/> > git rev-parse --is-inside-work-tree # timeout=10 Fetching changes from the remote Git repository > git config remote.origin.url git://n64.pufty.ci.centos.org/libvirt.git # timeout=10 Fetching upstream changes from git://n64.pufty.ci.centos.org/libvirt.git > git --version # timeout=10 > git -c core.askpass=true fetch --tags --progress git://n64.pufty.ci.centos.org/libvirt.git +refs/heads/*:refs/remotes/origin/* ERROR: Error fetching remote repo 'origin' hudson.plugins.git.GitException: Failed to fetch from git://n64.pufty.ci.centos.org/libvirt.git at hudson.plugins.git.GitSCM.fetchFrom(GitSCM.java:799) at hudson.plugins.git.GitSCM.retrieveChanges(GitSCM.java:1055) at hudson.plugins.git.GitSCM.checkout(GitSCM.java:1086) at hudson.scm.SCM.checkout(SCM.java:495) at hudson.model.AbstractProject.checkout(AbstractProject.java:1278) at hudson.model.AbstractBuild$AbstractBuildExecution.defaultCheckout(AbstractBuild.java:604) at jenkins.scm.SCMCheckoutStrategy.checkout(SCMCheckoutStrategy.java:86) at hudson.model.AbstractBuild$AbstractBuildExecution.run(AbstractBuild.java:529) at hudson.model.Run.execute(Run.java:1720) at hudson.matrix.MatrixRun.run(MatrixRun.java:146) at hudson.model.ResourceController.execute(ResourceController.java:98) at hudson.model.Executor.run(Executor.java:404) Caused by: hudson.plugins.git.GitException: Command "git -c core.askpass=true fetch --tags --progress git://n64.pufty.ci.centos.org/libvirt.git +refs/heads/*:refs/remotes/origin/*" returned status code 128: stdout: stderr: fatal: unable to connect to n64.pufty.ci.centos.org: n64.pufty.ci.centos.org: Name or service not known at org.jenkinsci.plugins.gitclient.CliGitAPIImpl.launchCommandIn(CliGitAPIImpl.java:1740) at org.jenkinsci.plugins.gitclient.CliGitAPIImpl.launchCommandWithCredentials(CliGitAPIImpl.java:1476) at org.jenkinsci.plugins.gitclient.CliGitAPIImpl.access$300(CliGitAPIImpl.java:63) at org.jenkinsci.plugins.gitclient.CliGitAPIImpl$1.execute(CliGitAPIImpl.java:314) at org.jenkinsci.plugins.gitclient.RemoteGitImpl$CommandInvocationHandler$1.call(RemoteGitImpl.java:152) at org.jenkinsci.plugins.gitclient.RemoteGitImpl$CommandInvocationHandler$1.call(RemoteGitImpl.java:145) at hudson.remoting.UserRequest.perform(UserRequest.java:121) at hudson.remoting.UserRequest.perform(UserRequest.java:49) at hudson.remoting.Request$2.run(Request.java:324) at hudson.remoting.InterceptingExecutorService$1.call(InterceptingExecutorService.java:68) at java.util.concurrent.FutureTask.run(FutureTask.java:262) at java.util.concurrent.ThreadPoolExecutor.runWorker(ThreadPoolExecutor.java:1145) at java.util.concurrent.ThreadPoolExecutor$Worker.run(ThreadPoolExecutor.java:615) at hudson.remoting.Engine$1$1.run(Engine.java:63) at java.lang.Thread.run(Thread.java:745) at ......remote call to libvirt-debian(Native Method) at hudson.remoting.Channel.attachCallSiteStackTrace(Channel.java:1433) at hudson.remoting.UserResponse.retrieve(UserRequest.java:253) at hudson.remoting.Channel.call(Channel.java:797) at org.jenkinsci.plugins.gitclient.RemoteGitImpl$CommandInvocationHandler.execute(RemoteGitImpl.java:145) at sun.reflect.GeneratedMethodAccessor410.invoke(Unknown Source) at sun.reflect.DelegatingMethodAccessorImpl.invoke(DelegatingMethodAccessorImpl.java:43) at java.lang.reflect.Method.invoke(Method.java:606) at org.jenkinsci.plugins.gitclient.RemoteGitImpl$CommandInvocationHandler.invoke(RemoteGitImpl.java:131) at com.sun.proxy.$Proxy73.execute(Unknown Source) at hudson.plugins.git.GitSCM.fetchFrom(GitSCM.java:797) ... 11 more ERROR: null
1 1
0 0
  • ← Newer
  • 1
  • ...
  • 517
  • 518
  • 519
  • 520
  • 521
  • 522
  • 523
  • ...
  • 1021
  • Older →

HyperKitty Powered by HyperKitty version 1.3.12.