CI
Threads by month
- ----- 2026 -----
- September
- August
- July
- June
- May
- April
- March
- February
- January
- ----- 2025 -----
- December
- November
- October
- September
- August
- July
- June
- May
- April
- March
- February
- January
- ----- 2024 -----
- December
- November
- October
- September
- August
- July
- June
- May
- April
- March
- February
- January
- ----- 2023 -----
- December
- November
- October
- September
- August
- July
- June
- May
- April
- March
- February
- January
- ----- 2022 -----
- December
- November
- October
- September
- August
- July
- June
- May
- April
- March
- February
- January
- ----- 2021 -----
- December
- November
- October
- September
- August
- July
- June
- May
- April
- March
- February
- January
- ----- 2020 -----
- December
- November
- October
- September
- August
- July
- June
- May
- April
- March
- February
- January
- ----- 2019 -----
- December
- November
- October
- September
- August
- July
- June
- May
- April
- March
- February
- January
- ----- 2018 -----
- December
- November
- October
- September
- August
- July
- June
- May
- April
- March
- February
- January
- ----- 2017 -----
- December
- November
- October
- September
- August
- July
- June
- May
- April
- March
- February
- January
- ----- 2016 -----
- December
- November
- October
- September
- August
- July
- 2 participants
- 10209 discussions
[Libvirt-ci] Build failed in Jenkins: libvirt-master-mingw » libvirt-fedora-rawhide #1086
by ci@centos.org 26 Oct '23
by ci@centos.org 26 Oct '23
26 Oct '23
See <https://ci.centos.org/job/libvirt-master-mingw/systems=libvirt-fedora-rawhi…>
Changes:
[mkletzan] tests: Add virfilewrapper -- the new super "mock"
[mkletzan] util: Remove virsysfs and instead enhance virFileReadValue* functions
[mkletzan] tests: Test vircaps2xmldata XMLs in virschematest
[mkletzan] tests: Add missing cache data for vircaps2xmltest
[mkletzan] Add host cache information in capabilities
[mkletzan] Init host cache info in drivers
[mkletzan] tests: Add support for more complicated hierarchies in vircaps2xmltest
[mkletzan] tests: Add resctrl test for vircaps2xmltest
------------------------------------------
[...truncated 127.04 KB...]
CC fseeko.lo
CC fstat.lo
CC fsync.lo
CC gai_strerror.lo
CC getcwd-lgpl.lo
CC getdelim.lo
CC getdtablesize.lo
CC getgroups.lo
CC gethostname.lo
CC getline.lo
CC getopt.lo
CC getopt1.lo
CC getpass.lo
CC getpeername.lo
CC getsockname.lo
CC gettimeofday.lo
CC inet_ntop.lo
CC inet_pton.lo
CC ioctl.lo
CC isatty.lo
CC listen.lo
CC localeconv.lo
CC lseek.lo
CC malloc.lo
CC mbrtowc.lo
CC mbsinit.lo
CC mbsrtowcs.lo
CC mbsrtowcs-state.lo
CC memchr.lo
CC mkdtemp.lo
CC mkostemp.lo
CC mkostemps.lo
CC mktime.lo
CC msvc-inval.lo
CC msvc-nothrow.lo
CC nl_langinfo.lo
CC open.lo
CC openpty.lo
CC perror.lo
CC pipe.lo
CC poll.lo
CC posix_openpt.lo
CC printf-args.lo
CC printf-parse.lo
CC pthread_sigmask.lo
CC raise.lo
CC random_r.lo
CC rawmemchr.lo
CC readlink.lo
CC realloc.lo
CC recv.lo
CC regex.lo
CC secure_getenv.lo
CC select.lo
CC send.lo
CC setenv.lo
CC setsockopt.lo
CC sigaction.lo
CC sigprocmask.lo
CC sleep.lo
CC snprintf.lo
CC socket.lo
CC stat.lo
CC stdio-read.lo
CC stdio-write.lo
CC stpcpy.lo
CC strchrnul.lo
CC strdup.lo
CC strerror.lo
CC strerror-override.lo
CC strerror_r.lo
CC strndup.lo
CC strptime.lo
CC strsep.lo
CC time_r.lo
CC timegm.lo
CC ttyname_r.lo
CC uname.lo
CC unsetenv.lo
CC usleep.lo
CC vasnprintf.lo
CC vsnprintf.lo
CC waitpid.lo
GEN charset.alias
GEN ref-add.sed
GEN ref-del.sed
CC glthread/lock.lo
CCLD libgnu.la
make[3]: Leaving directory '<https://ci.centos.org/job/libvirt-master-mingw/systems=libvirt-fedora-rawhi…'>
make[2]: Leaving directory '<https://ci.centos.org/job/libvirt-master-mingw/systems=libvirt-fedora-rawhi…'>
Making all in include/libvirt
make[2]: Entering directory '<https://ci.centos.org/job/libvirt-master-mingw/systems=libvirt-fedora-rawhi…'>
make[2]: Nothing to be done for 'all'.
make[2]: Leaving directory '<https://ci.centos.org/job/libvirt-master-mingw/systems=libvirt-fedora-rawhi…'>
Making all in src
make[2]: Entering directory '<https://ci.centos.org/job/libvirt-master-mingw/systems=libvirt-fedora-rawhi…'>
GEN util/virkeycodetable_osx.h
GEN util/virkeycodetable_linux.h
GEN util/virkeycodetable_atset1.h
GEN util/virkeycodetable_atset2.h
GEN util/virkeycodetable_atset3.h
GEN util/virkeycodetable_xt.h
GEN util/virkeycodetable_xtkbd.h
GEN util/virkeycodetable_usb.h
GEN util/virkeycodetable_win32.h
GEN util/virkeycodetable_rfb.h
GEN util/virkeynametable_linux.h
GEN util/virkeynametable_osx.h
GEN util/virkeynametable_win32.h
GEN locking/lock_protocol.h
GEN locking/lock_daemon_dispatch_stubs.h
GEN logging/log_protocol.h
GEN logging/log_daemon_dispatch_stubs.h
GEN admin/admin_protocol.h
GEN admin/admin_client.h
GEN lxc/lxc_monitor_protocol.h
GEN lxc/lxc_monitor_dispatch.h
GEN lxc/lxc_controller_dispatch.h
GEN remote/remote_protocol.h
GEN remote/remote_client_bodies.h
GEN remote/lxc_protocol.h
GEN remote/lxc_client_bodies.h
GEN remote/qemu_protocol.h
GEN remote/qemu_client_bodies.h
GEN .esx_vi_generator.stamp
GEN .hyperv_wmi_generator.stamp
GEN access/viraccessapicheck.h
GEN ../../src/esx/esx_vi_types.generated.typedef
GEN ../../src/esx/esx_vi_types.generated.typeenum
GEN ../../src/esx/esx_vi_types.generated.typetostring
GEN ../../src/esx/esx_vi_types.generated.typefromstring
GEN ../../src/esx/esx_vi_types.generated.h
GEN ../../src/esx/esx_vi_types.generated.c
GEN ../../src/esx/esx_vi_methods.generated.h
GEN ../../src/esx/esx_vi_methods.generated.c
GEN ../../src/esx/esx_vi_methods.generated.macro
GEN ../../src/esx/esx_vi.generated.h
GEN ../../src/esx/esx_vi.generated.c
GEN ../../src/hyperv/hyperv_wmi_classes.generated.typedef
GEN ../../src/hyperv/hyperv_wmi_classes.generated.h
GEN ../../src/hyperv/hyperv_wmi_classes.generated.c
GEN access/viraccessapicheck.c
GEN access/viraccessapicheckqemu.h
GEN access/viraccessapicheckqemu.c
GEN access/viraccessapichecklxc.h
GEN access/viraccessapichecklxc.c
GEN libvirt_access.xml
GEN libvirt_access_qemu.xml
GEN libvirt_access_lxc.xml
GEN libvirt_access.syms
GEN libvirt_access_qemu.syms
GEN libvirt_access_lxc.syms
GEN libvirt_qemu.def
GEN libvirt_lxc.def
GEN libvirt_admin.syms
GEN rpc/virnetprotocol.h
GEN rpc/virkeepaliveprotocol.h
GEN locking/lock_protocol.c
GEN logging/log_protocol.c
GEN admin/admin_protocol.c
GEN lxc/lxc_monitor_protocol.c
GEN remote/remote_protocol.c
GEN remote/lxc_protocol.c
GEN remote/qemu_protocol.c
GEN libvirt.syms
GEN libvirt_admin.def
GEN rpc/virnetprotocol.c
GEN rpc/virkeepaliveprotocol.c
GEN libvirt.def
make all-am
make[3]: Entering directory '<https://ci.centos.org/job/libvirt-master-mingw/systems=libvirt-fedora-rawhi…'>
CC libvirt_driver_la-driver.lo
CC libvirt_driver_la-datatypes.lo
CC libvirt_driver_la-libvirt.lo
CC libvirt_driver_la-libvirt-domain.lo
CC libvirt_driver_la-libvirt-domain-snapshot.lo
CC libvirt_driver_la-libvirt-host.lo
CC libvirt_driver_la-libvirt-interface.lo
CC libvirt_driver_la-libvirt-network.lo
CC libvirt_driver_la-libvirt-nodedev.lo
CC libvirt_driver_la-libvirt-nwfilter.lo
CC libvirt_driver_la-libvirt-secret.lo
CC libvirt_driver_la-libvirt-storage.lo
CC libvirt_driver_la-libvirt-stream.lo
CC libvirt_qemu_la-libvirt-qemu.lo
CC libvirt_lxc_la-libvirt-lxc.lo
CC libvirt_admin_la-libvirt-admin.lo
CC libvirt_admin_la-datatypes.lo
GEN util/virkeycode-linux.pod
GEN util/virkeycode-osx.pod
GEN util/virkeycode-atset1.pod
GEN util/virkeycode-atset2.pod
GEN util/virkeycode-atset3.pod
GEN util/virkeycode-xt.pod
GEN util/virkeycode-xtkbd.pod
GEN util/virkeycode-usb.pod
GEN util/virkeycode-win32.pod
GEN util/virkeycode-rfb.pod
GEN util/virkeyname-linux.pod
GEN util/virkeyname-osx.pod
GEN util/virkeyname-win32.pod
CC util/libvirt_util_la-viralloc.lo
CC util/libvirt_util_la-virarch.lo
CC util/libvirt_util_la-viratomic.lo
CC util/libvirt_util_la-viraudit.lo
CC util/libvirt_util_la-virauth.lo
CC util/libvirt_util_la-virauthconfig.lo
CC util/libvirt_util_la-virbitmap.lo
CC util/libvirt_util_la-virbuffer.lo
CC util/libvirt_util_la-virperf.lo
CC util/libvirt_util_la-vircgroup.lo
CC util/libvirt_util_la-virclosecallbacks.lo
CC util/libvirt_util_la-vircommand.lo
CC util/libvirt_util_la-virconf.lo
CC util/libvirt_util_la-vircrypto.lo
CC util/libvirt_util_la-virdbus.lo
CC util/libvirt_util_la-virdnsmasq.lo
CC util/libvirt_util_la-virebtables.lo
CC util/libvirt_util_la-virerror.lo
CC util/libvirt_util_la-virevent.lo
CC util/libvirt_util_la-vireventpoll.lo
CC util/libvirt_util_la-virfdstream.lo
CC util/libvirt_util_la-virfile.lo
CC util/libvirt_util_la-virfirewall.lo
CC util/libvirt_util_la-virfirmware.lo
CC util/libvirt_util_la-virgettext.lo
CC util/libvirt_util_la-virgic.lo
CC util/libvirt_util_la-virhash.lo
CC util/libvirt_util_la-virhashcode.lo
CC util/libvirt_util_la-virhook.lo
CC util/libvirt_util_la-virhostcpu.lo
CC util/libvirt_util_la-virhostdev.lo
CC util/libvirt_util_la-virhostmem.lo
../../src/util/virhostcpu.c: In function 'virHostCPUGetOnline':
../../src/util/virhostcpu.c:877:36: error: 'SYSFS_SYSTEM_PATH' undeclared (first use in this function); did you mean 'SOUND_SYSTEM_FAULT'?
SYSFS_SYSTEM_PATH, cpu);
^~~~~~~~~~~~~~~~~
SOUND_SYSTEM_FAULT
../../src/util/virhostcpu.c:877:36: note: each undeclared identifier is reported only once for each function it appears in
make[3]: *** [Makefile:10435: util/libvirt_util_la-virhostcpu.lo] Error 1
make[3]: *** Waiting for unfinished jobs....
rm util/virkeycode-xtkbd.pod util/virkeycode-atset3.pod util/virkeycode-usb.pod util/virkeycode-xt.pod util/virkeycode-win32.pod util/virkeyname-linux.pod util/virkeycode-osx.pod util/virkeycode-linux.pod util/virkeyname-osx.pod util/virkeycode-atset1.pod util/virkeycode-rfb.pod util/virkeyname-win32.pod util/virkeycode-atset2.pod
make[3]: Leaving directory '<https://ci.centos.org/job/libvirt-master-mingw/systems=libvirt-fedora-rawhi…'>
make[2]: *** [Makefile:5918: all] Error 2
make[2]: Leaving directory '<https://ci.centos.org/job/libvirt-master-mingw/systems=libvirt-fedora-rawhi…'>
make[1]: *** [Makefile:2089: all-recursive] Error 1
make[1]: Leaving directory '<https://ci.centos.org/job/libvirt-master-mingw/systems=libvirt-fedora-rawhi…'>
make: *** [Makefile:1982: all] Error 2
Build step 'Execute shell' marked build as failure
1
9
[Libvirt-ci] Build failed in Jenkins: libvirt-master-rpm » libvirt-fedora-rawhide #358
by ci@centos.org 26 Oct '23
by ci@centos.org 26 Oct '23
26 Oct '23
See <https://ci.centos.org/job/libvirt-master-rpm/systems=libvirt-fedora-rawhide…>
------------------------------------------
[...truncated 304.93 KB...]
installing ne.gmo as /home/jenkins/rpmbuild/BUILDROOT/libvirt-3.4.0-1.fc26.x86_64/usr/share/locale/ne/LC_MESSAGES/libvirt.mo
installing nl.gmo as /home/jenkins/rpmbuild/BUILDROOT/libvirt-3.4.0-1.fc26.x86_64/usr/share/locale/nl/LC_MESSAGES/libvirt.mo
installing nn.gmo as /home/jenkins/rpmbuild/BUILDROOT/libvirt-3.4.0-1.fc26.x86_64/usr/share/locale/nn/LC_MESSAGES/libvirt.mo
installing nso.gmo as /home/jenkins/rpmbuild/BUILDROOT/libvirt-3.4.0-1.fc26.x86_64/usr/share/locale/nso/LC_MESSAGES/libvirt.mo
installing or.gmo as /home/jenkins/rpmbuild/BUILDROOT/libvirt-3.4.0-1.fc26.x86_64/usr/share/locale/or/LC_MESSAGES/libvirt.mo
installing pa.gmo as /home/jenkins/rpmbuild/BUILDROOT/libvirt-3.4.0-1.fc26.x86_64/usr/share/locale/pa/LC_MESSAGES/libvirt.mo
installing pl.gmo as /home/jenkins/rpmbuild/BUILDROOT/libvirt-3.4.0-1.fc26.x86_64/usr/share/locale/pl/LC_MESSAGES/libvirt.mo
installing pt.gmo as /home/jenkins/rpmbuild/BUILDROOT/libvirt-3.4.0-1.fc26.x86_64/usr/share/locale/pt/LC_MESSAGES/libvirt.mo
installing pt_BR.gmo as /home/jenkins/rpmbuild/BUILDROOT/libvirt-3.4.0-1.fc26.x86_64/usr/share/locale/pt_BR/LC_MESSAGES/libvirt.mo
installing ro.gmo as /home/jenkins/rpmbuild/BUILDROOT/libvirt-3.4.0-1.fc26.x86_64/usr/share/locale/ro/LC_MESSAGES/libvirt.mo
installing ru.gmo as /home/jenkins/rpmbuild/BUILDROOT/libvirt-3.4.0-1.fc26.x86_64/usr/share/locale/ru/LC_MESSAGES/libvirt.mo
installing si.gmo as /home/jenkins/rpmbuild/BUILDROOT/libvirt-3.4.0-1.fc26.x86_64/usr/share/locale/si/LC_MESSAGES/libvirt.mo
installing sk.gmo as /home/jenkins/rpmbuild/BUILDROOT/libvirt-3.4.0-1.fc26.x86_64/usr/share/locale/sk/LC_MESSAGES/libvirt.mo
installing sl.gmo as /home/jenkins/rpmbuild/BUILDROOT/libvirt-3.4.0-1.fc26.x86_64/usr/share/locale/sl/LC_MESSAGES/libvirt.mo
installing sq.gmo as /home/jenkins/rpmbuild/BUILDROOT/libvirt-3.4.0-1.fc26.x86_64/usr/share/locale/sq/LC_MESSAGES/libvirt.mo
installing sr.gmo as /home/jenkins/rpmbuild/BUILDROOT/libvirt-3.4.0-1.fc26.x86_64/usr/share/locale/sr/LC_MESSAGES/libvirt.mo
installing sr(a)latin.gmo as /home/jenkins/rpmbuild/BUILDROOT/libvirt-3.4.0-1.fc26.x86_64/usr/share/locale/sr(a)latin/LC_MESSAGES/libvirt.mo
installing sv.gmo as /home/jenkins/rpmbuild/BUILDROOT/libvirt-3.4.0-1.fc26.x86_64/usr/share/locale/sv/LC_MESSAGES/libvirt.mo
installing ta.gmo as /home/jenkins/rpmbuild/BUILDROOT/libvirt-3.4.0-1.fc26.x86_64/usr/share/locale/ta/LC_MESSAGES/libvirt.mo
installing te.gmo as /home/jenkins/rpmbuild/BUILDROOT/libvirt-3.4.0-1.fc26.x86_64/usr/share/locale/te/LC_MESSAGES/libvirt.mo
installing tg.gmo as /home/jenkins/rpmbuild/BUILDROOT/libvirt-3.4.0-1.fc26.x86_64/usr/share/locale/tg/LC_MESSAGES/libvirt.mo
installing th.gmo as /home/jenkins/rpmbuild/BUILDROOT/libvirt-3.4.0-1.fc26.x86_64/usr/share/locale/th/LC_MESSAGES/libvirt.mo
installing tr.gmo as /home/jenkins/rpmbuild/BUILDROOT/libvirt-3.4.0-1.fc26.x86_64/usr/share/locale/tr/LC_MESSAGES/libvirt.mo
installing tw.gmo as /home/jenkins/rpmbuild/BUILDROOT/libvirt-3.4.0-1.fc26.x86_64/usr/share/locale/tw/LC_MESSAGES/libvirt.mo
installing uk.gmo as /home/jenkins/rpmbuild/BUILDROOT/libvirt-3.4.0-1.fc26.x86_64/usr/share/locale/uk/LC_MESSAGES/libvirt.mo
installing ur.gmo as /home/jenkins/rpmbuild/BUILDROOT/libvirt-3.4.0-1.fc26.x86_64/usr/share/locale/ur/LC_MESSAGES/libvirt.mo
installing vi.gmo as /home/jenkins/rpmbuild/BUILDROOT/libvirt-3.4.0-1.fc26.x86_64/usr/share/locale/vi/LC_MESSAGES/libvirt.mo
installing wba.gmo as /home/jenkins/rpmbuild/BUILDROOT/libvirt-3.4.0-1.fc26.x86_64/usr/share/locale/wba/LC_MESSAGES/libvirt.mo
installing yo.gmo as /home/jenkins/rpmbuild/BUILDROOT/libvirt-3.4.0-1.fc26.x86_64/usr/share/locale/yo/LC_MESSAGES/libvirt.mo
installing zh_CN.gmo as /home/jenkins/rpmbuild/BUILDROOT/libvirt-3.4.0-1.fc26.x86_64/usr/share/locale/zh_CN/LC_MESSAGES/libvirt.mo
installing zh_HK.gmo as /home/jenkins/rpmbuild/BUILDROOT/libvirt-3.4.0-1.fc26.x86_64/usr/share/locale/zh_HK/LC_MESSAGES/libvirt.mo
installing zh_TW.gmo as /home/jenkins/rpmbuild/BUILDROOT/libvirt-3.4.0-1.fc26.x86_64/usr/share/locale/zh_TW/LC_MESSAGES/libvirt.mo
installing zu.gmo as /home/jenkins/rpmbuild/BUILDROOT/libvirt-3.4.0-1.fc26.x86_64/usr/share/locale/zu/LC_MESSAGES/libvirt.mo
if test "libvirt" = "gettext-tools"; then \
/usr/bin/mkdir -p /home/jenkins/rpmbuild/BUILDROOT/libvirt-3.4.0-1.fc26.x86_64/usr/share/gettext/po; \
for file in Makefile.in.in remove-potcdate.sin quot.sed boldquot.sed en(a)quot.header en(a)boldquot.header insert-header.sin Rules-quot Makevars.template; do \
/usr/bin/install -c -m 644 ./$file \
/home/jenkins/rpmbuild/BUILDROOT/libvirt-3.4.0-1.fc26.x86_64/usr/share/gettext/po/$file; \
done; \
for file in Makevars; do \
rm -f /home/jenkins/rpmbuild/BUILDROOT/libvirt-3.4.0-1.fc26.x86_64/usr/share/gettext/po/$file; \
done; \
else \
: ; \
fi
make[1]: Leaving directory '/home/jenkins/rpmbuild/BUILD/libvirt-3.4.0/po'
Making install in examples
make[1]: Entering directory '/home/jenkins/rpmbuild/BUILD/libvirt-3.4.0/examples'
make[2]: Entering directory '/home/jenkins/rpmbuild/BUILD/libvirt-3.4.0/examples'
make[2]: Nothing to be done for 'install-exec-am'.
/usr/bin/mkdir -p ""/home/jenkins/rpmbuild/BUILDROOT/libvirt-3.4.0-1.fc26.x86_64/etc/libvirt/nwfilter""
for f in ./xml/nwfilter/qemu-announce-self.xml ./xml/nwfilter/no-ip-multicast.xml ./xml/nwfilter/no-ip-spoofing.xml ./xml/nwfilter/no-mac-spoofing.xml ./xml/nwfilter/allow-dhcp.xml ./xml/nwfilter/no-arp-spoofing.xml ./xml/nwfilter/clean-traffic.xml ./xml/nwfilter/no-arp-ip-spoofing.xml ./xml/nwfilter/allow-arp.xml ./xml/nwfilter/no-arp-mac-spoofing.xml ./xml/nwfilter/allow-ipv4.xml ./xml/nwfilter/no-other-l2-traffic.xml ./xml/nwfilter/allow-incoming-ipv4.xml ./xml/nwfilter/no-mac-broadcast.xml ./xml/nwfilter/allow-dhcp-server.xml ./xml/nwfilter/qemu-announce-self-rarp.xml ./xml/nwfilter/no-other-rarp-traffic.xml; do \
/usr/bin/install -c -m 644 $f ""/home/jenkins/rpmbuild/BUILDROOT/libvirt-3.4.0-1.fc26.x86_64/etc/libvirt/nwfilter""; \
done
make[2]: Leaving directory '/home/jenkins/rpmbuild/BUILD/libvirt-3.4.0/examples'
make[1]: Leaving directory '/home/jenkins/rpmbuild/BUILD/libvirt-3.4.0/examples'
+ make -j2 -C examples distclean
make: Entering directory '/home/jenkins/rpmbuild/BUILD/libvirt-3.4.0/examples'
rm -rf .libs _libs
rm -rf admin/.libs admin/_libs
rm -f dominfo/info1 dommigrate/dommigrate domsuspend/suspend domtop/domtop hellolibvirt/hellolibvirt object-events/event-test openauth/openauth rename/rename admin/list_servers admin/list_clients admin/threadpool_params admin/client_limits admin/client_info admin/client_close admin/logging
rm -rf dominfo/.libs dominfo/_libs
rm -rf dommigrate/.libs dommigrate/_libs
rm -f *.o
rm -rf domsuspend/.libs domsuspend/_libs
rm -rf domtop/.libs domtop/_libs
rm -f admin/*.o
rm -rf hellolibvirt/.libs hellolibvirt/_libs
rm -rf object-events/.libs object-events/_libs
rm -rf openauth/.libs openauth/_libs
rm -f dominfo/*.o
rm -rf rename/.libs rename/_libs
rm -f *.lo
rm -f dommigrate/*.o
rm -f *.tab.c
rm -f domsuspend/*.o
test -z "" || rm -f
rm -f domtop/*.o
test . = "." || test -z "" || rm -f
rm -f admin/.deps/.dirstamp
rm -f hellolibvirt/*.o
rm -f admin/.dirstamp
rm -f dominfo/.deps/.dirstamp
rm -f dominfo/.dirstamp
rm -f object-events/*.o
rm -f dommigrate/.deps/.dirstamp
rm -f dommigrate/.dirstamp
rm -f domsuspend/.deps/.dirstamp
rm -f openauth/*.o
rm -f domsuspend/.dirstamp
rm -f domtop/.deps/.dirstamp
rm -f domtop/.dirstamp
rm -f rename/*.o
rm -f hellolibvirt/.deps/.dirstamp
rm -f hellolibvirt/.dirstamp
rm -f object-events/.deps/.dirstamp
rm -f TAGS ID GTAGS GRTAGS GSYMS GPATH tags
rm -f object-events/.dirstamp
rm -f openauth/.deps/.dirstamp
rm -f openauth/.dirstamp
rm -f rename/.deps/.dirstamp
rm -f rename/.dirstamp
rm -rf admin/.deps dominfo/.deps dommigrate/.deps domsuspend/.deps domtop/.deps hellolibvirt/.deps object-events/.deps openauth/.deps rename/.deps
rm -f Makefile
make: Leaving directory '/home/jenkins/rpmbuild/BUILD/libvirt-3.4.0/examples'
+ rm -f /home/jenkins/rpmbuild/BUILDROOT/libvirt-3.4.0-1.fc26.x86_64/usr/lib64/libnss_libvirt.la /home/jenkins/rpmbuild/BUILDROOT/libvirt-3.4.0-1.fc26.x86_64/usr/lib64/libnss_libvirt_guest.la /home/jenkins/rpmbuild/BUILDROOT/libvirt-3.4.0-1.fc26.x86_64/usr/lib64/libvirt-admin.la /home/jenkins/rpmbuild/BUILDROOT/libvirt-3.4.0-1.fc26.x86_64/usr/lib64/libvirt-lxc.la /home/jenkins/rpmbuild/BUILDROOT/libvirt-3.4.0-1.fc26.x86_64/usr/lib64/libvirt-qemu.la /home/jenkins/rpmbuild/BUILDROOT/libvirt-3.4.0-1.fc26.x86_64/usr/lib64/libvirt.la
+ rm -f '/home/jenkins/rpmbuild/BUILDROOT/libvirt-3.4.0-1.fc26.x86_64/usr/lib64/*.a'
+ rm -f /home/jenkins/rpmbuild/BUILDROOT/libvirt-3.4.0-1.fc26.x86_64/usr/lib64/libvirt/lock-driver/lockd.la /home/jenkins/rpmbuild/BUILDROOT/libvirt-3.4.0-1.fc26.x86_64/usr/lib64/libvirt/lock-driver/sanlock.la
+ rm -f '/home/jenkins/rpmbuild/BUILDROOT/libvirt-3.4.0-1.fc26.x86_64/usr/lib64/libvirt/lock-driver/*.a'
+ rm -f /home/jenkins/rpmbuild/BUILDROOT/libvirt-3.4.0-1.fc26.x86_64/usr/lib64/libvirt/connection-driver/libvirt_driver_interface.la /home/jenkins/rpmbuild/BUILDROOT/libvirt-3.4.0-1.fc26.x86_64/usr/lib64/libvirt/connection-driver/libvirt_driver_libxl.la /home/jenkins/rpmbuild/BUILDROOT/libvirt-3.4.0-1.fc26.x86_64/usr/lib64/libvirt/connection-driver/libvirt_driver_lxc.la /home/jenkins/rpmbuild/BUILDROOT/libvirt-3.4.0-1.fc26.x86_64/usr/lib64/libvirt/connection-driver/libvirt_driver_network.la /home/jenkins/rpmbuild/BUILDROOT/libvirt-3.4.0-1.fc26.x86_64/usr/lib64/libvirt/connection-driver/libvirt_driver_nodedev.la /home/jenkins/rpmbuild/BUILDROOT/libvirt-3.4.0-1.fc26.x86_64/usr/lib64/libvirt/connection-driver/libvirt_driver_nwfilter.la /home/jenkins/rpmbuild/BUILDROOT/libvirt-3.4.0-1.fc26.x86_64/usr/lib64/libvirt/connection-driver/libvirt_driver_qemu.la /home/jenkins/rpmbuild/BUILDROOT/libvirt-3.4.0-1.fc26.x86_64/usr/lib64/libvirt/connection-driver/libvirt_driver_secret.la /home/jenkins/rpmbuild/BUILDROOT/libvirt-3.4.0-1.fc26.x86_64/usr/lib64/libvirt/connection-driver/libvirt_driver_storage.la /home/jenkins/rpmbuild/BUILDROOT/libvirt-3.4.0-1.fc26.x86_64/usr/lib64/libvirt/connection-driver/libvirt_driver_uml.la /home/jenkins/rpmbuild/BUILDROOT/libvirt-3.4.0-1.fc26.x86_64/usr/lib64/libvirt/connection-driver/libvirt_driver_vbox.la /home/jenkins/rpmbuild/BUILDROOT/libvirt-3.4.0-1.fc26.x86_64/usr/lib64/libvirt/connection-driver/libvirt_driver_xen.la
+ rm -f '/home/jenkins/rpmbuild/BUILDROOT/libvirt-3.4.0-1.fc26.x86_64/usr/lib64/libvirt/connection-driver/*.a'
+ rm -f /home/jenkins/rpmbuild/BUILDROOT/libvirt-3.4.0-1.fc26.x86_64/usr/lib64/libvirt/storage-backend/libvirt_storage_backend_disk.la /home/jenkins/rpmbuild/BUILDROOT/libvirt-3.4.0-1.fc26.x86_64/usr/lib64/libvirt/storage-backend/libvirt_storage_backend_fs.la /home/jenkins/rpmbuild/BUILDROOT/libvirt-3.4.0-1.fc26.x86_64/usr/lib64/libvirt/storage-backend/libvirt_storage_backend_gluster.la /home/jenkins/rpmbuild/BUILDROOT/libvirt-3.4.0-1.fc26.x86_64/usr/lib64/libvirt/storage-backend/libvirt_storage_backend_iscsi.la /home/jenkins/rpmbuild/BUILDROOT/libvirt-3.4.0-1.fc26.x86_64/usr/lib64/libvirt/storage-backend/libvirt_storage_backend_logical.la /home/jenkins/rpmbuild/BUILDROOT/libvirt-3.4.0-1.fc26.x86_64/usr/lib64/libvirt/storage-backend/libvirt_storage_backend_mpath.la /home/jenkins/rpmbuild/BUILDROOT/libvirt-3.4.0-1.fc26.x86_64/usr/lib64/libvirt/storage-backend/libvirt_storage_backend_rbd.la /home/jenkins/rpmbuild/BUILDROOT/libvirt-3.4.0-1.fc26.x86_64/usr/lib64/libvirt/storage-backend/libvirt_storage_backend_scsi.la /home/jenkins/rpmbuild/BUILDROOT/libvirt-3.4.0-1.fc26.x86_64/usr/lib64/libvirt/storage-backend/libvirt_storage_backend_sheepdog.la
+ rm -f '/home/jenkins/rpmbuild/BUILDROOT/libvirt-3.4.0-1.fc26.x86_64/usr/lib64/libvirt/storage-backend/*.a'
+ rm -f /home/jenkins/rpmbuild/BUILDROOT/libvirt-3.4.0-1.fc26.x86_64/usr/lib64/wireshark/plugins/libvirt.la
+ install -d -m 0755 /home/jenkins/rpmbuild/BUILDROOT/libvirt-3.4.0-1.fc26.x86_64/usr/share/lib/libvirt/dnsmasq/
+ install -d -m 0755 /home/jenkins/rpmbuild/BUILDROOT/libvirt-3.4.0-1.fc26.x86_64/usr/share/libvirt/networks/
+ cp /home/jenkins/rpmbuild/BUILDROOT/libvirt-3.4.0-1.fc26.x86_64/etc/libvirt/qemu/networks/default.xml /home/jenkins/rpmbuild/BUILDROOT/libvirt-3.4.0-1.fc26.x86_64/usr/share/libvirt/networks/default.xml
+ rm -f /home/jenkins/rpmbuild/BUILDROOT/libvirt-3.4.0-1.fc26.x86_64/etc/libvirt/qemu/networks/default.xml
+ rm -f /home/jenkins/rpmbuild/BUILDROOT/libvirt-3.4.0-1.fc26.x86_64/etc/libvirt/qemu/networks/autostart/default.xml
+ install -d -m 0755 /home/jenkins/rpmbuild/BUILDROOT/libvirt-3.4.0-1.fc26.x86_64/usr/share/libvirt/nwfilter/
+ cp -a /home/jenkins/rpmbuild/BUILDROOT/libvirt-3.4.0-1.fc26.x86_64/etc/libvirt/nwfilter/allow-arp.xml /home/jenkins/rpmbuild/BUILDROOT/libvirt-3.4.0-1.fc26.x86_64/etc/libvirt/nwfilter/allow-dhcp-server.xml /home/jenkins/rpmbuild/BUILDROOT/libvirt-3.4.0-1.fc26.x86_64/etc/libvirt/nwfilter/allow-dhcp.xml /home/jenkins/rpmbuild/BUILDROOT/libvirt-3.4.0-1.fc26.x86_64/etc/libvirt/nwfilter/allow-incoming-ipv4.xml /home/jenkins/rpmbuild/BUILDROOT/libvirt-3.4.0-1.fc26.x86_64/etc/libvirt/nwfilter/allow-ipv4.xml /home/jenkins/rpmbuild/BUILDROOT/libvirt-3.4.0-1.fc26.x86_64/etc/libvirt/nwfilter/clean-traffic.xml /home/jenkins/rpmbuild/BUILDROOT/libvirt-3.4.0-1.fc26.x86_64/etc/libvirt/nwfilter/no-arp-ip-spoofing.xml /home/jenkins/rpmbuild/BUILDROOT/libvirt-3.4.0-1.fc26.x86_64/etc/libvirt/nwfilter/no-arp-mac-spoofing.xml /home/jenkins/rpmbuild/BUILDROOT/libvirt-3.4.0-1.fc26.x86_64/etc/libvirt/nwfilter/no-arp-spoofing.xml /home/jenkins/rpmbuild/BUILDROOT/libvirt-3.4.0-1.fc26.x86_64/etc/libvirt/nwfilter/no-ip-multicast.xml /home/jenkins/rpmbuild/BUILDROOT/libvirt-3.4.0-1.fc26.x86_64/etc/libvirt/nwfilter/no-ip-spoofing.xml /home/jenkins/rpmbuild/BUILDROOT/libvirt-3.4.0-1.fc26.x86_64/etc/libvirt/nwfilter/no-mac-broadcast.xml /home/jenkins/rpmbuild/BUILDROOT/libvirt-3.4.0-1.fc26.x86_64/etc/libvirt/nwfilter/no-mac-spoofing.xml /home/jenkins/rpmbuild/BUILDROOT/libvirt-3.4.0-1.fc26.x86_64/etc/libvirt/nwfilter/no-other-l2-traffic.xml /home/jenkins/rpmbuild/BUILDROOT/libvirt-3.4.0-1.fc26.x86_64/etc/libvirt/nwfilter/no-other-rarp-traffic.xml /home/jenkins/rpmbuild/BUILDROOT/libvirt-3.4.0-1.fc26.x86_64/etc/libvirt/nwfilter/qemu-announce-self-rarp.xml /home/jenkins/rpmbuild/BUILDROOT/libvirt-3.4.0-1.fc26.x86_64/etc/libvirt/nwfilter/qemu-announce-self.xml /home/jenkins/rpmbuild/BUILDROOT/libvirt-3.4.0-1.fc26.x86_64/usr/share/libvirt/nwfilter/
+ sed -i -e '/<uuid>/d' /home/jenkins/rpmbuild/BUILDROOT/libvirt-3.4.0-1.fc26.x86_64/usr/share/libvirt/networks/default.xml
+ /usr/lib/rpm/find-lang.sh /home/jenkins/rpmbuild/BUILDROOT/libvirt-3.4.0-1.fc26.x86_64 libvirt
+ mv /home/jenkins/rpmbuild/BUILDROOT/libvirt-3.4.0-1.fc26.x86_64/usr/share/doc/libvirt-3.4.0 libvirt-docs
+ mv /home/jenkins/rpmbuild/BUILDROOT/libvirt-3.4.0-1.fc26.x86_64/usr/share/systemtap/tapset/libvirt_probes.stp /home/jenkins/rpmbuild/BUILDROOT/libvirt-3.4.0-1.fc26.x86_64/usr/share/systemtap/tapset/libvirt_probes-64.stp
+ mv /home/jenkins/rpmbuild/BUILDROOT/libvirt-3.4.0-1.fc26.x86_64/usr/share/systemtap/tapset/libvirt_qemu_probes.stp /home/jenkins/rpmbuild/BUILDROOT/libvirt-3.4.0-1.fc26.x86_64/usr/share/systemtap/tapset/libvirt_qemu_probes-64.stp
+ /usr/lib/rpm/find-debuginfo.sh --strict-build-id -m --run-dwz --dwz-low-mem-die-limit 10000000 --dwz-max-die-limit 110000000 /home/jenkins/rpmbuild/BUILD/libvirt-3.4.0
extracting debug info from /home/jenkins/rpmbuild/BUILDROOT/libvirt-3.4.0-1.fc26.x86_64/usr/sbin/libvirtd
extracting debug info from /home/jenkins/rpmbuild/BUILDROOT/libvirt-3.4.0-1.fc26.x86_64/usr/sbin/virtlockd
extracting debug info from /home/jenkins/rpmbuild/BUILDROOT/libvirt-3.4.0-1.fc26.x86_64/usr/sbin/virtlogd
extracting debug info from /home/jenkins/rpmbuild/BUILDROOT/libvirt-3.4.0-1.fc26.x86_64/usr/bin/virt-login-shell
extracting debug info from /home/jenkins/rpmbuild/BUILDROOT/libvirt-3.4.0-1.fc26.x86_64/usr/bin/virt-admin
extracting debug info from /home/jenkins/rpmbuild/BUILDROOT/libvirt-3.4.0-1.fc26.x86_64/usr/bin/virsh
extracting debug info from /home/jenkins/rpmbuild/BUILDROOT/libvirt-3.4.0-1.fc26.x86_64/usr/bin/virt-host-validate
extracting debug info from /home/jenkins/rpmbuild/BUILDROOT/libvirt-3.4.0-1.fc26.x86_64/usr/libexec/libvirt_lxc
extracting debug info from /home/jenkins/rpmbuild/BUILDROOT/libvirt-3.4.0-1.fc26.x86_64/usr/libexec/libvirt_parthelper
extracting debug info from /home/jenkins/rpmbuild/BUILDROOT/libvirt-3.4.0-1.fc26.x86_64/usr/libexec/libvirt_iohelper
extracting debug info from /home/jenkins/rpmbuild/BUILDROOT/libvirt-3.4.0-1.fc26.x86_64/usr/libexec/libvirt_sanlock_helper
extracting debug info from /home/jenkins/rpmbuild/BUILDROOT/libvirt-3.4.0-1.fc26.x86_64/usr/libexec/libvirt_leaseshelper
extracting debug info from /home/jenkins/rpmbuild/BUILDROOT/libvirt-3.4.0-1.fc26.x86_64/usr/lib64/libnss_libvirt_guest.so.2
extracting debug info from /home/jenkins/rpmbuild/BUILDROOT/libvirt-3.4.0-1.fc26.x86_64/usr/lib64/libvirt/lock-driver/lockd.so
extracting debug info from /home/jenkins/rpmbuild/BUILDROOT/libvirt-3.4.0-1.fc26.x86_64/usr/lib64/libvirt/lock-driver/sanlock.so
extracting debug info from /home/jenkins/rpmbuild/BUILDROOT/libvirt-3.4.0-1.fc26.x86_64/usr/lib64/libvirt/connection-driver/libvirt_driver_storage.so
extracting debug info from /home/jenkins/rpmbuild/BUILDROOT/libvirt-3.4.0-1.fc26.x86_64/usr/lib64/libvirt/connection-driver/libvirt_driver_lxc.so
extracting debug info from /home/jenkins/rpmbuild/BUILDROOT/libvirt-3.4.0-1.fc26.x86_64/usr/lib64/libvirt/connection-driver/libvirt_driver_libxl.so
extracting debug info from /home/jenkins/rpmbuild/BUILDROOT/libvirt-3.4.0-1.fc26.x86_64/usr/lib64/libvirt/connection-driver/libvirt_driver_xen.so
extracting debug info from /home/jenkins/rpmbuild/BUILDROOT/libvirt-3.4.0-1.fc26.x86_64/usr/lib64/libvirt/connection-driver/libvirt_driver_secret.so
extracting debug info from /home/jenkins/rpmbuild/BUILDROOT/libvirt-3.4.0-1.fc26.x86_64/usr/lib64/libvirt/connection-driver/libvirt_driver_uml.so
extracting debug info from /home/jenkins/rpmbuild/BUILDROOT/libvirt-3.4.0-1.fc26.x86_64/usr/lib64/libvirt/connection-driver/libvirt_driver_nwfilter.so
extracting debug info from /home/jenkins/rpmbuild/BUILDROOT/libvirt-3.4.0-1.fc26.x86_64/usr/lib64/libvirt/connection-driver/libvirt_driver_qemu.so
extracting debug info from /home/jenkins/rpmbuild/BUILDROOT/libvirt-3.4.0-1.fc26.x86_64/usr/lib64/libvirt/connection-driver/libvirt_driver_interface.so
extracting debug info from /home/jenkins/rpmbuild/BUILDROOT/libvirt-3.4.0-1.fc26.x86_64/usr/lib64/libvirt/connection-driver/libvirt_driver_network.so
extracting debug info from /home/jenkins/rpmbuild/BUILDROOT/libvirt-3.4.0-1.fc26.x86_64/usr/lib64/libvirt/connection-driver/libvirt_driver_vbox.so
extracting debug info from /home/jenkins/rpmbuild/BUILDROOT/libvirt-3.4.0-1.fc26.x86_64/usr/lib64/libvirt/connection-driver/libvirt_driver_nodedev.so
extracting debug info from /home/jenkins/rpmbuild/BUILDROOT/libvirt-3.4.0-1.fc26.x86_64/usr/lib64/libvirt/storage-backend/libvirt_storage_backend_logical.so
extracting debug info from /home/jenkins/rpmbuild/BUILDROOT/libvirt-3.4.0-1.fc26.x86_64/usr/lib64/libvirt/storage-backend/libvirt_storage_backend_rbd.so
extracting debug info from /home/jenkins/rpmbuild/BUILDROOT/libvirt-3.4.0-1.fc26.x86_64/usr/lib64/libvirt/storage-backend/libvirt_storage_backend_fs.so
extracting debug info from /home/jenkins/rpmbuild/BUILDROOT/libvirt-3.4.0-1.fc26.x86_64/usr/lib64/libvirt/storage-backend/libvirt_storage_backend_sheepdog.so
extracting debug info from /home/jenkins/rpmbuild/BUILDROOT/libvirt-3.4.0-1.fc26.x86_64/usr/lib64/libvirt/storage-backend/libvirt_storage_backend_mpath.so
extracting debug info from /home/jenkins/rpmbuild/BUILDROOT/libvirt-3.4.0-1.fc26.x86_64/usr/lib64/libvirt/storage-backend/libvirt_storage_backend_iscsi.so
extracting debug info from /home/jenkins/rpmbuild/BUILDROOT/libvirt-3.4.0-1.fc26.x86_64/usr/lib64/libvirt/storage-backend/libvirt_storage_backend_scsi.so
extracting debug info from /home/jenkins/rpmbuild/BUILDROOT/libvirt-3.4.0-1.fc26.x86_64/usr/lib64/libvirt/storage-backend/libvirt_storage_backend_disk.so
extracting debug info from /home/jenkins/rpmbuild/BUILDROOT/libvirt-3.4.0-1.fc26.x86_64/usr/lib64/libvirt/storage-backend/libvirt_storage_backend_gluster.so
extracting debug info from /home/jenkins/rpmbuild/BUILDROOT/libvirt-3.4.0-1.fc26.x86_64/usr/lib64/libnss_libvirt.so.2
extracting debug info from /home/jenkins/rpmbuild/BUILDROOT/libvirt-3.4.0-1.fc26.x86_64/usr/lib64/libvirt-lxc.so.0.3004.0
extracting debug info from /home/jenkins/rpmbuild/BUILDROOT/libvirt-3.4.0-1.fc26.x86_64/usr/lib64/wireshark/plugins/libvirt.so
extracting debug info from /home/jenkins/rpmbuild/BUILDROOT/libvirt-3.4.0-1.fc26.x86_64/usr/lib64/libvirt.so.0.3004.0
extracting debug info from /home/jenkins/rpmbuild/BUILDROOT/libvirt-3.4.0-1.fc26.x86_64/usr/lib64/libvirt-qemu.so.0.3004.0
extracting debug info from /home/jenkins/rpmbuild/BUILDROOT/libvirt-3.4.0-1.fc26.x86_64/usr/lib64/libvirt-admin.so.0.3004.0
/usr/lib/rpm/sepdebugcrcfix: Updated 42 CRC32s, 0 CRC32s did match.
symlinked /usr/lib/debug/usr/lib64/libvirt-admin.so.0.3004.0.debug to /usr/lib/debug/usr/lib64/libvirt-admin.so.debug
symlinked /usr/lib/debug/usr/lib64/libvirt-lxc.so.0.3004.0.debug to /usr/lib/debug/usr/lib64/libvirt-lxc.so.0.debug
symlinked /usr/lib/debug/usr/lib64/libvirt-qemu.so.0.3004.0.debug to /usr/lib/debug/usr/lib64/libvirt-qemu.so.debug
symlinked /usr/lib/debug/usr/lib64/libvirt-admin.so.0.3004.0.debug to /usr/lib/debug/usr/lib64/libvirt-admin.so.0.debug
symlinked /usr/lib/debug/usr/lib64/libvirt-lxc.so.0.3004.0.debug to /usr/lib/debug/usr/lib64/libvirt-lxc.so.debug
symlinked /usr/lib/debug/usr/lib64/libvirt.so.0.3004.0.debug to /usr/lib/debug/usr/lib64/libvirt.so.debug
symlinked /usr/lib/debug/usr/lib64/libvirt-qemu.so.0.3004.0.debug to /usr/lib/debug/usr/lib64/libvirt-qemu.so.0.debug
symlinked /usr/lib/debug/usr/lib64/libvirt.so.0.3004.0.debug to /usr/lib/debug/usr/lib64/libvirt.so.0.debug
50685 blocks
+ /usr/lib/rpm/check-buildroot
+ /usr/lib/rpm/brp-compress
+ /usr/lib/rpm/brp-strip-static-archive /usr/bin/strip
+ /usr/lib/rpm/brp-python-bytecompile /usr/bin/python 1
+ /usr/lib/rpm/brp-python-hardlink
Executing(%check): /bin/sh -e /var/tmp/rpm-tmp.18gthG
+ umask 022
+ cd /home/jenkins/rpmbuild/BUILD
+ cd libvirt-3.4.0
+ cd tests
+ for i in nodeinfotest seclabeltest
+ rm -f nodeinfotest
+ printf 'int main(void) { return 0; }'
+ printf '#!/bin/sh\nexit 0\n'
+ chmod +x nodeinfotest
+ for i in nodeinfotest seclabeltest
+ rm -f seclabeltest
+ printf 'int main(void) { return 0; }'
+ printf '#!/bin/sh\nexit 0\n'
+ chmod +x seclabeltest
+ make -j2 check VIR_TEST_DEBUG=1
make libshunload.la virportallocatormock.la virnetdaemonmock.la virnetserverclientmock.la vircgroupmock.la virpcimock.la virnetdevmock.la virrandommock.la virhostcpumock.la domaincapsmock.la virusbmock.la virnetdevbandwidthmock.la virnumamock.la virtestmock.la virdbusmock.la libqemumonitortestutils.la libqemutestdriver.la qemuxml2argvmock.la qemuxml2xmlmock.la qemucaps2xmlmock.la qemucapsprobemock.la qemucpumock.la nssmock.la virmacmapmock.la libsecurityselinuxhelper.la virshtest sockettest virhostcputest virbuftest commandtest seclabeltest virhashtest virconftest viratomictest utiltest shunloadtest virtimetest viruritest virkeyfiletest viralloctest virauthconfigtest virbitmaptest vircgrouptest vircryptotest virpcitest virendiantest virfiletest virfirewalltest viriscsitest virkeycodetest virlockspacetest virlogtest virrotatingfiletest virschematest virstringtest virportallocatortest sysinfotest virkmodtest vircapstest domaincapstest domainconftest virhostdevtest virnetdevtest virtypedparamtest virnetmessagetest virnetsockettest virnetdaemontest virnetserverclienttest virnettlscontexttest virnettlssessiontest fchosttest scsihosttest vircaps2xmltest fdstreamtest virdbustest virsystemdtest virpolkittest securityselinuxtest viridentitytest securityselinuxlabeltest virdrivermoduletest xml2sexprtest sexpr2xmltest xmconfigtest xencapstest xlconfigtest qemuxml2argvtest qemuxml2xmltest qemuargv2xmltest qemuhelptest domainsnapshotxml2xmltest qemumonitortest qemumonitorjsontest qemuhotplugtest qemuagenttest qemucapabilitiestest qemucaps2xmltest qemumemlocktest qemucommandutiltest lxcxml2xmltest lxcconf2xmltest openvzutilstest esxutilstest vboxsnapshotxmltest vmx2xmltest xml2vmxtest vmwarevertest jsontest networkxml2xmltest networkxml2xmlupdatetest networkxml2conftest networkxml2firewalltest storagebackendsheepdogtest nwfilterxml2xmltest nwfilterebiptablestest nwfilterxml2firewalltest storagevolxml2argvtest virstorageutiltest virstoragetest virscsitest nsstest nssguesttest storagevolxml2xmltest storagepoolxml2xmltest nodedevxml2xmltest interfacexml2xmltest cputest metadatatest secretxml2xmltest genericxml2xmltest virusbtest virnetdevbandwidthtest eventtest objecteventtest virmacmaptest commandhelper ssh qemucapsprobe nsslinktest nssguestlinktest
make[1]: Entering directory '/home/jenkins/rpmbuild/BUILD/libvirt-3.4.0/tests'
CC shunloadhelper.lo
CC virportallocatormock_la-virportallocatormock.lo
CC virnetdaemonmock_la-virnetdaemonmock.lo
CC virnetserverclientmock_la-virnetserverclientmock.lo
CC vircgroupmock_la-vircgroupmock.lo
CC virpcimock_la-virpcimock.lo
CC virnetdevmock_la-virnetdevmock.lo
CC virrandommock_la-virrandommock.lo
CC virhostcpumock_la-virhostcpumock.lo
CC domaincapsmock_la-domaincapsmock.lo
CC virusbmock_la-virusbmock.lo
CC virnetdevbandwidthmock_la-virnetdevbandwidthmock.lo
CC virnumamock_la-virnumamock.lo
CC virtestmock_la-virtestmock.lo
CC virdbusmock_la-virdbusmock.lo
CC qemumonitortestutils.lo
CCLD libqemutestdriver.la
CC qemuxml2argvmock_la-qemuxml2argvmock.lo
CC qemuxml2xmlmock_la-qemuxml2xmlmock.lo
CC qemucaps2xmlmock_la-qemucaps2xmlmock.lo
CC qemucapsprobemock_la-qemucapsprobemock.lo
CC qemucpumock_la-qemucpumock.lo
CC nssmock_la-nssmock.lo
CC virmacmapmock_la-virmacmapmock.lo
CC securityselinuxhelper.lo
CC virshtest.o
CC testutils.o
CC sockettest.o
CC virhostcputest.o
virhostcputest.c:13:10: fatal error: virfilewrapper.h: No such file or directory
#include "virfilewrapper.h"
^~~~~~~~~~~~~~~~~~
compilation terminated.
make[1]: *** [Makefile:5317: virhostcputest.o] Error 1
make[1]: *** Waiting for unfinished jobs....
make[1]: Leaving directory '/home/jenkins/rpmbuild/BUILD/libvirt-3.4.0/tests'
make: *** [Makefile:6987: check-am] Error 2
+ cat test-suite.log
cat: test-suite.log: No such file or directory
+ true
+ exit 1
error: Bad exit status from /var/tmp/rpm-tmp.18gthG (%check)
RPM build errors:
Bad exit status from /var/tmp/rpm-tmp.18gthG (%check)
Build step 'Execute shell' marked build as failure
1
1
[Libvirt-ci] Build failed in Jenkins: libvirt-master-rpm » libvirt-fedora-24 #358
by ci@centos.org 26 Oct '23
by ci@centos.org 26 Oct '23
26 Oct '23
See <https://ci.centos.org/job/libvirt-master-rpm/systems=libvirt-fedora-24/358/…>
------------------------------------------
[...truncated 305.17 KB...]
installing nso.gmo as /home/jenkins/rpmbuild/BUILDROOT/libvirt-3.4.0-1.fc24.x86_64/usr/share/locale/nso/LC_MESSAGES/libvirt.mo
installing or.gmo as /home/jenkins/rpmbuild/BUILDROOT/libvirt-3.4.0-1.fc24.x86_64/usr/share/locale/or/LC_MESSAGES/libvirt.mo
installing pa.gmo as /home/jenkins/rpmbuild/BUILDROOT/libvirt-3.4.0-1.fc24.x86_64/usr/share/locale/pa/LC_MESSAGES/libvirt.mo
installing pl.gmo as /home/jenkins/rpmbuild/BUILDROOT/libvirt-3.4.0-1.fc24.x86_64/usr/share/locale/pl/LC_MESSAGES/libvirt.mo
installing pt.gmo as /home/jenkins/rpmbuild/BUILDROOT/libvirt-3.4.0-1.fc24.x86_64/usr/share/locale/pt/LC_MESSAGES/libvirt.mo
installing pt_BR.gmo as /home/jenkins/rpmbuild/BUILDROOT/libvirt-3.4.0-1.fc24.x86_64/usr/share/locale/pt_BR/LC_MESSAGES/libvirt.mo
installing ro.gmo as /home/jenkins/rpmbuild/BUILDROOT/libvirt-3.4.0-1.fc24.x86_64/usr/share/locale/ro/LC_MESSAGES/libvirt.mo
installing ru.gmo as /home/jenkins/rpmbuild/BUILDROOT/libvirt-3.4.0-1.fc24.x86_64/usr/share/locale/ru/LC_MESSAGES/libvirt.mo
installing si.gmo as /home/jenkins/rpmbuild/BUILDROOT/libvirt-3.4.0-1.fc24.x86_64/usr/share/locale/si/LC_MESSAGES/libvirt.mo
installing sk.gmo as /home/jenkins/rpmbuild/BUILDROOT/libvirt-3.4.0-1.fc24.x86_64/usr/share/locale/sk/LC_MESSAGES/libvirt.mo
installing sl.gmo as /home/jenkins/rpmbuild/BUILDROOT/libvirt-3.4.0-1.fc24.x86_64/usr/share/locale/sl/LC_MESSAGES/libvirt.mo
installing sq.gmo as /home/jenkins/rpmbuild/BUILDROOT/libvirt-3.4.0-1.fc24.x86_64/usr/share/locale/sq/LC_MESSAGES/libvirt.mo
installing sr.gmo as /home/jenkins/rpmbuild/BUILDROOT/libvirt-3.4.0-1.fc24.x86_64/usr/share/locale/sr/LC_MESSAGES/libvirt.mo
installing sr(a)latin.gmo as /home/jenkins/rpmbuild/BUILDROOT/libvirt-3.4.0-1.fc24.x86_64/usr/share/locale/sr(a)latin/LC_MESSAGES/libvirt.mo
installing sv.gmo as /home/jenkins/rpmbuild/BUILDROOT/libvirt-3.4.0-1.fc24.x86_64/usr/share/locale/sv/LC_MESSAGES/libvirt.mo
installing ta.gmo as /home/jenkins/rpmbuild/BUILDROOT/libvirt-3.4.0-1.fc24.x86_64/usr/share/locale/ta/LC_MESSAGES/libvirt.mo
installing te.gmo as /home/jenkins/rpmbuild/BUILDROOT/libvirt-3.4.0-1.fc24.x86_64/usr/share/locale/te/LC_MESSAGES/libvirt.mo
installing tg.gmo as /home/jenkins/rpmbuild/BUILDROOT/libvirt-3.4.0-1.fc24.x86_64/usr/share/locale/tg/LC_MESSAGES/libvirt.mo
installing th.gmo as /home/jenkins/rpmbuild/BUILDROOT/libvirt-3.4.0-1.fc24.x86_64/usr/share/locale/th/LC_MESSAGES/libvirt.mo
installing tr.gmo as /home/jenkins/rpmbuild/BUILDROOT/libvirt-3.4.0-1.fc24.x86_64/usr/share/locale/tr/LC_MESSAGES/libvirt.mo
installing tw.gmo as /home/jenkins/rpmbuild/BUILDROOT/libvirt-3.4.0-1.fc24.x86_64/usr/share/locale/tw/LC_MESSAGES/libvirt.mo
installing uk.gmo as /home/jenkins/rpmbuild/BUILDROOT/libvirt-3.4.0-1.fc24.x86_64/usr/share/locale/uk/LC_MESSAGES/libvirt.mo
installing ur.gmo as /home/jenkins/rpmbuild/BUILDROOT/libvirt-3.4.0-1.fc24.x86_64/usr/share/locale/ur/LC_MESSAGES/libvirt.mo
installing vi.gmo as /home/jenkins/rpmbuild/BUILDROOT/libvirt-3.4.0-1.fc24.x86_64/usr/share/locale/vi/LC_MESSAGES/libvirt.mo
installing wba.gmo as /home/jenkins/rpmbuild/BUILDROOT/libvirt-3.4.0-1.fc24.x86_64/usr/share/locale/wba/LC_MESSAGES/libvirt.mo
installing yo.gmo as /home/jenkins/rpmbuild/BUILDROOT/libvirt-3.4.0-1.fc24.x86_64/usr/share/locale/yo/LC_MESSAGES/libvirt.mo
installing zh_CN.gmo as /home/jenkins/rpmbuild/BUILDROOT/libvirt-3.4.0-1.fc24.x86_64/usr/share/locale/zh_CN/LC_MESSAGES/libvirt.mo
installing zh_HK.gmo as /home/jenkins/rpmbuild/BUILDROOT/libvirt-3.4.0-1.fc24.x86_64/usr/share/locale/zh_HK/LC_MESSAGES/libvirt.mo
installing zh_TW.gmo as /home/jenkins/rpmbuild/BUILDROOT/libvirt-3.4.0-1.fc24.x86_64/usr/share/locale/zh_TW/LC_MESSAGES/libvirt.mo
installing zu.gmo as /home/jenkins/rpmbuild/BUILDROOT/libvirt-3.4.0-1.fc24.x86_64/usr/share/locale/zu/LC_MESSAGES/libvirt.mo
if test "libvirt" = "gettext-tools"; then \
/usr/bin/mkdir -p /home/jenkins/rpmbuild/BUILDROOT/libvirt-3.4.0-1.fc24.x86_64/usr/share/gettext/po; \
for file in Makefile.in.in remove-potcdate.sin quot.sed boldquot.sed en(a)quot.header en(a)boldquot.header insert-header.sin Rules-quot Makevars.template; do \
/usr/bin/install -c -m 644 ./$file \
/home/jenkins/rpmbuild/BUILDROOT/libvirt-3.4.0-1.fc24.x86_64/usr/share/gettext/po/$file; \
done; \
for file in Makevars; do \
rm -f /home/jenkins/rpmbuild/BUILDROOT/libvirt-3.4.0-1.fc24.x86_64/usr/share/gettext/po/$file; \
done; \
else \
: ; \
fi
make[1]: Leaving directory '/home/jenkins/rpmbuild/BUILD/libvirt-3.4.0/po'
Making install in examples
make[1]: Entering directory '/home/jenkins/rpmbuild/BUILD/libvirt-3.4.0/examples'
make[2]: Entering directory '/home/jenkins/rpmbuild/BUILD/libvirt-3.4.0/examples'
make[2]: Nothing to be done for 'install-exec-am'.
/usr/bin/mkdir -p ""/home/jenkins/rpmbuild/BUILDROOT/libvirt-3.4.0-1.fc24.x86_64/etc/libvirt/nwfilter""
for f in ./xml/nwfilter/qemu-announce-self.xml ./xml/nwfilter/no-ip-multicast.xml ./xml/nwfilter/no-ip-spoofing.xml ./xml/nwfilter/no-mac-spoofing.xml ./xml/nwfilter/allow-dhcp.xml ./xml/nwfilter/no-arp-spoofing.xml ./xml/nwfilter/clean-traffic.xml ./xml/nwfilter/no-arp-ip-spoofing.xml ./xml/nwfilter/allow-arp.xml ./xml/nwfilter/no-arp-mac-spoofing.xml ./xml/nwfilter/allow-ipv4.xml ./xml/nwfilter/no-other-l2-traffic.xml ./xml/nwfilter/allow-incoming-ipv4.xml ./xml/nwfilter/no-mac-broadcast.xml ./xml/nwfilter/allow-dhcp-server.xml ./xml/nwfilter/qemu-announce-self-rarp.xml ./xml/nwfilter/no-other-rarp-traffic.xml; do \
/usr/bin/install -c -m 644 $f ""/home/jenkins/rpmbuild/BUILDROOT/libvirt-3.4.0-1.fc24.x86_64/etc/libvirt/nwfilter""; \
done
make[2]: Leaving directory '/home/jenkins/rpmbuild/BUILD/libvirt-3.4.0/examples'
make[1]: Leaving directory '/home/jenkins/rpmbuild/BUILD/libvirt-3.4.0/examples'
+ make -j2 -C examples distclean
make: Entering directory '/home/jenkins/rpmbuild/BUILD/libvirt-3.4.0/examples'
rm -rf .libs _libs
rm -rf admin/.libs admin/_libs
rm -f dominfo/info1 dommigrate/dommigrate domsuspend/suspend domtop/domtop hellolibvirt/hellolibvirt object-events/event-test openauth/openauth rename/rename admin/list_servers admin/list_clients admin/threadpool_params admin/client_limits admin/client_info admin/client_close admin/logging
rm -rf dominfo/.libs dominfo/_libs
rm -rf dommigrate/.libs dommigrate/_libs
rm -f *.o
rm -rf domsuspend/.libs domsuspend/_libs
rm -rf domtop/.libs domtop/_libs
rm -f admin/*.o
rm -rf hellolibvirt/.libs hellolibvirt/_libs
rm -rf object-events/.libs object-events/_libs
rm -f dominfo/*.o
rm -rf openauth/.libs openauth/_libs
rm -rf rename/.libs rename/_libs
rm -f dommigrate/*.o
rm -f *.lo
rm -f domsuspend/*.o
rm -f *.tab.c
rm -f domtop/*.o
test -z "" || rm -f
rm -f hellolibvirt/*.o
test . = "." || test -z "" || rm -f
rm -f object-events/*.o
rm -f admin/.deps/.dirstamp
rm -f admin/.dirstamp
rm -f openauth/*.o
rm -f dominfo/.deps/.dirstamp
rm -f dominfo/.dirstamp
rm -f rename/*.o
rm -f dommigrate/.deps/.dirstamp
rm -f dommigrate/.dirstamp
rm -f TAGS ID GTAGS GRTAGS GSYMS GPATH tags
rm -f domsuspend/.deps/.dirstamp
rm -f domsuspend/.dirstamp
rm -f domtop/.deps/.dirstamp
rm -f domtop/.dirstamp
rm -f hellolibvirt/.deps/.dirstamp
rm -f hellolibvirt/.dirstamp
rm -f object-events/.deps/.dirstamp
rm -f object-events/.dirstamp
rm -f openauth/.deps/.dirstamp
rm -f openauth/.dirstamp
rm -f rename/.deps/.dirstamp
rm -f rename/.dirstamp
rm -rf admin/.deps dominfo/.deps dommigrate/.deps domsuspend/.deps domtop/.deps hellolibvirt/.deps object-events/.deps openauth/.deps rename/.deps
rm -f Makefile
make: Leaving directory '/home/jenkins/rpmbuild/BUILD/libvirt-3.4.0/examples'
+ rm -f /home/jenkins/rpmbuild/BUILDROOT/libvirt-3.4.0-1.fc24.x86_64/usr/lib64/libnss_libvirt.la /home/jenkins/rpmbuild/BUILDROOT/libvirt-3.4.0-1.fc24.x86_64/usr/lib64/libnss_libvirt_guest.la /home/jenkins/rpmbuild/BUILDROOT/libvirt-3.4.0-1.fc24.x86_64/usr/lib64/libvirt-admin.la /home/jenkins/rpmbuild/BUILDROOT/libvirt-3.4.0-1.fc24.x86_64/usr/lib64/libvirt-lxc.la /home/jenkins/rpmbuild/BUILDROOT/libvirt-3.4.0-1.fc24.x86_64/usr/lib64/libvirt-qemu.la /home/jenkins/rpmbuild/BUILDROOT/libvirt-3.4.0-1.fc24.x86_64/usr/lib64/libvirt.la
+ rm -f '/home/jenkins/rpmbuild/BUILDROOT/libvirt-3.4.0-1.fc24.x86_64/usr/lib64/*.a'
+ rm -f /home/jenkins/rpmbuild/BUILDROOT/libvirt-3.4.0-1.fc24.x86_64/usr/lib64/libvirt/lock-driver/lockd.la /home/jenkins/rpmbuild/BUILDROOT/libvirt-3.4.0-1.fc24.x86_64/usr/lib64/libvirt/lock-driver/sanlock.la
+ rm -f '/home/jenkins/rpmbuild/BUILDROOT/libvirt-3.4.0-1.fc24.x86_64/usr/lib64/libvirt/lock-driver/*.a'
+ rm -f /home/jenkins/rpmbuild/BUILDROOT/libvirt-3.4.0-1.fc24.x86_64/usr/lib64/libvirt/connection-driver/libvirt_driver_interface.la /home/jenkins/rpmbuild/BUILDROOT/libvirt-3.4.0-1.fc24.x86_64/usr/lib64/libvirt/connection-driver/libvirt_driver_libxl.la /home/jenkins/rpmbuild/BUILDROOT/libvirt-3.4.0-1.fc24.x86_64/usr/lib64/libvirt/connection-driver/libvirt_driver_lxc.la /home/jenkins/rpmbuild/BUILDROOT/libvirt-3.4.0-1.fc24.x86_64/usr/lib64/libvirt/connection-driver/libvirt_driver_network.la /home/jenkins/rpmbuild/BUILDROOT/libvirt-3.4.0-1.fc24.x86_64/usr/lib64/libvirt/connection-driver/libvirt_driver_nodedev.la /home/jenkins/rpmbuild/BUILDROOT/libvirt-3.4.0-1.fc24.x86_64/usr/lib64/libvirt/connection-driver/libvirt_driver_nwfilter.la /home/jenkins/rpmbuild/BUILDROOT/libvirt-3.4.0-1.fc24.x86_64/usr/lib64/libvirt/connection-driver/libvirt_driver_qemu.la /home/jenkins/rpmbuild/BUILDROOT/libvirt-3.4.0-1.fc24.x86_64/usr/lib64/libvirt/connection-driver/libvirt_driver_secret.la /home/jenkins/rpmbuild/BUILDROOT/libvirt-3.4.0-1.fc24.x86_64/usr/lib64/libvirt/connection-driver/libvirt_driver_storage.la /home/jenkins/rpmbuild/BUILDROOT/libvirt-3.4.0-1.fc24.x86_64/usr/lib64/libvirt/connection-driver/libvirt_driver_uml.la /home/jenkins/rpmbuild/BUILDROOT/libvirt-3.4.0-1.fc24.x86_64/usr/lib64/libvirt/connection-driver/libvirt_driver_vbox.la /home/jenkins/rpmbuild/BUILDROOT/libvirt-3.4.0-1.fc24.x86_64/usr/lib64/libvirt/connection-driver/libvirt_driver_xen.la
+ rm -f '/home/jenkins/rpmbuild/BUILDROOT/libvirt-3.4.0-1.fc24.x86_64/usr/lib64/libvirt/connection-driver/*.a'
+ rm -f /home/jenkins/rpmbuild/BUILDROOT/libvirt-3.4.0-1.fc24.x86_64/usr/lib64/libvirt/storage-backend/libvirt_storage_backend_disk.la /home/jenkins/rpmbuild/BUILDROOT/libvirt-3.4.0-1.fc24.x86_64/usr/lib64/libvirt/storage-backend/libvirt_storage_backend_fs.la /home/jenkins/rpmbuild/BUILDROOT/libvirt-3.4.0-1.fc24.x86_64/usr/lib64/libvirt/storage-backend/libvirt_storage_backend_gluster.la /home/jenkins/rpmbuild/BUILDROOT/libvirt-3.4.0-1.fc24.x86_64/usr/lib64/libvirt/storage-backend/libvirt_storage_backend_iscsi.la /home/jenkins/rpmbuild/BUILDROOT/libvirt-3.4.0-1.fc24.x86_64/usr/lib64/libvirt/storage-backend/libvirt_storage_backend_logical.la /home/jenkins/rpmbuild/BUILDROOT/libvirt-3.4.0-1.fc24.x86_64/usr/lib64/libvirt/storage-backend/libvirt_storage_backend_mpath.la /home/jenkins/rpmbuild/BUILDROOT/libvirt-3.4.0-1.fc24.x86_64/usr/lib64/libvirt/storage-backend/libvirt_storage_backend_rbd.la /home/jenkins/rpmbuild/BUILDROOT/libvirt-3.4.0-1.fc24.x86_64/usr/lib64/libvirt/storage-backend/libvirt_storage_backend_scsi.la /home/jenkins/rpmbuild/BUILDROOT/libvirt-3.4.0-1.fc24.x86_64/usr/lib64/libvirt/storage-backend/libvirt_storage_backend_sheepdog.la
+ rm -f '/home/jenkins/rpmbuild/BUILDROOT/libvirt-3.4.0-1.fc24.x86_64/usr/lib64/libvirt/storage-backend/*.a'
+ rm -f /home/jenkins/rpmbuild/BUILDROOT/libvirt-3.4.0-1.fc24.x86_64/usr/lib64/wireshark/plugins/libvirt.la
+ install -d -m 0755 /home/jenkins/rpmbuild/BUILDROOT/libvirt-3.4.0-1.fc24.x86_64/usr/share/lib/libvirt/dnsmasq/
+ install -d -m 0755 /home/jenkins/rpmbuild/BUILDROOT/libvirt-3.4.0-1.fc24.x86_64/usr/share/libvirt/networks/
+ cp /home/jenkins/rpmbuild/BUILDROOT/libvirt-3.4.0-1.fc24.x86_64/etc/libvirt/qemu/networks/default.xml /home/jenkins/rpmbuild/BUILDROOT/libvirt-3.4.0-1.fc24.x86_64/usr/share/libvirt/networks/default.xml
+ rm -f /home/jenkins/rpmbuild/BUILDROOT/libvirt-3.4.0-1.fc24.x86_64/etc/libvirt/qemu/networks/default.xml
+ rm -f /home/jenkins/rpmbuild/BUILDROOT/libvirt-3.4.0-1.fc24.x86_64/etc/libvirt/qemu/networks/autostart/default.xml
+ install -d -m 0755 /home/jenkins/rpmbuild/BUILDROOT/libvirt-3.4.0-1.fc24.x86_64/usr/share/libvirt/nwfilter/
+ cp -a /home/jenkins/rpmbuild/BUILDROOT/libvirt-3.4.0-1.fc24.x86_64/etc/libvirt/nwfilter/allow-arp.xml /home/jenkins/rpmbuild/BUILDROOT/libvirt-3.4.0-1.fc24.x86_64/etc/libvirt/nwfilter/allow-dhcp-server.xml /home/jenkins/rpmbuild/BUILDROOT/libvirt-3.4.0-1.fc24.x86_64/etc/libvirt/nwfilter/allow-dhcp.xml /home/jenkins/rpmbuild/BUILDROOT/libvirt-3.4.0-1.fc24.x86_64/etc/libvirt/nwfilter/allow-incoming-ipv4.xml /home/jenkins/rpmbuild/BUILDROOT/libvirt-3.4.0-1.fc24.x86_64/etc/libvirt/nwfilter/allow-ipv4.xml /home/jenkins/rpmbuild/BUILDROOT/libvirt-3.4.0-1.fc24.x86_64/etc/libvirt/nwfilter/clean-traffic.xml /home/jenkins/rpmbuild/BUILDROOT/libvirt-3.4.0-1.fc24.x86_64/etc/libvirt/nwfilter/no-arp-ip-spoofing.xml /home/jenkins/rpmbuild/BUILDROOT/libvirt-3.4.0-1.fc24.x86_64/etc/libvirt/nwfilter/no-arp-mac-spoofing.xml /home/jenkins/rpmbuild/BUILDROOT/libvirt-3.4.0-1.fc24.x86_64/etc/libvirt/nwfilter/no-arp-spoofing.xml /home/jenkins/rpmbuild/BUILDROOT/libvirt-3.4.0-1.fc24.x86_64/etc/libvirt/nwfilter/no-ip-multicast.xml /home/jenkins/rpmbuild/BUILDROOT/libvirt-3.4.0-1.fc24.x86_64/etc/libvirt/nwfilter/no-ip-spoofing.xml /home/jenkins/rpmbuild/BUILDROOT/libvirt-3.4.0-1.fc24.x86_64/etc/libvirt/nwfilter/no-mac-broadcast.xml /home/jenkins/rpmbuild/BUILDROOT/libvirt-3.4.0-1.fc24.x86_64/etc/libvirt/nwfilter/no-mac-spoofing.xml /home/jenkins/rpmbuild/BUILDROOT/libvirt-3.4.0-1.fc24.x86_64/etc/libvirt/nwfilter/no-other-l2-traffic.xml /home/jenkins/rpmbuild/BUILDROOT/libvirt-3.4.0-1.fc24.x86_64/etc/libvirt/nwfilter/no-other-rarp-traffic.xml /home/jenkins/rpmbuild/BUILDROOT/libvirt-3.4.0-1.fc24.x86_64/etc/libvirt/nwfilter/qemu-announce-self-rarp.xml /home/jenkins/rpmbuild/BUILDROOT/libvirt-3.4.0-1.fc24.x86_64/etc/libvirt/nwfilter/qemu-announce-self.xml /home/jenkins/rpmbuild/BUILDROOT/libvirt-3.4.0-1.fc24.x86_64/usr/share/libvirt/nwfilter/
+ sed -i -e '/<uuid>/d' /home/jenkins/rpmbuild/BUILDROOT/libvirt-3.4.0-1.fc24.x86_64/usr/share/libvirt/networks/default.xml
+ /usr/lib/rpm/find-lang.sh /home/jenkins/rpmbuild/BUILDROOT/libvirt-3.4.0-1.fc24.x86_64 libvirt
+ mv /home/jenkins/rpmbuild/BUILDROOT/libvirt-3.4.0-1.fc24.x86_64/usr/share/doc/libvirt-3.4.0 libvirt-docs
+ mv /home/jenkins/rpmbuild/BUILDROOT/libvirt-3.4.0-1.fc24.x86_64/usr/share/systemtap/tapset/libvirt_probes.stp /home/jenkins/rpmbuild/BUILDROOT/libvirt-3.4.0-1.fc24.x86_64/usr/share/systemtap/tapset/libvirt_probes-64.stp
+ mv /home/jenkins/rpmbuild/BUILDROOT/libvirt-3.4.0-1.fc24.x86_64/usr/share/systemtap/tapset/libvirt_qemu_probes.stp /home/jenkins/rpmbuild/BUILDROOT/libvirt-3.4.0-1.fc24.x86_64/usr/share/systemtap/tapset/libvirt_qemu_probes-64.stp
+ /usr/lib/rpm/find-debuginfo.sh --strict-build-id -m --run-dwz --dwz-low-mem-die-limit 10000000 --dwz-max-die-limit 110000000 /home/jenkins/rpmbuild/BUILD/libvirt-3.4.0
extracting debug info from /home/jenkins/rpmbuild/BUILDROOT/libvirt-3.4.0-1.fc24.x86_64/usr/lib64/libvirt.so.0.3004.0
extracting debug info from /home/jenkins/rpmbuild/BUILDROOT/libvirt-3.4.0-1.fc24.x86_64/usr/lib64/libvirt/lock-driver/lockd.so
extracting debug info from /home/jenkins/rpmbuild/BUILDROOT/libvirt-3.4.0-1.fc24.x86_64/usr/lib64/libvirt/lock-driver/sanlock.so
extracting debug info from /home/jenkins/rpmbuild/BUILDROOT/libvirt-3.4.0-1.fc24.x86_64/usr/lib64/libvirt/connection-driver/libvirt_driver_xen.so
extracting debug info from /home/jenkins/rpmbuild/BUILDROOT/libvirt-3.4.0-1.fc24.x86_64/usr/lib64/libvirt/connection-driver/libvirt_driver_vbox.so
extracting debug info from /home/jenkins/rpmbuild/BUILDROOT/libvirt-3.4.0-1.fc24.x86_64/usr/lib64/libvirt/connection-driver/libvirt_driver_libxl.so
extracting debug info from /home/jenkins/rpmbuild/BUILDROOT/libvirt-3.4.0-1.fc24.x86_64/usr/lib64/libvirt/connection-driver/libvirt_driver_qemu.so
extracting debug info from /home/jenkins/rpmbuild/BUILDROOT/libvirt-3.4.0-1.fc24.x86_64/usr/lib64/libvirt/connection-driver/libvirt_driver_lxc.so
extracting debug info from /home/jenkins/rpmbuild/BUILDROOT/libvirt-3.4.0-1.fc24.x86_64/usr/lib64/libvirt/connection-driver/libvirt_driver_uml.so
extracting debug info from /home/jenkins/rpmbuild/BUILDROOT/libvirt-3.4.0-1.fc24.x86_64/usr/lib64/libvirt/connection-driver/libvirt_driver_network.so
extracting debug info from /home/jenkins/rpmbuild/BUILDROOT/libvirt-3.4.0-1.fc24.x86_64/usr/lib64/libvirt/connection-driver/libvirt_driver_interface.so
extracting debug info from /home/jenkins/rpmbuild/BUILDROOT/libvirt-3.4.0-1.fc24.x86_64/usr/lib64/libvirt/connection-driver/libvirt_driver_secret.so
extracting debug info from /home/jenkins/rpmbuild/BUILDROOT/libvirt-3.4.0-1.fc24.x86_64/usr/lib64/libvirt/connection-driver/libvirt_driver_storage.so
extracting debug info from /home/jenkins/rpmbuild/BUILDROOT/libvirt-3.4.0-1.fc24.x86_64/usr/lib64/libvirt/connection-driver/libvirt_driver_nodedev.so
extracting debug info from /home/jenkins/rpmbuild/BUILDROOT/libvirt-3.4.0-1.fc24.x86_64/usr/lib64/libvirt/connection-driver/libvirt_driver_nwfilter.so
extracting debug info from /home/jenkins/rpmbuild/BUILDROOT/libvirt-3.4.0-1.fc24.x86_64/usr/lib64/libvirt/storage-backend/libvirt_storage_backend_fs.so
extracting debug info from /home/jenkins/rpmbuild/BUILDROOT/libvirt-3.4.0-1.fc24.x86_64/usr/lib64/libvirt/storage-backend/libvirt_storage_backend_logical.so
extracting debug info from /home/jenkins/rpmbuild/BUILDROOT/libvirt-3.4.0-1.fc24.x86_64/usr/lib64/libvirt/storage-backend/libvirt_storage_backend_iscsi.so
extracting debug info from /home/jenkins/rpmbuild/BUILDROOT/libvirt-3.4.0-1.fc24.x86_64/usr/lib64/libvirt/storage-backend/libvirt_storage_backend_scsi.so
extracting debug info from /home/jenkins/rpmbuild/BUILDROOT/libvirt-3.4.0-1.fc24.x86_64/usr/lib64/libvirt/storage-backend/libvirt_storage_backend_mpath.so
extracting debug info from /home/jenkins/rpmbuild/BUILDROOT/libvirt-3.4.0-1.fc24.x86_64/usr/lib64/libvirt/storage-backend/libvirt_storage_backend_disk.so
extracting debug info from /home/jenkins/rpmbuild/BUILDROOT/libvirt-3.4.0-1.fc24.x86_64/usr/lib64/libvirt/storage-backend/libvirt_storage_backend_rbd.so
extracting debug info from /home/jenkins/rpmbuild/BUILDROOT/libvirt-3.4.0-1.fc24.x86_64/usr/lib64/libvirt/storage-backend/libvirt_storage_backend_sheepdog.so
extracting debug info from /home/jenkins/rpmbuild/BUILDROOT/libvirt-3.4.0-1.fc24.x86_64/usr/lib64/libvirt/storage-backend/libvirt_storage_backend_gluster.so
extracting debug info from /home/jenkins/rpmbuild/BUILDROOT/libvirt-3.4.0-1.fc24.x86_64/usr/lib64/libvirt-qemu.so.0.3004.0
extracting debug info from /home/jenkins/rpmbuild/BUILDROOT/libvirt-3.4.0-1.fc24.x86_64/usr/lib64/libvirt-lxc.so.0.3004.0
extracting debug info from /home/jenkins/rpmbuild/BUILDROOT/libvirt-3.4.0-1.fc24.x86_64/usr/lib64/libvirt-admin.so.0.3004.0
extracting debug info from /home/jenkins/rpmbuild/BUILDROOT/libvirt-3.4.0-1.fc24.x86_64/usr/lib64/libnss_libvirt.so.2
extracting debug info from /home/jenkins/rpmbuild/BUILDROOT/libvirt-3.4.0-1.fc24.x86_64/usr/lib64/libnss_libvirt_guest.so.2
extracting debug info from /home/jenkins/rpmbuild/BUILDROOT/libvirt-3.4.0-1.fc24.x86_64/usr/lib64/wireshark/plugins/libvirt.so
extracting debug info from /home/jenkins/rpmbuild/BUILDROOT/libvirt-3.4.0-1.fc24.x86_64/usr/libexec/libvirt_iohelper
extracting debug info from /home/jenkins/rpmbuild/BUILDROOT/libvirt-3.4.0-1.fc24.x86_64/usr/libexec/libvirt_leaseshelper
extracting debug info from /home/jenkins/rpmbuild/BUILDROOT/libvirt-3.4.0-1.fc24.x86_64/usr/libexec/libvirt_parthelper
extracting debug info from /home/jenkins/rpmbuild/BUILDROOT/libvirt-3.4.0-1.fc24.x86_64/usr/libexec/libvirt_sanlock_helper
extracting debug info from /home/jenkins/rpmbuild/BUILDROOT/libvirt-3.4.0-1.fc24.x86_64/usr/libexec/libvirt_lxc
extracting debug info from /home/jenkins/rpmbuild/BUILDROOT/libvirt-3.4.0-1.fc24.x86_64/usr/sbin/virtlockd
extracting debug info from /home/jenkins/rpmbuild/BUILDROOT/libvirt-3.4.0-1.fc24.x86_64/usr/sbin/virtlogd
extracting debug info from /home/jenkins/rpmbuild/BUILDROOT/libvirt-3.4.0-1.fc24.x86_64/usr/sbin/libvirtd
extracting debug info from /home/jenkins/rpmbuild/BUILDROOT/libvirt-3.4.0-1.fc24.x86_64/usr/bin/virsh
extracting debug info from /home/jenkins/rpmbuild/BUILDROOT/libvirt-3.4.0-1.fc24.x86_64/usr/bin/virt-admin
extracting debug info from /home/jenkins/rpmbuild/BUILDROOT/libvirt-3.4.0-1.fc24.x86_64/usr/bin/virt-login-shell
extracting debug info from /home/jenkins/rpmbuild/BUILDROOT/libvirt-3.4.0-1.fc24.x86_64/usr/bin/virt-host-validate
/usr/lib/rpm/sepdebugcrcfix: Updated 42 CRC32s, 0 CRC32s did match.
symlinked /usr/lib/debug/usr/lib64/libvirt.so.0.3004.0.debug to /usr/lib/debug/usr/lib64/libvirt.so.0.debug
symlinked /usr/lib/debug/usr/lib64/libvirt.so.0.3004.0.debug to /usr/lib/debug/usr/lib64/libvirt.so.debug
symlinked /usr/lib/debug/usr/lib64/libvirt-qemu.so.0.3004.0.debug to /usr/lib/debug/usr/lib64/libvirt-qemu.so.0.debug
symlinked /usr/lib/debug/usr/lib64/libvirt-qemu.so.0.3004.0.debug to /usr/lib/debug/usr/lib64/libvirt-qemu.so.debug
symlinked /usr/lib/debug/usr/lib64/libvirt-lxc.so.0.3004.0.debug to /usr/lib/debug/usr/lib64/libvirt-lxc.so.0.debug
symlinked /usr/lib/debug/usr/lib64/libvirt-lxc.so.0.3004.0.debug to /usr/lib/debug/usr/lib64/libvirt-lxc.so.debug
symlinked /usr/lib/debug/usr/lib64/libvirt-admin.so.0.3004.0.debug to /usr/lib/debug/usr/lib64/libvirt-admin.so.0.debug
symlinked /usr/lib/debug/usr/lib64/libvirt-admin.so.0.3004.0.debug to /usr/lib/debug/usr/lib64/libvirt-admin.so.debug
50685 blocks
+ /usr/lib/rpm/check-buildroot
+ /usr/lib/rpm/brp-compress
+ /usr/lib/rpm/brp-strip-static-archive /usr/bin/strip
+ /usr/lib/rpm/brp-python-bytecompile /usr/bin/python 1
+ /usr/lib/rpm/brp-python-hardlink
+ /usr/lib/rpm/redhat/brp-java-repack-jars
Executing(%check): /bin/sh -e /var/tmp/rpm-tmp.ILV5bE
+ umask 022
+ cd /home/jenkins/rpmbuild/BUILD
+ cd libvirt-3.4.0
+ cd tests
+ for i in nodeinfotest seclabeltest
+ rm -f nodeinfotest
+ printf 'int main(void) { return 0; }'
+ printf '#!/bin/sh\nexit 0\n'
+ chmod +x nodeinfotest
+ for i in nodeinfotest seclabeltest
+ rm -f seclabeltest
+ printf 'int main(void) { return 0; }'
+ printf '#!/bin/sh\nexit 0\n'
+ chmod +x seclabeltest
+ make -j2 check VIR_TEST_DEBUG=1
make libshunload.la virportallocatormock.la virnetdaemonmock.la virnetserverclientmock.la vircgroupmock.la virpcimock.la virnetdevmock.la virrandommock.la virhostcpumock.la domaincapsmock.la virusbmock.la virnetdevbandwidthmock.la virnumamock.la virtestmock.la virdbusmock.la libqemumonitortestutils.la libqemutestdriver.la qemuxml2argvmock.la qemuxml2xmlmock.la qemucaps2xmlmock.la qemucapsprobemock.la qemucpumock.la nssmock.la virmacmapmock.la libsecurityselinuxhelper.la virshtest sockettest virhostcputest virbuftest commandtest seclabeltest virhashtest virconftest viratomictest utiltest shunloadtest virtimetest viruritest virkeyfiletest viralloctest virauthconfigtest virbitmaptest vircgrouptest vircryptotest virpcitest virendiantest virfiletest virfirewalltest viriscsitest virkeycodetest virlockspacetest virlogtest virrotatingfiletest virschematest virstringtest virportallocatortest sysinfotest virkmodtest vircapstest domaincapstest domainconftest virhostdevtest virnetdevtest virtypedparamtest virnetmessagetest virnetsockettest virnetdaemontest virnetserverclienttest virnettlscontexttest virnettlssessiontest fchosttest scsihosttest vircaps2xmltest fdstreamtest virdbustest virsystemdtest virpolkittest securityselinuxtest viridentitytest securityselinuxlabeltest virdrivermoduletest xml2sexprtest sexpr2xmltest xmconfigtest xencapstest xlconfigtest qemuxml2argvtest qemuxml2xmltest qemuargv2xmltest qemuhelptest domainsnapshotxml2xmltest qemumonitortest qemumonitorjsontest qemuhotplugtest qemuagenttest qemucapabilitiestest qemucaps2xmltest qemumemlocktest qemucommandutiltest lxcxml2xmltest lxcconf2xmltest openvzutilstest esxutilstest vboxsnapshotxmltest vmx2xmltest xml2vmxtest vmwarevertest jsontest networkxml2xmltest networkxml2xmlupdatetest networkxml2conftest networkxml2firewalltest storagebackendsheepdogtest nwfilterxml2xmltest nwfilterebiptablestest nwfilterxml2firewalltest storagevolxml2argvtest virstorageutiltest virstoragetest virscsitest nsstest nssguesttest storagevolxml2xmltest storagepoolxml2xmltest nodedevxml2xmltest interfacexml2xmltest cputest metadatatest secretxml2xmltest genericxml2xmltest virusbtest virnetdevbandwidthtest eventtest objecteventtest virmacmaptest commandhelper ssh qemucapsprobe nsslinktest nssguestlinktest
make[1]: Entering directory '/home/jenkins/rpmbuild/BUILD/libvirt-3.4.0/tests'
CC shunloadhelper.lo
CC virportallocatormock_la-virportallocatormock.lo
CC virnetdaemonmock_la-virnetdaemonmock.lo
CC virnetserverclientmock_la-virnetserverclientmock.lo
CC vircgroupmock_la-vircgroupmock.lo
CC virpcimock_la-virpcimock.lo
CC virnetdevmock_la-virnetdevmock.lo
CC virrandommock_la-virrandommock.lo
CC virhostcpumock_la-virhostcpumock.lo
CC domaincapsmock_la-domaincapsmock.lo
CC virusbmock_la-virusbmock.lo
CC virnetdevbandwidthmock_la-virnetdevbandwidthmock.lo
CC virnumamock_la-virnumamock.lo
CC virtestmock_la-virtestmock.lo
CC virdbusmock_la-virdbusmock.lo
CC qemumonitortestutils.lo
CCLD libqemutestdriver.la
CC qemuxml2argvmock_la-qemuxml2argvmock.lo
CC qemuxml2xmlmock_la-qemuxml2xmlmock.lo
CC qemucaps2xmlmock_la-qemucaps2xmlmock.lo
CC qemucapsprobemock_la-qemucapsprobemock.lo
CC qemucpumock_la-qemucpumock.lo
CC nssmock_la-nssmock.lo
CC virmacmapmock_la-virmacmapmock.lo
CC securityselinuxhelper.lo
CC virshtest.o
CC testutils.o
CC sockettest.o
CC virhostcputest.o
virhostcputest.c:13:28: fatal error: virfilewrapper.h: No such file or directory
#include "virfilewrapper.h"
^
compilation terminated.
Makefile:5317: recipe for target 'virhostcputest.o' failed
make[1]: *** [virhostcputest.o] Error 1
make[1]: *** Waiting for unfinished jobs....
make[1]: Leaving directory '/home/jenkins/rpmbuild/BUILD/libvirt-3.4.0/tests'
Makefile:6987: recipe for target 'check-am' failed
make: *** [check-am] Error 2
+ cat test-suite.log
cat: test-suite.log: No such file or directory
+ true
+ exit 1
error: Bad exit status from /var/tmp/rpm-tmp.ILV5bE (%check)
RPM build errors:
Bad exit status from /var/tmp/rpm-tmp.ILV5bE (%check)
Build step 'Execute shell' marked build as failure
1
1
[Libvirt-ci] Build failed in Jenkins: libvirt-master-rpm » libvirt-fedora-23 #358
by ci@centos.org 26 Oct '23
by ci@centos.org 26 Oct '23
26 Oct '23
See <https://ci.centos.org/job/libvirt-master-rpm/systems=libvirt-fedora-23/358/…>
------------------------------------------
[...truncated 304.20 KB...]
installing pt.gmo as /home/jenkins/rpmbuild/BUILDROOT/libvirt-3.4.0-1.fc23.x86_64/usr/share/locale/pt/LC_MESSAGES/libvirt.mo
installing pt_BR.gmo as /home/jenkins/rpmbuild/BUILDROOT/libvirt-3.4.0-1.fc23.x86_64/usr/share/locale/pt_BR/LC_MESSAGES/libvirt.mo
installing ro.gmo as /home/jenkins/rpmbuild/BUILDROOT/libvirt-3.4.0-1.fc23.x86_64/usr/share/locale/ro/LC_MESSAGES/libvirt.mo
installing ru.gmo as /home/jenkins/rpmbuild/BUILDROOT/libvirt-3.4.0-1.fc23.x86_64/usr/share/locale/ru/LC_MESSAGES/libvirt.mo
installing si.gmo as /home/jenkins/rpmbuild/BUILDROOT/libvirt-3.4.0-1.fc23.x86_64/usr/share/locale/si/LC_MESSAGES/libvirt.mo
installing sk.gmo as /home/jenkins/rpmbuild/BUILDROOT/libvirt-3.4.0-1.fc23.x86_64/usr/share/locale/sk/LC_MESSAGES/libvirt.mo
installing sl.gmo as /home/jenkins/rpmbuild/BUILDROOT/libvirt-3.4.0-1.fc23.x86_64/usr/share/locale/sl/LC_MESSAGES/libvirt.mo
installing sq.gmo as /home/jenkins/rpmbuild/BUILDROOT/libvirt-3.4.0-1.fc23.x86_64/usr/share/locale/sq/LC_MESSAGES/libvirt.mo
installing sr.gmo as /home/jenkins/rpmbuild/BUILDROOT/libvirt-3.4.0-1.fc23.x86_64/usr/share/locale/sr/LC_MESSAGES/libvirt.mo
installing sr(a)latin.gmo as /home/jenkins/rpmbuild/BUILDROOT/libvirt-3.4.0-1.fc23.x86_64/usr/share/locale/sr(a)latin/LC_MESSAGES/libvirt.mo
installing sv.gmo as /home/jenkins/rpmbuild/BUILDROOT/libvirt-3.4.0-1.fc23.x86_64/usr/share/locale/sv/LC_MESSAGES/libvirt.mo
installing ta.gmo as /home/jenkins/rpmbuild/BUILDROOT/libvirt-3.4.0-1.fc23.x86_64/usr/share/locale/ta/LC_MESSAGES/libvirt.mo
installing te.gmo as /home/jenkins/rpmbuild/BUILDROOT/libvirt-3.4.0-1.fc23.x86_64/usr/share/locale/te/LC_MESSAGES/libvirt.mo
installing tg.gmo as /home/jenkins/rpmbuild/BUILDROOT/libvirt-3.4.0-1.fc23.x86_64/usr/share/locale/tg/LC_MESSAGES/libvirt.mo
installing th.gmo as /home/jenkins/rpmbuild/BUILDROOT/libvirt-3.4.0-1.fc23.x86_64/usr/share/locale/th/LC_MESSAGES/libvirt.mo
installing tr.gmo as /home/jenkins/rpmbuild/BUILDROOT/libvirt-3.4.0-1.fc23.x86_64/usr/share/locale/tr/LC_MESSAGES/libvirt.mo
installing tw.gmo as /home/jenkins/rpmbuild/BUILDROOT/libvirt-3.4.0-1.fc23.x86_64/usr/share/locale/tw/LC_MESSAGES/libvirt.mo
installing uk.gmo as /home/jenkins/rpmbuild/BUILDROOT/libvirt-3.4.0-1.fc23.x86_64/usr/share/locale/uk/LC_MESSAGES/libvirt.mo
installing ur.gmo as /home/jenkins/rpmbuild/BUILDROOT/libvirt-3.4.0-1.fc23.x86_64/usr/share/locale/ur/LC_MESSAGES/libvirt.mo
installing vi.gmo as /home/jenkins/rpmbuild/BUILDROOT/libvirt-3.4.0-1.fc23.x86_64/usr/share/locale/vi/LC_MESSAGES/libvirt.mo
installing wba.gmo as /home/jenkins/rpmbuild/BUILDROOT/libvirt-3.4.0-1.fc23.x86_64/usr/share/locale/wba/LC_MESSAGES/libvirt.mo
installing yo.gmo as /home/jenkins/rpmbuild/BUILDROOT/libvirt-3.4.0-1.fc23.x86_64/usr/share/locale/yo/LC_MESSAGES/libvirt.mo
installing zh_CN.gmo as /home/jenkins/rpmbuild/BUILDROOT/libvirt-3.4.0-1.fc23.x86_64/usr/share/locale/zh_CN/LC_MESSAGES/libvirt.mo
installing zh_HK.gmo as /home/jenkins/rpmbuild/BUILDROOT/libvirt-3.4.0-1.fc23.x86_64/usr/share/locale/zh_HK/LC_MESSAGES/libvirt.mo
installing zh_TW.gmo as /home/jenkins/rpmbuild/BUILDROOT/libvirt-3.4.0-1.fc23.x86_64/usr/share/locale/zh_TW/LC_MESSAGES/libvirt.mo
installing zu.gmo as /home/jenkins/rpmbuild/BUILDROOT/libvirt-3.4.0-1.fc23.x86_64/usr/share/locale/zu/LC_MESSAGES/libvirt.mo
if test "libvirt" = "gettext-tools"; then \
/usr/bin/mkdir -p /home/jenkins/rpmbuild/BUILDROOT/libvirt-3.4.0-1.fc23.x86_64/usr/share/gettext/po; \
for file in Makefile.in.in remove-potcdate.sin quot.sed boldquot.sed en(a)quot.header en(a)boldquot.header insert-header.sin Rules-quot Makevars.template; do \
/usr/bin/install -c -m 644 ./$file \
/home/jenkins/rpmbuild/BUILDROOT/libvirt-3.4.0-1.fc23.x86_64/usr/share/gettext/po/$file; \
done; \
for file in Makevars; do \
rm -f /home/jenkins/rpmbuild/BUILDROOT/libvirt-3.4.0-1.fc23.x86_64/usr/share/gettext/po/$file; \
done; \
else \
: ; \
fi
make[1]: Leaving directory '/home/jenkins/rpmbuild/BUILD/libvirt-3.4.0/po'
Making install in examples
make[1]: Entering directory '/home/jenkins/rpmbuild/BUILD/libvirt-3.4.0/examples'
make[2]: Entering directory '/home/jenkins/rpmbuild/BUILD/libvirt-3.4.0/examples'
make[2]: Nothing to be done for 'install-exec-am'.
/usr/bin/mkdir -p ""/home/jenkins/rpmbuild/BUILDROOT/libvirt-3.4.0-1.fc23.x86_64/etc/libvirt/nwfilter""
for f in ./xml/nwfilter/qemu-announce-self.xml ./xml/nwfilter/no-ip-multicast.xml ./xml/nwfilter/no-ip-spoofing.xml ./xml/nwfilter/no-mac-spoofing.xml ./xml/nwfilter/allow-dhcp.xml ./xml/nwfilter/no-arp-spoofing.xml ./xml/nwfilter/clean-traffic.xml ./xml/nwfilter/no-arp-ip-spoofing.xml ./xml/nwfilter/allow-arp.xml ./xml/nwfilter/no-arp-mac-spoofing.xml ./xml/nwfilter/allow-ipv4.xml ./xml/nwfilter/no-other-l2-traffic.xml ./xml/nwfilter/allow-incoming-ipv4.xml ./xml/nwfilter/no-mac-broadcast.xml ./xml/nwfilter/allow-dhcp-server.xml ./xml/nwfilter/qemu-announce-self-rarp.xml ./xml/nwfilter/no-other-rarp-traffic.xml; do \
/usr/bin/install -c -m 644 $f ""/home/jenkins/rpmbuild/BUILDROOT/libvirt-3.4.0-1.fc23.x86_64/etc/libvirt/nwfilter""; \
done
make[2]: Leaving directory '/home/jenkins/rpmbuild/BUILD/libvirt-3.4.0/examples'
make[1]: Leaving directory '/home/jenkins/rpmbuild/BUILD/libvirt-3.4.0/examples'
+ make -j2 -C examples distclean
make: Entering directory '/home/jenkins/rpmbuild/BUILD/libvirt-3.4.0/examples'
rm -rf .libs _libs
rm -rf admin/.libs admin/_libs
rm -f dominfo/info1 dommigrate/dommigrate domsuspend/suspend domtop/domtop hellolibvirt/hellolibvirt object-events/event-test openauth/openauth rename/rename admin/list_servers admin/list_clients admin/threadpool_params admin/client_limits admin/client_info admin/client_close admin/logging
rm -rf dominfo/.libs dominfo/_libs
rm -rf dommigrate/.libs dommigrate/_libs
rm -f *.o
rm -rf domsuspend/.libs domsuspend/_libs
rm -rf domtop/.libs domtop/_libs
rm -f admin/*.o
rm -rf hellolibvirt/.libs hellolibvirt/_libs
rm -f dominfo/*.o
rm -rf object-events/.libs object-events/_libs
rm -f dommigrate/*.o
rm -rf openauth/.libs openauth/_libs
rm -rf rename/.libs rename/_libs
rm -f domsuspend/*.o
rm -f *.lo
rm -f domtop/*.o
rm -f *.tab.c
rm -f hellolibvirt/*.o
test -z "" || rm -f
rm -f object-events/*.o
test . = "." || test -z "" || rm -f
rm -f openauth/*.o
rm -f admin/.deps/.dirstamp
rm -f admin/.dirstamp
rm -f rename/*.o
rm -f dominfo/.deps/.dirstamp
rm -f dominfo/.dirstamp
rm -f TAGS ID GTAGS GRTAGS GSYMS GPATH tags
rm -f dommigrate/.deps/.dirstamp
rm -f dommigrate/.dirstamp
rm -f domsuspend/.deps/.dirstamp
rm -f domsuspend/.dirstamp
rm -f domtop/.deps/.dirstamp
rm -f domtop/.dirstamp
rm -f hellolibvirt/.deps/.dirstamp
rm -f hellolibvirt/.dirstamp
rm -f object-events/.deps/.dirstamp
rm -f object-events/.dirstamp
rm -f openauth/.deps/.dirstamp
rm -f openauth/.dirstamp
rm -f rename/.deps/.dirstamp
rm -f rename/.dirstamp
rm -rf admin/.deps dominfo/.deps dommigrate/.deps domsuspend/.deps domtop/.deps hellolibvirt/.deps object-events/.deps openauth/.deps rename/.deps
rm -f Makefile
make: Leaving directory '/home/jenkins/rpmbuild/BUILD/libvirt-3.4.0/examples'
+ rm -f /home/jenkins/rpmbuild/BUILDROOT/libvirt-3.4.0-1.fc23.x86_64/usr/lib64/libnss_libvirt.la /home/jenkins/rpmbuild/BUILDROOT/libvirt-3.4.0-1.fc23.x86_64/usr/lib64/libnss_libvirt_guest.la /home/jenkins/rpmbuild/BUILDROOT/libvirt-3.4.0-1.fc23.x86_64/usr/lib64/libvirt-admin.la /home/jenkins/rpmbuild/BUILDROOT/libvirt-3.4.0-1.fc23.x86_64/usr/lib64/libvirt-lxc.la /home/jenkins/rpmbuild/BUILDROOT/libvirt-3.4.0-1.fc23.x86_64/usr/lib64/libvirt-qemu.la /home/jenkins/rpmbuild/BUILDROOT/libvirt-3.4.0-1.fc23.x86_64/usr/lib64/libvirt.la
+ rm -f '/home/jenkins/rpmbuild/BUILDROOT/libvirt-3.4.0-1.fc23.x86_64/usr/lib64/*.a'
+ rm -f /home/jenkins/rpmbuild/BUILDROOT/libvirt-3.4.0-1.fc23.x86_64/usr/lib64/libvirt/lock-driver/lockd.la /home/jenkins/rpmbuild/BUILDROOT/libvirt-3.4.0-1.fc23.x86_64/usr/lib64/libvirt/lock-driver/sanlock.la
+ rm -f '/home/jenkins/rpmbuild/BUILDROOT/libvirt-3.4.0-1.fc23.x86_64/usr/lib64/libvirt/lock-driver/*.a'
+ rm -f /home/jenkins/rpmbuild/BUILDROOT/libvirt-3.4.0-1.fc23.x86_64/usr/lib64/libvirt/connection-driver/libvirt_driver_interface.la /home/jenkins/rpmbuild/BUILDROOT/libvirt-3.4.0-1.fc23.x86_64/usr/lib64/libvirt/connection-driver/libvirt_driver_libxl.la /home/jenkins/rpmbuild/BUILDROOT/libvirt-3.4.0-1.fc23.x86_64/usr/lib64/libvirt/connection-driver/libvirt_driver_lxc.la /home/jenkins/rpmbuild/BUILDROOT/libvirt-3.4.0-1.fc23.x86_64/usr/lib64/libvirt/connection-driver/libvirt_driver_network.la /home/jenkins/rpmbuild/BUILDROOT/libvirt-3.4.0-1.fc23.x86_64/usr/lib64/libvirt/connection-driver/libvirt_driver_nodedev.la /home/jenkins/rpmbuild/BUILDROOT/libvirt-3.4.0-1.fc23.x86_64/usr/lib64/libvirt/connection-driver/libvirt_driver_nwfilter.la /home/jenkins/rpmbuild/BUILDROOT/libvirt-3.4.0-1.fc23.x86_64/usr/lib64/libvirt/connection-driver/libvirt_driver_qemu.la /home/jenkins/rpmbuild/BUILDROOT/libvirt-3.4.0-1.fc23.x86_64/usr/lib64/libvirt/connection-driver/libvirt_driver_secret.la /home/jenkins/rpmbuild/BUILDROOT/libvirt-3.4.0-1.fc23.x86_64/usr/lib64/libvirt/connection-driver/libvirt_driver_storage.la /home/jenkins/rpmbuild/BUILDROOT/libvirt-3.4.0-1.fc23.x86_64/usr/lib64/libvirt/connection-driver/libvirt_driver_uml.la /home/jenkins/rpmbuild/BUILDROOT/libvirt-3.4.0-1.fc23.x86_64/usr/lib64/libvirt/connection-driver/libvirt_driver_vbox.la /home/jenkins/rpmbuild/BUILDROOT/libvirt-3.4.0-1.fc23.x86_64/usr/lib64/libvirt/connection-driver/libvirt_driver_xen.la
+ rm -f '/home/jenkins/rpmbuild/BUILDROOT/libvirt-3.4.0-1.fc23.x86_64/usr/lib64/libvirt/connection-driver/*.a'
+ rm -f /home/jenkins/rpmbuild/BUILDROOT/libvirt-3.4.0-1.fc23.x86_64/usr/lib64/libvirt/storage-backend/libvirt_storage_backend_disk.la /home/jenkins/rpmbuild/BUILDROOT/libvirt-3.4.0-1.fc23.x86_64/usr/lib64/libvirt/storage-backend/libvirt_storage_backend_fs.la /home/jenkins/rpmbuild/BUILDROOT/libvirt-3.4.0-1.fc23.x86_64/usr/lib64/libvirt/storage-backend/libvirt_storage_backend_gluster.la /home/jenkins/rpmbuild/BUILDROOT/libvirt-3.4.0-1.fc23.x86_64/usr/lib64/libvirt/storage-backend/libvirt_storage_backend_iscsi.la /home/jenkins/rpmbuild/BUILDROOT/libvirt-3.4.0-1.fc23.x86_64/usr/lib64/libvirt/storage-backend/libvirt_storage_backend_logical.la /home/jenkins/rpmbuild/BUILDROOT/libvirt-3.4.0-1.fc23.x86_64/usr/lib64/libvirt/storage-backend/libvirt_storage_backend_mpath.la /home/jenkins/rpmbuild/BUILDROOT/libvirt-3.4.0-1.fc23.x86_64/usr/lib64/libvirt/storage-backend/libvirt_storage_backend_rbd.la /home/jenkins/rpmbuild/BUILDROOT/libvirt-3.4.0-1.fc23.x86_64/usr/lib64/libvirt/storage-backend/libvirt_storage_backend_scsi.la /home/jenkins/rpmbuild/BUILDROOT/libvirt-3.4.0-1.fc23.x86_64/usr/lib64/libvirt/storage-backend/libvirt_storage_backend_sheepdog.la
+ rm -f '/home/jenkins/rpmbuild/BUILDROOT/libvirt-3.4.0-1.fc23.x86_64/usr/lib64/libvirt/storage-backend/*.a'
+ rm -f /home/jenkins/rpmbuild/BUILDROOT/libvirt-3.4.0-1.fc23.x86_64/usr/lib64/wireshark/plugins/1.12.12/libvirt.la
+ mv /home/jenkins/rpmbuild/BUILDROOT/libvirt-3.4.0-1.fc23.x86_64/usr/lib64/wireshark/plugins/1.12.12/libvirt.so /home/jenkins/rpmbuild/BUILDROOT/libvirt-3.4.0-1.fc23.x86_64/usr/lib64/wireshark/plugins/libvirt.so
+ install -d -m 0755 /home/jenkins/rpmbuild/BUILDROOT/libvirt-3.4.0-1.fc23.x86_64/usr/share/lib/libvirt/dnsmasq/
+ install -d -m 0755 /home/jenkins/rpmbuild/BUILDROOT/libvirt-3.4.0-1.fc23.x86_64/usr/share/libvirt/networks/
+ cp /home/jenkins/rpmbuild/BUILDROOT/libvirt-3.4.0-1.fc23.x86_64/etc/libvirt/qemu/networks/default.xml /home/jenkins/rpmbuild/BUILDROOT/libvirt-3.4.0-1.fc23.x86_64/usr/share/libvirt/networks/default.xml
+ rm -f /home/jenkins/rpmbuild/BUILDROOT/libvirt-3.4.0-1.fc23.x86_64/etc/libvirt/qemu/networks/default.xml
+ rm -f /home/jenkins/rpmbuild/BUILDROOT/libvirt-3.4.0-1.fc23.x86_64/etc/libvirt/qemu/networks/autostart/default.xml
+ install -d -m 0755 /home/jenkins/rpmbuild/BUILDROOT/libvirt-3.4.0-1.fc23.x86_64/usr/share/libvirt/nwfilter/
+ cp -a /home/jenkins/rpmbuild/BUILDROOT/libvirt-3.4.0-1.fc23.x86_64/etc/libvirt/nwfilter/allow-arp.xml /home/jenkins/rpmbuild/BUILDROOT/libvirt-3.4.0-1.fc23.x86_64/etc/libvirt/nwfilter/allow-dhcp-server.xml /home/jenkins/rpmbuild/BUILDROOT/libvirt-3.4.0-1.fc23.x86_64/etc/libvirt/nwfilter/allow-dhcp.xml /home/jenkins/rpmbuild/BUILDROOT/libvirt-3.4.0-1.fc23.x86_64/etc/libvirt/nwfilter/allow-incoming-ipv4.xml /home/jenkins/rpmbuild/BUILDROOT/libvirt-3.4.0-1.fc23.x86_64/etc/libvirt/nwfilter/allow-ipv4.xml /home/jenkins/rpmbuild/BUILDROOT/libvirt-3.4.0-1.fc23.x86_64/etc/libvirt/nwfilter/clean-traffic.xml /home/jenkins/rpmbuild/BUILDROOT/libvirt-3.4.0-1.fc23.x86_64/etc/libvirt/nwfilter/no-arp-ip-spoofing.xml /home/jenkins/rpmbuild/BUILDROOT/libvirt-3.4.0-1.fc23.x86_64/etc/libvirt/nwfilter/no-arp-mac-spoofing.xml /home/jenkins/rpmbuild/BUILDROOT/libvirt-3.4.0-1.fc23.x86_64/etc/libvirt/nwfilter/no-arp-spoofing.xml /home/jenkins/rpmbuild/BUILDROOT/libvirt-3.4.0-1.fc23.x86_64/etc/libvirt/nwfilter/no-ip-multicast.xml /home/jenkins/rpmbuild/BUILDROOT/libvirt-3.4.0-1.fc23.x86_64/etc/libvirt/nwfilter/no-ip-spoofing.xml /home/jenkins/rpmbuild/BUILDROOT/libvirt-3.4.0-1.fc23.x86_64/etc/libvirt/nwfilter/no-mac-broadcast.xml /home/jenkins/rpmbuild/BUILDROOT/libvirt-3.4.0-1.fc23.x86_64/etc/libvirt/nwfilter/no-mac-spoofing.xml /home/jenkins/rpmbuild/BUILDROOT/libvirt-3.4.0-1.fc23.x86_64/etc/libvirt/nwfilter/no-other-l2-traffic.xml /home/jenkins/rpmbuild/BUILDROOT/libvirt-3.4.0-1.fc23.x86_64/etc/libvirt/nwfilter/no-other-rarp-traffic.xml /home/jenkins/rpmbuild/BUILDROOT/libvirt-3.4.0-1.fc23.x86_64/etc/libvirt/nwfilter/qemu-announce-self-rarp.xml /home/jenkins/rpmbuild/BUILDROOT/libvirt-3.4.0-1.fc23.x86_64/etc/libvirt/nwfilter/qemu-announce-self.xml /home/jenkins/rpmbuild/BUILDROOT/libvirt-3.4.0-1.fc23.x86_64/usr/share/libvirt/nwfilter/
+ sed -i -e '/<uuid>/d' /home/jenkins/rpmbuild/BUILDROOT/libvirt-3.4.0-1.fc23.x86_64/usr/share/libvirt/networks/default.xml
+ /usr/lib/rpm/find-lang.sh /home/jenkins/rpmbuild/BUILDROOT/libvirt-3.4.0-1.fc23.x86_64 libvirt
+ mv /home/jenkins/rpmbuild/BUILDROOT/libvirt-3.4.0-1.fc23.x86_64/usr/share/doc/libvirt-3.4.0 libvirt-docs
+ mv /home/jenkins/rpmbuild/BUILDROOT/libvirt-3.4.0-1.fc23.x86_64/usr/share/systemtap/tapset/libvirt_probes.stp /home/jenkins/rpmbuild/BUILDROOT/libvirt-3.4.0-1.fc23.x86_64/usr/share/systemtap/tapset/libvirt_probes-64.stp
+ mv /home/jenkins/rpmbuild/BUILDROOT/libvirt-3.4.0-1.fc23.x86_64/usr/share/systemtap/tapset/libvirt_qemu_probes.stp /home/jenkins/rpmbuild/BUILDROOT/libvirt-3.4.0-1.fc23.x86_64/usr/share/systemtap/tapset/libvirt_qemu_probes-64.stp
+ /usr/lib/rpm/find-debuginfo.sh --strict-build-id -m --run-dwz --dwz-low-mem-die-limit 10000000 --dwz-max-die-limit 110000000 /home/jenkins/rpmbuild/BUILD/libvirt-3.4.0
extracting debug info from /home/jenkins/rpmbuild/BUILDROOT/libvirt-3.4.0-1.fc23.x86_64/usr/lib64/libvirt-admin.so.0.3004.0
extracting debug info from /home/jenkins/rpmbuild/BUILDROOT/libvirt-3.4.0-1.fc23.x86_64/usr/lib64/libvirt-lxc.so.0.3004.0
extracting debug info from /home/jenkins/rpmbuild/BUILDROOT/libvirt-3.4.0-1.fc23.x86_64/usr/lib64/libvirt/lock-driver/sanlock.so
extracting debug info from /home/jenkins/rpmbuild/BUILDROOT/libvirt-3.4.0-1.fc23.x86_64/usr/lib64/libvirt/lock-driver/lockd.so
extracting debug info from /home/jenkins/rpmbuild/BUILDROOT/libvirt-3.4.0-1.fc23.x86_64/usr/lib64/libvirt/storage-backend/libvirt_storage_backend_gluster.so
extracting debug info from /home/jenkins/rpmbuild/BUILDROOT/libvirt-3.4.0-1.fc23.x86_64/usr/lib64/libvirt/storage-backend/libvirt_storage_backend_mpath.so
extracting debug info from /home/jenkins/rpmbuild/BUILDROOT/libvirt-3.4.0-1.fc23.x86_64/usr/lib64/libvirt/storage-backend/libvirt_storage_backend_iscsi.so
extracting debug info from /home/jenkins/rpmbuild/BUILDROOT/libvirt-3.4.0-1.fc23.x86_64/usr/lib64/libvirt/storage-backend/libvirt_storage_backend_rbd.so
extracting debug info from /home/jenkins/rpmbuild/BUILDROOT/libvirt-3.4.0-1.fc23.x86_64/usr/lib64/libvirt/storage-backend/libvirt_storage_backend_fs.so
extracting debug info from /home/jenkins/rpmbuild/BUILDROOT/libvirt-3.4.0-1.fc23.x86_64/usr/lib64/libvirt/storage-backend/libvirt_storage_backend_disk.so
extracting debug info from /home/jenkins/rpmbuild/BUILDROOT/libvirt-3.4.0-1.fc23.x86_64/usr/lib64/libvirt/storage-backend/libvirt_storage_backend_scsi.so
extracting debug info from /home/jenkins/rpmbuild/BUILDROOT/libvirt-3.4.0-1.fc23.x86_64/usr/lib64/libvirt/storage-backend/libvirt_storage_backend_logical.so
extracting debug info from /home/jenkins/rpmbuild/BUILDROOT/libvirt-3.4.0-1.fc23.x86_64/usr/lib64/libvirt/storage-backend/libvirt_storage_backend_sheepdog.so
extracting debug info from /home/jenkins/rpmbuild/BUILDROOT/libvirt-3.4.0-1.fc23.x86_64/usr/lib64/libvirt/connection-driver/libvirt_driver_lxc.so
extracting debug info from /home/jenkins/rpmbuild/BUILDROOT/libvirt-3.4.0-1.fc23.x86_64/usr/lib64/libvirt/connection-driver/libvirt_driver_nwfilter.so
extracting debug info from /home/jenkins/rpmbuild/BUILDROOT/libvirt-3.4.0-1.fc23.x86_64/usr/lib64/libvirt/connection-driver/libvirt_driver_vbox.so
extracting debug info from /home/jenkins/rpmbuild/BUILDROOT/libvirt-3.4.0-1.fc23.x86_64/usr/lib64/libvirt/connection-driver/libvirt_driver_interface.so
extracting debug info from /home/jenkins/rpmbuild/BUILDROOT/libvirt-3.4.0-1.fc23.x86_64/usr/lib64/libvirt/connection-driver/libvirt_driver_nodedev.so
extracting debug info from /home/jenkins/rpmbuild/BUILDROOT/libvirt-3.4.0-1.fc23.x86_64/usr/lib64/libvirt/connection-driver/libvirt_driver_storage.so
extracting debug info from /home/jenkins/rpmbuild/BUILDROOT/libvirt-3.4.0-1.fc23.x86_64/usr/lib64/libvirt/connection-driver/libvirt_driver_network.so
extracting debug info from /home/jenkins/rpmbuild/BUILDROOT/libvirt-3.4.0-1.fc23.x86_64/usr/lib64/libvirt/connection-driver/libvirt_driver_libxl.so
extracting debug info from /home/jenkins/rpmbuild/BUILDROOT/libvirt-3.4.0-1.fc23.x86_64/usr/lib64/libvirt/connection-driver/libvirt_driver_uml.so
extracting debug info from /home/jenkins/rpmbuild/BUILDROOT/libvirt-3.4.0-1.fc23.x86_64/usr/lib64/libvirt/connection-driver/libvirt_driver_xen.so
extracting debug info from /home/jenkins/rpmbuild/BUILDROOT/libvirt-3.4.0-1.fc23.x86_64/usr/lib64/libvirt/connection-driver/libvirt_driver_secret.so
extracting debug info from /home/jenkins/rpmbuild/BUILDROOT/libvirt-3.4.0-1.fc23.x86_64/usr/lib64/libvirt/connection-driver/libvirt_driver_qemu.so
extracting debug info from /home/jenkins/rpmbuild/BUILDROOT/libvirt-3.4.0-1.fc23.x86_64/usr/lib64/libnss_libvirt.so.2
extracting debug info from /home/jenkins/rpmbuild/BUILDROOT/libvirt-3.4.0-1.fc23.x86_64/usr/lib64/libnss_libvirt_guest.so.2
extracting debug info from /home/jenkins/rpmbuild/BUILDROOT/libvirt-3.4.0-1.fc23.x86_64/usr/lib64/libvirt.so.0.3004.0
extracting debug info from /home/jenkins/rpmbuild/BUILDROOT/libvirt-3.4.0-1.fc23.x86_64/usr/lib64/libvirt-qemu.so.0.3004.0
extracting debug info from /home/jenkins/rpmbuild/BUILDROOT/libvirt-3.4.0-1.fc23.x86_64/usr/lib64/wireshark/plugins/libvirt.so
extracting debug info from /home/jenkins/rpmbuild/BUILDROOT/libvirt-3.4.0-1.fc23.x86_64/usr/libexec/libvirt_lxc
extracting debug info from /home/jenkins/rpmbuild/BUILDROOT/libvirt-3.4.0-1.fc23.x86_64/usr/libexec/libvirt_leaseshelper
extracting debug info from /home/jenkins/rpmbuild/BUILDROOT/libvirt-3.4.0-1.fc23.x86_64/usr/libexec/libvirt_parthelper
extracting debug info from /home/jenkins/rpmbuild/BUILDROOT/libvirt-3.4.0-1.fc23.x86_64/usr/libexec/libvirt_sanlock_helper
extracting debug info from /home/jenkins/rpmbuild/BUILDROOT/libvirt-3.4.0-1.fc23.x86_64/usr/libexec/libvirt_iohelper
extracting debug info from /home/jenkins/rpmbuild/BUILDROOT/libvirt-3.4.0-1.fc23.x86_64/usr/bin/virt-login-shell
extracting debug info from /home/jenkins/rpmbuild/BUILDROOT/libvirt-3.4.0-1.fc23.x86_64/usr/bin/virt-admin
extracting debug info from /home/jenkins/rpmbuild/BUILDROOT/libvirt-3.4.0-1.fc23.x86_64/usr/bin/virt-host-validate
extracting debug info from /home/jenkins/rpmbuild/BUILDROOT/libvirt-3.4.0-1.fc23.x86_64/usr/bin/virsh
extracting debug info from /home/jenkins/rpmbuild/BUILDROOT/libvirt-3.4.0-1.fc23.x86_64/usr/sbin/libvirtd
extracting debug info from /home/jenkins/rpmbuild/BUILDROOT/libvirt-3.4.0-1.fc23.x86_64/usr/sbin/virtlogd
extracting debug info from /home/jenkins/rpmbuild/BUILDROOT/libvirt-3.4.0-1.fc23.x86_64/usr/sbin/virtlockd
/usr/lib/rpm/sepdebugcrcfix: Updated 42 CRC32s, 0 CRC32s did match.
symlinked /usr/lib/debug/usr/lib64/libvirt-admin.so.0.3004.0.debug to /usr/lib/debug/usr/lib64/libvirt-admin.so.0.debug
symlinked /usr/lib/debug/usr/lib64/libvirt-qemu.so.0.3004.0.debug to /usr/lib/debug/usr/lib64/libvirt-qemu.so.0.debug
symlinked /usr/lib/debug/usr/lib64/libvirt.so.0.3004.0.debug to /usr/lib/debug/usr/lib64/libvirt.so.debug
symlinked /usr/lib/debug/usr/lib64/libvirt-lxc.so.0.3004.0.debug to /usr/lib/debug/usr/lib64/libvirt-lxc.so.debug
symlinked /usr/lib/debug/usr/lib64/libvirt-admin.so.0.3004.0.debug to /usr/lib/debug/usr/lib64/libvirt-admin.so.debug
symlinked /usr/lib/debug/usr/lib64/libvirt.so.0.3004.0.debug to /usr/lib/debug/usr/lib64/libvirt.so.0.debug
symlinked /usr/lib/debug/usr/lib64/libvirt-lxc.so.0.3004.0.debug to /usr/lib/debug/usr/lib64/libvirt-lxc.so.0.debug
symlinked /usr/lib/debug/usr/lib64/libvirt-qemu.so.0.3004.0.debug to /usr/lib/debug/usr/lib64/libvirt-qemu.so.debug
50549 blocks
+ /usr/lib/rpm/check-buildroot
+ /usr/lib/rpm/brp-compress
+ /usr/lib/rpm/brp-strip-static-archive /usr/bin/strip
+ /usr/lib/rpm/brp-python-bytecompile /usr/bin/python 1
+ /usr/lib/rpm/brp-python-hardlink
+ /usr/lib/rpm/redhat/brp-java-repack-jars
Executing(%check): /bin/sh -e /var/tmp/rpm-tmp.ClnB4A
+ umask 022
+ cd /home/jenkins/rpmbuild/BUILD
+ cd libvirt-3.4.0
+ cd tests
+ for i in nodeinfotest seclabeltest
+ rm -f nodeinfotest
+ printf 'int main(void) { return 0; }'
+ printf '#!/bin/sh\nexit 0\n'
+ chmod +x nodeinfotest
+ for i in nodeinfotest seclabeltest
+ rm -f seclabeltest
+ printf 'int main(void) { return 0; }'
+ printf '#!/bin/sh\nexit 0\n'
+ chmod +x seclabeltest
+ make -j2 check VIR_TEST_DEBUG=1
make libshunload.la virportallocatormock.la virnetdaemonmock.la virnetserverclientmock.la vircgroupmock.la virpcimock.la virnetdevmock.la virrandommock.la virhostcpumock.la domaincapsmock.la virusbmock.la virnetdevbandwidthmock.la virnumamock.la virtestmock.la virdbusmock.la libqemumonitortestutils.la libqemutestdriver.la qemuxml2argvmock.la qemuxml2xmlmock.la qemucaps2xmlmock.la qemucapsprobemock.la qemucpumock.la nssmock.la virmacmapmock.la libsecurityselinuxhelper.la virshtest sockettest virhostcputest virbuftest commandtest seclabeltest virhashtest virconftest viratomictest utiltest shunloadtest virtimetest viruritest virkeyfiletest viralloctest virauthconfigtest virbitmaptest vircgrouptest vircryptotest virpcitest virendiantest virfiletest virfirewalltest viriscsitest virkeycodetest virlockspacetest virlogtest virrotatingfiletest virschematest virstringtest virportallocatortest sysinfotest virkmodtest vircapstest domaincapstest domainconftest virhostdevtest virnetdevtest virtypedparamtest virnetmessagetest virnetsockettest virnetdaemontest virnetserverclienttest virnettlscontexttest virnettlssessiontest fchosttest scsihosttest vircaps2xmltest fdstreamtest virdbustest virsystemdtest virpolkittest securityselinuxtest viridentitytest securityselinuxlabeltest virdrivermoduletest xml2sexprtest sexpr2xmltest xmconfigtest xencapstest xlconfigtest qemuxml2argvtest qemuxml2xmltest qemuargv2xmltest qemuhelptest domainsnapshotxml2xmltest qemumonitortest qemumonitorjsontest qemuhotplugtest qemuagenttest qemucapabilitiestest qemucaps2xmltest qemumemlocktest qemucommandutiltest lxcxml2xmltest lxcconf2xmltest openvzutilstest esxutilstest vboxsnapshotxmltest vmx2xmltest xml2vmxtest vmwarevertest jsontest networkxml2xmltest networkxml2xmlupdatetest networkxml2conftest networkxml2firewalltest storagebackendsheepdogtest nwfilterxml2xmltest nwfilterebiptablestest nwfilterxml2firewalltest storagevolxml2argvtest virstorageutiltest virstoragetest virscsitest nsstest nssguesttest storagevolxml2xmltest storagepoolxml2xmltest nodedevxml2xmltest interfacexml2xmltest cputest metadatatest secretxml2xmltest genericxml2xmltest virusbtest virnetdevbandwidthtest eventtest objecteventtest virmacmaptest commandhelper ssh qemucapsprobe nsslinktest nssguestlinktest
make[1]: Entering directory '/home/jenkins/rpmbuild/BUILD/libvirt-3.4.0/tests'
CC shunloadhelper.lo
CC virportallocatormock_la-virportallocatormock.lo
CC virnetdaemonmock_la-virnetdaemonmock.lo
CC virnetserverclientmock_la-virnetserverclientmock.lo
CC vircgroupmock_la-vircgroupmock.lo
CC virpcimock_la-virpcimock.lo
CC virnetdevmock_la-virnetdevmock.lo
CC virrandommock_la-virrandommock.lo
CC virhostcpumock_la-virhostcpumock.lo
CC domaincapsmock_la-domaincapsmock.lo
CC virusbmock_la-virusbmock.lo
CC virnetdevbandwidthmock_la-virnetdevbandwidthmock.lo
CC virnumamock_la-virnumamock.lo
CC virtestmock_la-virtestmock.lo
CC virdbusmock_la-virdbusmock.lo
CC qemumonitortestutils.lo
CCLD libqemutestdriver.la
CC qemuxml2argvmock_la-qemuxml2argvmock.lo
CC qemuxml2xmlmock_la-qemuxml2xmlmock.lo
CC qemucaps2xmlmock_la-qemucaps2xmlmock.lo
CC qemucapsprobemock_la-qemucapsprobemock.lo
CC qemucpumock_la-qemucpumock.lo
CC nssmock_la-nssmock.lo
CC virmacmapmock_la-virmacmapmock.lo
CC securityselinuxhelper.lo
CC virshtest.o
CC testutils.o
CC sockettest.o
CC virhostcputest.o
CC virfilewrapper.o
virfilewrapper.c:27:28: fatal error: virfilewrapper.h: No such file or directory
compilation terminated.
Makefile:5317: recipe for target 'virfilewrapper.o' failed
make[1]: *** [virfilewrapper.o] Error 1
make[1]: *** Waiting for unfinished jobs....
virhostcputest.c:13:28: fatal error: virfilewrapper.h: No such file or directory
compilation terminated.
Makefile:5317: recipe for target 'virhostcputest.o' failed
make[1]: *** [virhostcputest.o] Error 1
make[1]: Leaving directory '/home/jenkins/rpmbuild/BUILD/libvirt-3.4.0/tests'
Makefile:6987: recipe for target 'check-am' failed
make: *** [check-am] Error 2
+ cat test-suite.log
cat: test-suite.log: No such file or directory
+ true
+ exit 1
error: Bad exit status from /var/tmp/rpm-tmp.ClnB4A (%check)
RPM build errors:
Bad exit status from /var/tmp/rpm-tmp.ClnB4A (%check)
Build step 'Execute shell' marked build as failure
1
1
[Libvirt-ci] Build failed in Jenkins: libvirt-master-rpm » libvirt-centos-6 #358
by ci@centos.org 26 Oct '23
by ci@centos.org 26 Oct '23
26 Oct '23
See <https://ci.centos.org/job/libvirt-master-rpm/systems=libvirt-centos-6/358/d…>
------------------------------------------
[...truncated 286.49 KB...]
installing sq.gmo as /home/jenkins/rpmbuild/BUILDROOT/libvirt-3.4.0-1.el6.x86_64/usr/share/locale/sq/LC_MESSAGES/libvirt.mo
installing sr.gmo as /home/jenkins/rpmbuild/BUILDROOT/libvirt-3.4.0-1.el6.x86_64/usr/share/locale/sr/LC_MESSAGES/libvirt.mo
installing sr(a)latin.gmo as /home/jenkins/rpmbuild/BUILDROOT/libvirt-3.4.0-1.el6.x86_64/usr/share/locale/sr(a)latin/LC_MESSAGES/libvirt.mo
installing sv.gmo as /home/jenkins/rpmbuild/BUILDROOT/libvirt-3.4.0-1.el6.x86_64/usr/share/locale/sv/LC_MESSAGES/libvirt.mo
installing ta.gmo as /home/jenkins/rpmbuild/BUILDROOT/libvirt-3.4.0-1.el6.x86_64/usr/share/locale/ta/LC_MESSAGES/libvirt.mo
installing te.gmo as /home/jenkins/rpmbuild/BUILDROOT/libvirt-3.4.0-1.el6.x86_64/usr/share/locale/te/LC_MESSAGES/libvirt.mo
installing tg.gmo as /home/jenkins/rpmbuild/BUILDROOT/libvirt-3.4.0-1.el6.x86_64/usr/share/locale/tg/LC_MESSAGES/libvirt.mo
installing th.gmo as /home/jenkins/rpmbuild/BUILDROOT/libvirt-3.4.0-1.el6.x86_64/usr/share/locale/th/LC_MESSAGES/libvirt.mo
installing tr.gmo as /home/jenkins/rpmbuild/BUILDROOT/libvirt-3.4.0-1.el6.x86_64/usr/share/locale/tr/LC_MESSAGES/libvirt.mo
installing tw.gmo as /home/jenkins/rpmbuild/BUILDROOT/libvirt-3.4.0-1.el6.x86_64/usr/share/locale/tw/LC_MESSAGES/libvirt.mo
installing uk.gmo as /home/jenkins/rpmbuild/BUILDROOT/libvirt-3.4.0-1.el6.x86_64/usr/share/locale/uk/LC_MESSAGES/libvirt.mo
installing ur.gmo as /home/jenkins/rpmbuild/BUILDROOT/libvirt-3.4.0-1.el6.x86_64/usr/share/locale/ur/LC_MESSAGES/libvirt.mo
installing vi.gmo as /home/jenkins/rpmbuild/BUILDROOT/libvirt-3.4.0-1.el6.x86_64/usr/share/locale/vi/LC_MESSAGES/libvirt.mo
installing wba.gmo as /home/jenkins/rpmbuild/BUILDROOT/libvirt-3.4.0-1.el6.x86_64/usr/share/locale/wba/LC_MESSAGES/libvirt.mo
installing yo.gmo as /home/jenkins/rpmbuild/BUILDROOT/libvirt-3.4.0-1.el6.x86_64/usr/share/locale/yo/LC_MESSAGES/libvirt.mo
installing zh_CN.gmo as /home/jenkins/rpmbuild/BUILDROOT/libvirt-3.4.0-1.el6.x86_64/usr/share/locale/zh_CN/LC_MESSAGES/libvirt.mo
installing zh_HK.gmo as /home/jenkins/rpmbuild/BUILDROOT/libvirt-3.4.0-1.el6.x86_64/usr/share/locale/zh_HK/LC_MESSAGES/libvirt.mo
installing zh_TW.gmo as /home/jenkins/rpmbuild/BUILDROOT/libvirt-3.4.0-1.el6.x86_64/usr/share/locale/zh_TW/LC_MESSAGES/libvirt.mo
installing zu.gmo as /home/jenkins/rpmbuild/BUILDROOT/libvirt-3.4.0-1.el6.x86_64/usr/share/locale/zu/LC_MESSAGES/libvirt.mo
if test "libvirt" = "gettext-tools"; then \
/bin/mkdir -p /home/jenkins/rpmbuild/BUILDROOT/libvirt-3.4.0-1.el6.x86_64/usr/share/gettext/po; \
for file in Makefile.in.in remove-potcdate.sin quot.sed boldquot.sed en(a)quot.header en(a)boldquot.header insert-header.sin Rules-quot Makevars.template; do \
/usr/bin/install -c -m 644 ./$file \
/home/jenkins/rpmbuild/BUILDROOT/libvirt-3.4.0-1.el6.x86_64/usr/share/gettext/po/$file; \
done; \
for file in Makevars; do \
rm -f /home/jenkins/rpmbuild/BUILDROOT/libvirt-3.4.0-1.el6.x86_64/usr/share/gettext/po/$file; \
done; \
else \
: ; \
fi
make[1]: Leaving directory `/home/jenkins/rpmbuild/BUILD/libvirt-3.4.0/po'
Making install in examples
make[1]: Entering directory `/home/jenkins/rpmbuild/BUILD/libvirt-3.4.0/examples'
make[2]: Entering directory `/home/jenkins/rpmbuild/BUILD/libvirt-3.4.0/examples'
make[2]: Nothing to be done for `install-exec-am'.
test -z "" || /bin/mkdir -p "/home/jenkins/rpmbuild/BUILDROOT/libvirt-3.4.0-1.el6.x86_64"
test -z "" || /bin/mkdir -p "/home/jenkins/rpmbuild/BUILDROOT/libvirt-3.4.0-1.el6.x86_64"
/bin/mkdir -p ""/home/jenkins/rpmbuild/BUILDROOT/libvirt-3.4.0-1.el6.x86_64/etc/libvirt/nwfilter""
test -z "" || /bin/mkdir -p "/home/jenkins/rpmbuild/BUILDROOT/libvirt-3.4.0-1.el6.x86_64"
for f in ./xml/nwfilter/allow-arp.xml ./xml/nwfilter/allow-dhcp-server.xml ./xml/nwfilter/allow-dhcp.xml ./xml/nwfilter/allow-incoming-ipv4.xml ./xml/nwfilter/allow-ipv4.xml ./xml/nwfilter/clean-traffic.xml ./xml/nwfilter/no-arp-ip-spoofing.xml ./xml/nwfilter/no-arp-mac-spoofing.xml ./xml/nwfilter/no-arp-spoofing.xml ./xml/nwfilter/no-ip-multicast.xml ./xml/nwfilter/no-ip-spoofing.xml ./xml/nwfilter/no-mac-broadcast.xml ./xml/nwfilter/no-mac-spoofing.xml ./xml/nwfilter/no-other-l2-traffic.xml ./xml/nwfilter/no-other-rarp-traffic.xml ./xml/nwfilter/qemu-announce-self-rarp.xml ./xml/nwfilter/qemu-announce-self.xml; do \
/usr/bin/install -c -m 644 $f ""/home/jenkins/rpmbuild/BUILDROOT/libvirt-3.4.0-1.el6.x86_64/etc/libvirt/nwfilter""; \
done
make[2]: Leaving directory `/home/jenkins/rpmbuild/BUILD/libvirt-3.4.0/examples'
make[1]: Leaving directory `/home/jenkins/rpmbuild/BUILD/libvirt-3.4.0/examples'
+ make -j2 -C examples distclean
make: Entering directory `/home/jenkins/rpmbuild/BUILD/libvirt-3.4.0/examples'
rm -rf .libs _libs
rm -rf admin/.libs admin/_libs
rm -rf dominfo/.libs dominfo/_libs
rm -rf dommigrate/.libs dommigrate/_libs
rm -rf domsuspend/.libs domsuspend/_libs
rm -rf domtop/.libs domtop/_libs
rm -rf hellolibvirt/.libs hellolibvirt/_libs
rm -rf object-events/.libs object-events/_libs
rm -rf openauth/.libs openauth/_libs
rm -rf rename/.libs rename/_libs
rm -f dominfo/info1 dommigrate/dommigrate domsuspend/suspend domtop/domtop hellolibvirt/hellolibvirt object-events/event-test openauth/openauth rename/rename admin/list_servers admin/list_clients admin/threadpool_params admin/client_limits admin/client_info admin/client_close admin/logging
rm -f *.o
rm -f admin/client_close.o
rm -f admin/client_info.o
rm -f admin/client_limits.o
rm -f *.lo
rm -f admin/list_clients.o
rm -f admin/list_servers.o
rm -f admin/logging.o
rm -f *.tab.c
rm -f admin/threadpool_params.o
test -z "" || rm -f
test . = "." || test -z "" || rm -f
rm -f dominfo/info1.o
rm -f admin/.deps/.dirstamp
rm -f dommigrate/dommigrate.o
rm -f admin/.dirstamp
rm -f domsuspend/suspend.o
rm -f dominfo/.deps/.dirstamp
rm -f domtop/domtop.o
rm -f dominfo/.dirstamp
rm -f hellolibvirt/hellolibvirt.o
rm -f object-events/object_events_event_test-event-test.o
rm -f dommigrate/.deps/.dirstamp
rm -f openauth/openauth.o
rm -f dommigrate/.dirstamp
rm -f domsuspend/.deps/.dirstamp
rm -f rename/rename.o
rm -f domsuspend/.dirstamp
rm -f TAGS ID GTAGS GRTAGS GSYMS GPATH tags
rm -f domtop/.deps/.dirstamp
rm -f domtop/.dirstamp
rm -f hellolibvirt/.deps/.dirstamp
rm -f hellolibvirt/.dirstamp
rm -f object-events/.deps/.dirstamp
rm -f object-events/.dirstamp
rm -f openauth/.deps/.dirstamp
rm -f openauth/.dirstamp
rm -f rename/.deps/.dirstamp
rm -f rename/.dirstamp
rm -rf admin/.deps dominfo/.deps dommigrate/.deps domsuspend/.deps domtop/.deps hellolibvirt/.deps object-events/.deps openauth/.deps rename/.deps
rm -f Makefile
make: Leaving directory `/home/jenkins/rpmbuild/BUILD/libvirt-3.4.0/examples'
+ rm -f /home/jenkins/rpmbuild/BUILDROOT/libvirt-3.4.0-1.el6.x86_64/usr/lib64/libnss_libvirt.la /home/jenkins/rpmbuild/BUILDROOT/libvirt-3.4.0-1.el6.x86_64/usr/lib64/libnss_libvirt_guest.la /home/jenkins/rpmbuild/BUILDROOT/libvirt-3.4.0-1.el6.x86_64/usr/lib64/libvirt-admin.la /home/jenkins/rpmbuild/BUILDROOT/libvirt-3.4.0-1.el6.x86_64/usr/lib64/libvirt-lxc.la /home/jenkins/rpmbuild/BUILDROOT/libvirt-3.4.0-1.el6.x86_64/usr/lib64/libvirt-qemu.la /home/jenkins/rpmbuild/BUILDROOT/libvirt-3.4.0-1.el6.x86_64/usr/lib64/libvirt.la
+ rm -f '/home/jenkins/rpmbuild/BUILDROOT/libvirt-3.4.0-1.el6.x86_64/usr/lib64/*.a'
+ rm -f /home/jenkins/rpmbuild/BUILDROOT/libvirt-3.4.0-1.el6.x86_64/usr/lib64/libvirt/lock-driver/lockd.la /home/jenkins/rpmbuild/BUILDROOT/libvirt-3.4.0-1.el6.x86_64/usr/lib64/libvirt/lock-driver/sanlock.la
+ rm -f '/home/jenkins/rpmbuild/BUILDROOT/libvirt-3.4.0-1.el6.x86_64/usr/lib64/libvirt/lock-driver/*.a'
+ rm -f /home/jenkins/rpmbuild/BUILDROOT/libvirt-3.4.0-1.el6.x86_64/usr/lib64/libvirt/connection-driver/libvirt_driver_interface.la /home/jenkins/rpmbuild/BUILDROOT/libvirt-3.4.0-1.el6.x86_64/usr/lib64/libvirt/connection-driver/libvirt_driver_lxc.la /home/jenkins/rpmbuild/BUILDROOT/libvirt-3.4.0-1.el6.x86_64/usr/lib64/libvirt/connection-driver/libvirt_driver_network.la /home/jenkins/rpmbuild/BUILDROOT/libvirt-3.4.0-1.el6.x86_64/usr/lib64/libvirt/connection-driver/libvirt_driver_nodedev.la /home/jenkins/rpmbuild/BUILDROOT/libvirt-3.4.0-1.el6.x86_64/usr/lib64/libvirt/connection-driver/libvirt_driver_nwfilter.la /home/jenkins/rpmbuild/BUILDROOT/libvirt-3.4.0-1.el6.x86_64/usr/lib64/libvirt/connection-driver/libvirt_driver_qemu.la /home/jenkins/rpmbuild/BUILDROOT/libvirt-3.4.0-1.el6.x86_64/usr/lib64/libvirt/connection-driver/libvirt_driver_secret.la /home/jenkins/rpmbuild/BUILDROOT/libvirt-3.4.0-1.el6.x86_64/usr/lib64/libvirt/connection-driver/libvirt_driver_storage.la
+ rm -f '/home/jenkins/rpmbuild/BUILDROOT/libvirt-3.4.0-1.el6.x86_64/usr/lib64/libvirt/connection-driver/*.a'
+ rm -f /home/jenkins/rpmbuild/BUILDROOT/libvirt-3.4.0-1.el6.x86_64/usr/lib64/libvirt/storage-backend/libvirt_storage_backend_disk.la /home/jenkins/rpmbuild/BUILDROOT/libvirt-3.4.0-1.el6.x86_64/usr/lib64/libvirt/storage-backend/libvirt_storage_backend_fs.la /home/jenkins/rpmbuild/BUILDROOT/libvirt-3.4.0-1.el6.x86_64/usr/lib64/libvirt/storage-backend/libvirt_storage_backend_gluster.la /home/jenkins/rpmbuild/BUILDROOT/libvirt-3.4.0-1.el6.x86_64/usr/lib64/libvirt/storage-backend/libvirt_storage_backend_iscsi.la /home/jenkins/rpmbuild/BUILDROOT/libvirt-3.4.0-1.el6.x86_64/usr/lib64/libvirt/storage-backend/libvirt_storage_backend_logical.la /home/jenkins/rpmbuild/BUILDROOT/libvirt-3.4.0-1.el6.x86_64/usr/lib64/libvirt/storage-backend/libvirt_storage_backend_mpath.la /home/jenkins/rpmbuild/BUILDROOT/libvirt-3.4.0-1.el6.x86_64/usr/lib64/libvirt/storage-backend/libvirt_storage_backend_scsi.la
+ rm -f '/home/jenkins/rpmbuild/BUILDROOT/libvirt-3.4.0-1.el6.x86_64/usr/lib64/libvirt/storage-backend/*.a'
+ install -d -m 0755 /home/jenkins/rpmbuild/BUILDROOT/libvirt-3.4.0-1.el6.x86_64/usr/share/lib/libvirt/dnsmasq/
+ install -d -m 0755 /home/jenkins/rpmbuild/BUILDROOT/libvirt-3.4.0-1.el6.x86_64/usr/share/libvirt/networks/
+ cp /home/jenkins/rpmbuild/BUILDROOT/libvirt-3.4.0-1.el6.x86_64/etc/libvirt/qemu/networks/default.xml /home/jenkins/rpmbuild/BUILDROOT/libvirt-3.4.0-1.el6.x86_64/usr/share/libvirt/networks/default.xml
+ rm -f /home/jenkins/rpmbuild/BUILDROOT/libvirt-3.4.0-1.el6.x86_64/etc/libvirt/qemu/networks/default.xml
+ rm -f /home/jenkins/rpmbuild/BUILDROOT/libvirt-3.4.0-1.el6.x86_64/etc/libvirt/qemu/networks/autostart/default.xml
+ install -d -m 0755 /home/jenkins/rpmbuild/BUILDROOT/libvirt-3.4.0-1.el6.x86_64/usr/share/libvirt/nwfilter/
+ cp -a /home/jenkins/rpmbuild/BUILDROOT/libvirt-3.4.0-1.el6.x86_64/etc/libvirt/nwfilter/allow-arp.xml /home/jenkins/rpmbuild/BUILDROOT/libvirt-3.4.0-1.el6.x86_64/etc/libvirt/nwfilter/allow-dhcp-server.xml /home/jenkins/rpmbuild/BUILDROOT/libvirt-3.4.0-1.el6.x86_64/etc/libvirt/nwfilter/allow-dhcp.xml /home/jenkins/rpmbuild/BUILDROOT/libvirt-3.4.0-1.el6.x86_64/etc/libvirt/nwfilter/allow-incoming-ipv4.xml /home/jenkins/rpmbuild/BUILDROOT/libvirt-3.4.0-1.el6.x86_64/etc/libvirt/nwfilter/allow-ipv4.xml /home/jenkins/rpmbuild/BUILDROOT/libvirt-3.4.0-1.el6.x86_64/etc/libvirt/nwfilter/clean-traffic.xml /home/jenkins/rpmbuild/BUILDROOT/libvirt-3.4.0-1.el6.x86_64/etc/libvirt/nwfilter/no-arp-ip-spoofing.xml /home/jenkins/rpmbuild/BUILDROOT/libvirt-3.4.0-1.el6.x86_64/etc/libvirt/nwfilter/no-arp-mac-spoofing.xml /home/jenkins/rpmbuild/BUILDROOT/libvirt-3.4.0-1.el6.x86_64/etc/libvirt/nwfilter/no-arp-spoofing.xml /home/jenkins/rpmbuild/BUILDROOT/libvirt-3.4.0-1.el6.x86_64/etc/libvirt/nwfilter/no-ip-multicast.xml /home/jenkins/rpmbuild/BUILDROOT/libvirt-3.4.0-1.el6.x86_64/etc/libvirt/nwfilter/no-ip-spoofing.xml /home/jenkins/rpmbuild/BUILDROOT/libvirt-3.4.0-1.el6.x86_64/etc/libvirt/nwfilter/no-mac-broadcast.xml /home/jenkins/rpmbuild/BUILDROOT/libvirt-3.4.0-1.el6.x86_64/etc/libvirt/nwfilter/no-mac-spoofing.xml /home/jenkins/rpmbuild/BUILDROOT/libvirt-3.4.0-1.el6.x86_64/etc/libvirt/nwfilter/no-other-l2-traffic.xml /home/jenkins/rpmbuild/BUILDROOT/libvirt-3.4.0-1.el6.x86_64/etc/libvirt/nwfilter/no-other-rarp-traffic.xml /home/jenkins/rpmbuild/BUILDROOT/libvirt-3.4.0-1.el6.x86_64/etc/libvirt/nwfilter/qemu-announce-self-rarp.xml /home/jenkins/rpmbuild/BUILDROOT/libvirt-3.4.0-1.el6.x86_64/etc/libvirt/nwfilter/qemu-announce-self.xml /home/jenkins/rpmbuild/BUILDROOT/libvirt-3.4.0-1.el6.x86_64/usr/share/libvirt/nwfilter/
+ sed -i -e '/<uuid>/d' /home/jenkins/rpmbuild/BUILDROOT/libvirt-3.4.0-1.el6.x86_64/usr/share/libvirt/networks/default.xml
+ /usr/lib/rpm/find-lang.sh /home/jenkins/rpmbuild/BUILDROOT/libvirt-3.4.0-1.el6.x86_64 libvirt
+ rm -rf /home/jenkins/rpmbuild/BUILDROOT/libvirt-3.4.0-1.el6.x86_64/etc/libvirt/libxl.conf
+ rm -rf /home/jenkins/rpmbuild/BUILDROOT/libvirt-3.4.0-1.el6.x86_64/etc/logrotate.d/libvirtd.libxl
+ rm -f /home/jenkins/rpmbuild/BUILDROOT/libvirt-3.4.0-1.el6.x86_64/usr/share/augeas/lenses/libvirtd_libxl.aug
+ rm -f /home/jenkins/rpmbuild/BUILDROOT/libvirt-3.4.0-1.el6.x86_64/usr/share/augeas/lenses/tests/test_libvirtd_libxl.aug
+ rm -rf /home/jenkins/rpmbuild/BUILDROOT/libvirt-3.4.0-1.el6.x86_64/etc/logrotate.d/libvirtd.uml
+ mv /home/jenkins/rpmbuild/BUILDROOT/libvirt-3.4.0-1.el6.x86_64/usr/share/doc/libvirt-3.4.0 libvirt-docs
+ mv /home/jenkins/rpmbuild/BUILDROOT/libvirt-3.4.0-1.el6.x86_64/usr/share/systemtap/tapset/libvirt_probes.stp /home/jenkins/rpmbuild/BUILDROOT/libvirt-3.4.0-1.el6.x86_64/usr/share/systemtap/tapset/libvirt_probes-64.stp
+ mv /home/jenkins/rpmbuild/BUILDROOT/libvirt-3.4.0-1.el6.x86_64/usr/share/systemtap/tapset/libvirt_qemu_probes.stp /home/jenkins/rpmbuild/BUILDROOT/libvirt-3.4.0-1.el6.x86_64/usr/share/systemtap/tapset/libvirt_qemu_probes-64.stp
+ /usr/lib/rpm/find-debuginfo.sh --strict-build-id /home/jenkins/rpmbuild/BUILD/libvirt-3.4.0
extracting debug info from /home/jenkins/rpmbuild/BUILDROOT/libvirt-3.4.0-1.el6.x86_64/usr/sbin/virtlogd
extracting debug info from /home/jenkins/rpmbuild/BUILDROOT/libvirt-3.4.0-1.el6.x86_64/usr/sbin/virtlockd
extracting debug info from /home/jenkins/rpmbuild/BUILDROOT/libvirt-3.4.0-1.el6.x86_64/usr/sbin/libvirtd
extracting debug info from /home/jenkins/rpmbuild/BUILDROOT/libvirt-3.4.0-1.el6.x86_64/usr/bin/virt-login-shell
extracting debug info from /home/jenkins/rpmbuild/BUILDROOT/libvirt-3.4.0-1.el6.x86_64/usr/bin/virt-host-validate
extracting debug info from /home/jenkins/rpmbuild/BUILDROOT/libvirt-3.4.0-1.el6.x86_64/usr/bin/virt-admin
extracting debug info from /home/jenkins/rpmbuild/BUILDROOT/libvirt-3.4.0-1.el6.x86_64/usr/bin/virsh
extracting debug info from /home/jenkins/rpmbuild/BUILDROOT/libvirt-3.4.0-1.el6.x86_64/usr/lib64/libnss_libvirt_guest.so.2
extracting debug info from /home/jenkins/rpmbuild/BUILDROOT/libvirt-3.4.0-1.el6.x86_64/usr/lib64/libvirt-admin.so.0.3004.0
extracting debug info from /home/jenkins/rpmbuild/BUILDROOT/libvirt-3.4.0-1.el6.x86_64/usr/lib64/libvirt.so.0.3004.0
extracting debug info from /home/jenkins/rpmbuild/BUILDROOT/libvirt-3.4.0-1.el6.x86_64/usr/lib64/libvirt/connection-driver/libvirt_driver_network.so
extracting debug info from /home/jenkins/rpmbuild/BUILDROOT/libvirt-3.4.0-1.el6.x86_64/usr/lib64/libvirt/connection-driver/libvirt_driver_qemu.so
extracting debug info from /home/jenkins/rpmbuild/BUILDROOT/libvirt-3.4.0-1.el6.x86_64/usr/lib64/libvirt/connection-driver/libvirt_driver_nwfilter.so
extracting debug info from /home/jenkins/rpmbuild/BUILDROOT/libvirt-3.4.0-1.el6.x86_64/usr/lib64/libvirt/connection-driver/libvirt_driver_storage.so
extracting debug info from /home/jenkins/rpmbuild/BUILDROOT/libvirt-3.4.0-1.el6.x86_64/usr/lib64/libvirt/connection-driver/libvirt_driver_lxc.so
extracting debug info from /home/jenkins/rpmbuild/BUILDROOT/libvirt-3.4.0-1.el6.x86_64/usr/lib64/libvirt/connection-driver/libvirt_driver_secret.so
extracting debug info from /home/jenkins/rpmbuild/BUILDROOT/libvirt-3.4.0-1.el6.x86_64/usr/lib64/libvirt/connection-driver/libvirt_driver_nodedev.so
extracting debug info from /home/jenkins/rpmbuild/BUILDROOT/libvirt-3.4.0-1.el6.x86_64/usr/lib64/libvirt/connection-driver/libvirt_driver_interface.so
extracting debug info from /home/jenkins/rpmbuild/BUILDROOT/libvirt-3.4.0-1.el6.x86_64/usr/lib64/libvirt/storage-backend/libvirt_storage_backend_disk.so
extracting debug info from /home/jenkins/rpmbuild/BUILDROOT/libvirt-3.4.0-1.el6.x86_64/usr/lib64/libvirt/storage-backend/libvirt_storage_backend_gluster.so
extracting debug info from /home/jenkins/rpmbuild/BUILDROOT/libvirt-3.4.0-1.el6.x86_64/usr/lib64/libvirt/storage-backend/libvirt_storage_backend_fs.so
extracting debug info from /home/jenkins/rpmbuild/BUILDROOT/libvirt-3.4.0-1.el6.x86_64/usr/lib64/libvirt/storage-backend/libvirt_storage_backend_logical.so
extracting debug info from /home/jenkins/rpmbuild/BUILDROOT/libvirt-3.4.0-1.el6.x86_64/usr/lib64/libvirt/storage-backend/libvirt_storage_backend_scsi.so
extracting debug info from /home/jenkins/rpmbuild/BUILDROOT/libvirt-3.4.0-1.el6.x86_64/usr/lib64/libvirt/storage-backend/libvirt_storage_backend_iscsi.so
extracting debug info from /home/jenkins/rpmbuild/BUILDROOT/libvirt-3.4.0-1.el6.x86_64/usr/lib64/libvirt/storage-backend/libvirt_storage_backend_mpath.so
extracting debug info from /home/jenkins/rpmbuild/BUILDROOT/libvirt-3.4.0-1.el6.x86_64/usr/lib64/libvirt/lock-driver/lockd.so
extracting debug info from /home/jenkins/rpmbuild/BUILDROOT/libvirt-3.4.0-1.el6.x86_64/usr/lib64/libvirt/lock-driver/sanlock.so
extracting debug info from /home/jenkins/rpmbuild/BUILDROOT/libvirt-3.4.0-1.el6.x86_64/usr/lib64/libnss_libvirt.so.2
extracting debug info from /home/jenkins/rpmbuild/BUILDROOT/libvirt-3.4.0-1.el6.x86_64/usr/lib64/libvirt-lxc.so.0.3004.0
extracting debug info from /home/jenkins/rpmbuild/BUILDROOT/libvirt-3.4.0-1.el6.x86_64/usr/lib64/libvirt-qemu.so.0.3004.0
extracting debug info from /home/jenkins/rpmbuild/BUILDROOT/libvirt-3.4.0-1.el6.x86_64/usr/libexec/libvirt_iohelper
extracting debug info from /home/jenkins/rpmbuild/BUILDROOT/libvirt-3.4.0-1.el6.x86_64/usr/libexec/libvirt_sanlock_helper
extracting debug info from /home/jenkins/rpmbuild/BUILDROOT/libvirt-3.4.0-1.el6.x86_64/usr/libexec/libvirt_leaseshelper
extracting debug info from /home/jenkins/rpmbuild/BUILDROOT/libvirt-3.4.0-1.el6.x86_64/usr/libexec/libvirt_lxc
extracting debug info from /home/jenkins/rpmbuild/BUILDROOT/libvirt-3.4.0-1.el6.x86_64/usr/libexec/libvirt_parthelper
symlinked /usr/lib/debug/usr/lib64/libvirt-admin.so.0.3004.0.debug to /usr/lib/debug/usr/lib64/libvirt-admin.so.debug
symlinked /usr/lib/debug/usr/lib64/libvirt-qemu.so.0.3004.0.debug to /usr/lib/debug/usr/lib64/libvirt-qemu.so.debug
symlinked /usr/lib/debug/usr/lib64/libvirt-lxc.so.0.3004.0.debug to /usr/lib/debug/usr/lib64/libvirt-lxc.so.debug
symlinked /usr/lib/debug/usr/lib64/libvirt.so.0.3004.0.debug to /usr/lib/debug/usr/lib64/libvirt.so.0.debug
symlinked /usr/lib/debug/usr/lib64/libvirt-lxc.so.0.3004.0.debug to /usr/lib/debug/usr/lib64/libvirt-lxc.so.0.debug
symlinked /usr/lib/debug/usr/lib64/libvirt.so.0.3004.0.debug to /usr/lib/debug/usr/lib64/libvirt.so.debug
symlinked /usr/lib/debug/usr/lib64/libvirt-admin.so.0.3004.0.debug to /usr/lib/debug/usr/lib64/libvirt-admin.so.0.debug
symlinked /usr/lib/debug/usr/lib64/libvirt-qemu.so.0.3004.0.debug to /usr/lib/debug/usr/lib64/libvirt-qemu.so.0.debug
35402 blocks
+ /usr/lib/rpm/check-buildroot
+ /usr/lib/rpm/redhat/brp-compress
+ /usr/lib/rpm/redhat/brp-strip-static-archive /usr/bin/strip
+ /usr/lib/rpm/redhat/brp-strip-comment-note /usr/bin/strip /usr/bin/objdump
+ /usr/lib/rpm/brp-python-bytecompile /usr/bin/python
+ /usr/lib/rpm/redhat/brp-python-hardlink
+ /usr/lib/rpm/redhat/brp-java-repack-jars
Executing(%check): /bin/sh -e /var/tmp/rpm-tmp.Z9Anrp
+ umask 022
+ cd /home/jenkins/rpmbuild/BUILD
+ cd libvirt-3.4.0
+ unset DISPLAY
+ cd tests
+ for i in nodeinfotest seclabeltest
+ rm -f nodeinfotest
+ printf 'int main(void) { return 0; }'
+ printf '#!/bin/sh\nexit 0\n'
+ chmod +x nodeinfotest
+ for i in nodeinfotest seclabeltest
+ rm -f seclabeltest
+ printf 'int main(void) { return 0; }'
+ printf '#!/bin/sh\nexit 0\n'
+ chmod +x seclabeltest
+ make -j2 check VIR_TEST_DEBUG=1
make libshunload.la virportallocatormock.la virnetdaemonmock.la virnetserverclientmock.la vircgroupmock.la virpcimock.la virnetdevmock.la virrandommock.la virhostcpumock.la domaincapsmock.la virusbmock.la virnetdevbandwidthmock.la virnumamock.la virtestmock.la virdbusmock.la libqemumonitortestutils.la libqemutestdriver.la qemuxml2argvmock.la qemuxml2xmlmock.la qemucaps2xmlmock.la qemucapsprobemock.la qemucpumock.la nssmock.la virmacmapmock.la libsecurityselinuxhelper.la virshtest sockettest virhostcputest virbuftest commandtest seclabeltest virhashtest virconftest viratomictest utiltest shunloadtest virtimetest viruritest virkeyfiletest viralloctest virauthconfigtest virbitmaptest vircgrouptest vircryptotest virpcitest virendiantest virfiletest virfirewalltest viriscsitest virkeycodetest virlockspacetest virlogtest virrotatingfiletest virschematest virstringtest virportallocatortest sysinfotest virkmodtest vircapstest domaincapstest domainconftest virhostdevtest virnetdevtest virtypedparamtest virnetmessagetest virnetsockettest virnetdaemontest virnetserverclienttest virnettlscontexttest virnettlssessiontest fchosttest scsihosttest vircaps2xmltest fdstreamtest virdbustest virsystemdtest virpolkittest securityselinuxtest viridentitytest securityselinuxlabeltest virdrivermoduletest qemuxml2argvtest qemuxml2xmltest qemuargv2xmltest qemuhelptest domainsnapshotxml2xmltest qemumonitortest qemumonitorjsontest qemuhotplugtest qemuagenttest qemucapabilitiestest qemucaps2xmltest qemumemlocktest qemucommandutiltest lxcxml2xmltest lxcconf2xmltest esxutilstest vmx2xmltest xml2vmxtest jsontest networkxml2xmltest networkxml2xmlupdatetest networkxml2conftest networkxml2firewalltest nwfilterxml2xmltest nwfilterebiptablestest nwfilterxml2firewalltest storagevolxml2argvtest virstorageutiltest virstoragetest virscsitest nsstest nssguesttest storagevolxml2xmltest storagepoolxml2xmltest nodedevxml2xmltest interfacexml2xmltest cputest metadatatest secretxml2xmltest genericxml2xmltest virusbtest virnetdevbandwidthtest eventtest objecteventtest virmacmaptest commandhelper ssh qemucapsprobe nsslinktest nssguestlinktest
make[1]: Entering directory `/home/jenkins/rpmbuild/BUILD/libvirt-3.4.0/tests'
CC shunloadhelper.lo
CC virportallocatormock_la-virportallocatormock.lo
CC virnetdaemonmock_la-virnetdaemonmock.lo
CC virnetserverclientmock_la-virnetserverclientmock.lo
CC vircgroupmock_la-vircgroupmock.lo
CC virpcimock_la-virpcimock.lo
CC virnetdevmock_la-virnetdevmock.lo
CC virrandommock_la-virrandommock.lo
CC virhostcpumock_la-virhostcpumock.lo
CC domaincapsmock_la-domaincapsmock.lo
CC virusbmock_la-virusbmock.lo
CC virnetdevbandwidthmock_la-virnetdevbandwidthmock.lo
CC virnumamock_la-virnumamock.lo
CC virtestmock_la-virtestmock.lo
CC virdbusmock_la-virdbusmock.lo
CC qemumonitortestutils.lo
CCLD libqemutestdriver.la
CC qemuxml2argvmock_la-qemuxml2argvmock.lo
CC qemuxml2xmlmock_la-qemuxml2xmlmock.lo
CC qemucaps2xmlmock_la-qemucaps2xmlmock.lo
CC qemucapsprobemock_la-qemucapsprobemock.lo
CC qemucpumock_la-qemucpumock.lo
CC nssmock_la-nssmock.lo
CC virmacmapmock_la-virmacmapmock.lo
CC securityselinuxhelper.lo
CC virshtest.o
CC testutils.o
CC sockettest.o
CC virhostcputest.o
CC virfilewrapper.o
virhostcputest.c:13:28: error: virfilewrapper.h: No such file or directory
cc1: warnings being treated as errors
virhostcputest.c: In function 'linuxTestHostCPU':
virhostcputest.c:183: error: implicit declaration of function 'virFileWrapperAddPrefix' [-Wimplicit-function-declaration]
virhostcputest.c:183: error: nested extern declaration of 'virFileWrapperAddPrefix' [-Wnested-externs]
virhostcputest.c:185: error: implicit declaration of function 'virFileWrapperRemovePrefix' [-Wimplicit-function-declaration]
virhostcputest.c:185: error: nested extern declaration of 'virFileWrapperRemovePrefix' [-Wnested-externs]
make[1]: *** [virhostcputest.o] Error 1
make[1]: *** Waiting for unfinished jobs....
virfilewrapper.c:27:28: error: virfilewrapper.h: No such file or directory
make[1]: *** [virfilewrapper.o] Error 1
make[1]: Leaving directory `/home/jenkins/rpmbuild/BUILD/libvirt-3.4.0/tests'
make: *** [check-am] Error 2
+ cat test-suite.log
cat: test-suite.log: No such file or directory
+ true
+ exit 1
error: Bad exit status from /var/tmp/rpm-tmp.Z9Anrp (%check)
RPM build errors:
Bad exit status from /var/tmp/rpm-tmp.Z9Anrp (%check)
Build step 'Execute shell' marked build as failure
1
1
[Libvirt-ci] Build failed in Jenkins: libvirt-master-rpm » libvirt-centos-7 #358
by ci@centos.org 26 Oct '23
by ci@centos.org 26 Oct '23
26 Oct '23
See <https://ci.centos.org/job/libvirt-master-rpm/systems=libvirt-centos-7/358/d…>
------------------------------------------
[...truncated 291.38 KB...]
installing pa.gmo as /home/jenkins/rpmbuild/BUILDROOT/libvirt-3.4.0-1.el7.centos.x86_64/usr/share/locale/pa/LC_MESSAGES/libvirt.mo
installing pl.gmo as /home/jenkins/rpmbuild/BUILDROOT/libvirt-3.4.0-1.el7.centos.x86_64/usr/share/locale/pl/LC_MESSAGES/libvirt.mo
installing pt.gmo as /home/jenkins/rpmbuild/BUILDROOT/libvirt-3.4.0-1.el7.centos.x86_64/usr/share/locale/pt/LC_MESSAGES/libvirt.mo
installing pt_BR.gmo as /home/jenkins/rpmbuild/BUILDROOT/libvirt-3.4.0-1.el7.centos.x86_64/usr/share/locale/pt_BR/LC_MESSAGES/libvirt.mo
installing ro.gmo as /home/jenkins/rpmbuild/BUILDROOT/libvirt-3.4.0-1.el7.centos.x86_64/usr/share/locale/ro/LC_MESSAGES/libvirt.mo
installing ru.gmo as /home/jenkins/rpmbuild/BUILDROOT/libvirt-3.4.0-1.el7.centos.x86_64/usr/share/locale/ru/LC_MESSAGES/libvirt.mo
installing si.gmo as /home/jenkins/rpmbuild/BUILDROOT/libvirt-3.4.0-1.el7.centos.x86_64/usr/share/locale/si/LC_MESSAGES/libvirt.mo
installing sk.gmo as /home/jenkins/rpmbuild/BUILDROOT/libvirt-3.4.0-1.el7.centos.x86_64/usr/share/locale/sk/LC_MESSAGES/libvirt.mo
installing sl.gmo as /home/jenkins/rpmbuild/BUILDROOT/libvirt-3.4.0-1.el7.centos.x86_64/usr/share/locale/sl/LC_MESSAGES/libvirt.mo
installing sq.gmo as /home/jenkins/rpmbuild/BUILDROOT/libvirt-3.4.0-1.el7.centos.x86_64/usr/share/locale/sq/LC_MESSAGES/libvirt.mo
installing sr.gmo as /home/jenkins/rpmbuild/BUILDROOT/libvirt-3.4.0-1.el7.centos.x86_64/usr/share/locale/sr/LC_MESSAGES/libvirt.mo
installing sr(a)latin.gmo as /home/jenkins/rpmbuild/BUILDROOT/libvirt-3.4.0-1.el7.centos.x86_64/usr/share/locale/sr(a)latin/LC_MESSAGES/libvirt.mo
installing sv.gmo as /home/jenkins/rpmbuild/BUILDROOT/libvirt-3.4.0-1.el7.centos.x86_64/usr/share/locale/sv/LC_MESSAGES/libvirt.mo
installing ta.gmo as /home/jenkins/rpmbuild/BUILDROOT/libvirt-3.4.0-1.el7.centos.x86_64/usr/share/locale/ta/LC_MESSAGES/libvirt.mo
installing te.gmo as /home/jenkins/rpmbuild/BUILDROOT/libvirt-3.4.0-1.el7.centos.x86_64/usr/share/locale/te/LC_MESSAGES/libvirt.mo
installing tg.gmo as /home/jenkins/rpmbuild/BUILDROOT/libvirt-3.4.0-1.el7.centos.x86_64/usr/share/locale/tg/LC_MESSAGES/libvirt.mo
installing th.gmo as /home/jenkins/rpmbuild/BUILDROOT/libvirt-3.4.0-1.el7.centos.x86_64/usr/share/locale/th/LC_MESSAGES/libvirt.mo
installing tr.gmo as /home/jenkins/rpmbuild/BUILDROOT/libvirt-3.4.0-1.el7.centos.x86_64/usr/share/locale/tr/LC_MESSAGES/libvirt.mo
installing tw.gmo as /home/jenkins/rpmbuild/BUILDROOT/libvirt-3.4.0-1.el7.centos.x86_64/usr/share/locale/tw/LC_MESSAGES/libvirt.mo
installing uk.gmo as /home/jenkins/rpmbuild/BUILDROOT/libvirt-3.4.0-1.el7.centos.x86_64/usr/share/locale/uk/LC_MESSAGES/libvirt.mo
installing ur.gmo as /home/jenkins/rpmbuild/BUILDROOT/libvirt-3.4.0-1.el7.centos.x86_64/usr/share/locale/ur/LC_MESSAGES/libvirt.mo
installing vi.gmo as /home/jenkins/rpmbuild/BUILDROOT/libvirt-3.4.0-1.el7.centos.x86_64/usr/share/locale/vi/LC_MESSAGES/libvirt.mo
installing wba.gmo as /home/jenkins/rpmbuild/BUILDROOT/libvirt-3.4.0-1.el7.centos.x86_64/usr/share/locale/wba/LC_MESSAGES/libvirt.mo
installing yo.gmo as /home/jenkins/rpmbuild/BUILDROOT/libvirt-3.4.0-1.el7.centos.x86_64/usr/share/locale/yo/LC_MESSAGES/libvirt.mo
installing zh_CN.gmo as /home/jenkins/rpmbuild/BUILDROOT/libvirt-3.4.0-1.el7.centos.x86_64/usr/share/locale/zh_CN/LC_MESSAGES/libvirt.mo
installing zh_HK.gmo as /home/jenkins/rpmbuild/BUILDROOT/libvirt-3.4.0-1.el7.centos.x86_64/usr/share/locale/zh_HK/LC_MESSAGES/libvirt.mo
installing zh_TW.gmo as /home/jenkins/rpmbuild/BUILDROOT/libvirt-3.4.0-1.el7.centos.x86_64/usr/share/locale/zh_TW/LC_MESSAGES/libvirt.mo
installing zu.gmo as /home/jenkins/rpmbuild/BUILDROOT/libvirt-3.4.0-1.el7.centos.x86_64/usr/share/locale/zu/LC_MESSAGES/libvirt.mo
if test "libvirt" = "gettext-tools"; then \
/bin/mkdir -p /home/jenkins/rpmbuild/BUILDROOT/libvirt-3.4.0-1.el7.centos.x86_64/usr/share/gettext/po; \
for file in Makefile.in.in remove-potcdate.sin quot.sed boldquot.sed en(a)quot.header en(a)boldquot.header insert-header.sin Rules-quot Makevars.template; do \
/bin/install -c -m 644 ./$file \
/home/jenkins/rpmbuild/BUILDROOT/libvirt-3.4.0-1.el7.centos.x86_64/usr/share/gettext/po/$file; \
done; \
for file in Makevars; do \
rm -f /home/jenkins/rpmbuild/BUILDROOT/libvirt-3.4.0-1.el7.centos.x86_64/usr/share/gettext/po/$file; \
done; \
else \
: ; \
fi
make[1]: Leaving directory `/home/jenkins/rpmbuild/BUILD/libvirt-3.4.0/po'
Making install in examples
make[1]: Entering directory `/home/jenkins/rpmbuild/BUILD/libvirt-3.4.0/examples'
make[2]: Entering directory `/home/jenkins/rpmbuild/BUILD/libvirt-3.4.0/examples'
make[2]: Nothing to be done for `install-exec-am'.
/bin/mkdir -p ""/home/jenkins/rpmbuild/BUILDROOT/libvirt-3.4.0-1.el7.centos.x86_64/etc/libvirt/nwfilter""
for f in ./xml/nwfilter/qemu-announce-self.xml ./xml/nwfilter/no-ip-multicast.xml ./xml/nwfilter/no-ip-spoofing.xml ./xml/nwfilter/no-mac-spoofing.xml ./xml/nwfilter/allow-dhcp.xml ./xml/nwfilter/no-arp-spoofing.xml ./xml/nwfilter/clean-traffic.xml ./xml/nwfilter/no-arp-ip-spoofing.xml ./xml/nwfilter/allow-arp.xml ./xml/nwfilter/no-arp-mac-spoofing.xml ./xml/nwfilter/allow-ipv4.xml ./xml/nwfilter/no-other-l2-traffic.xml ./xml/nwfilter/allow-incoming-ipv4.xml ./xml/nwfilter/no-mac-broadcast.xml ./xml/nwfilter/allow-dhcp-server.xml ./xml/nwfilter/qemu-announce-self-rarp.xml ./xml/nwfilter/no-other-rarp-traffic.xml; do \
/bin/install -c -m 644 $f ""/home/jenkins/rpmbuild/BUILDROOT/libvirt-3.4.0-1.el7.centos.x86_64/etc/libvirt/nwfilter""; \
done
make[2]: Leaving directory `/home/jenkins/rpmbuild/BUILD/libvirt-3.4.0/examples'
make[1]: Leaving directory `/home/jenkins/rpmbuild/BUILD/libvirt-3.4.0/examples'
+ make -j2 -C examples distclean
make: Entering directory `/home/jenkins/rpmbuild/BUILD/libvirt-3.4.0/examples'
rm -rf .libs _libs
rm -rf admin/.libs admin/_libs
rm -rf dominfo/.libs dominfo/_libs
rm -f dominfo/info1 dommigrate/dommigrate domsuspend/suspend domtop/domtop hellolibvirt/hellolibvirt object-events/event-test openauth/openauth rename/rename admin/list_servers admin/list_clients admin/threadpool_params admin/client_limits admin/client_info admin/client_close admin/logging
rm -rf dommigrate/.libs dommigrate/_libs
rm -rf domsuspend/.libs domsuspend/_libs
rm -f *.o
rm -rf domtop/.libs domtop/_libs
rm -rf hellolibvirt/.libs hellolibvirt/_libs
rm -rf object-events/.libs object-events/_libs
rm -f admin/*.o
rm -rf openauth/.libs openauth/_libs
rm -rf rename/.libs rename/_libs
rm -f dominfo/*.o
rm -f *.lo
rm -f dommigrate/*.o
rm -f *.tab.c
rm -f domsuspend/*.o
test -z "" || rm -f
test . = "." || test -z "" || rm -f
rm -f domtop/*.o
rm -f admin/.deps/.dirstamp
rm -f admin/.dirstamp
rm -f dominfo/.deps/.dirstamp
rm -f dominfo/.dirstamp
rm -f hellolibvirt/*.o
rm -f dommigrate/.deps/.dirstamp
rm -f object-events/*.o
rm -f dommigrate/.dirstamp
rm -f domsuspend/.deps/.dirstamp
rm -f domsuspend/.dirstamp
rm -f domtop/.deps/.dirstamp
rm -f domtop/.dirstamp
rm -f hellolibvirt/.deps/.dirstamp
rm -f hellolibvirt/.dirstamp
rm -f openauth/*.o
rm -f object-events/.deps/.dirstamp
rm -f rename/*.o
rm -f object-events/.dirstamp
rm -f TAGS ID GTAGS GRTAGS GSYMS GPATH tags
rm -f openauth/.deps/.dirstamp
rm -f openauth/.dirstamp
rm -f rename/.deps/.dirstamp
rm -f rename/.dirstamp
rm -rf admin/.deps dominfo/.deps dommigrate/.deps domsuspend/.deps domtop/.deps hellolibvirt/.deps object-events/.deps openauth/.deps rename/.deps
rm -f Makefile
make: Leaving directory `/home/jenkins/rpmbuild/BUILD/libvirt-3.4.0/examples'
+ rm -f /home/jenkins/rpmbuild/BUILDROOT/libvirt-3.4.0-1.el7.centos.x86_64/usr/lib64/libnss_libvirt.la /home/jenkins/rpmbuild/BUILDROOT/libvirt-3.4.0-1.el7.centos.x86_64/usr/lib64/libnss_libvirt_guest.la /home/jenkins/rpmbuild/BUILDROOT/libvirt-3.4.0-1.el7.centos.x86_64/usr/lib64/libvirt-admin.la /home/jenkins/rpmbuild/BUILDROOT/libvirt-3.4.0-1.el7.centos.x86_64/usr/lib64/libvirt-lxc.la /home/jenkins/rpmbuild/BUILDROOT/libvirt-3.4.0-1.el7.centos.x86_64/usr/lib64/libvirt-qemu.la /home/jenkins/rpmbuild/BUILDROOT/libvirt-3.4.0-1.el7.centos.x86_64/usr/lib64/libvirt.la
+ rm -f '/home/jenkins/rpmbuild/BUILDROOT/libvirt-3.4.0-1.el7.centos.x86_64/usr/lib64/*.a'
+ rm -f /home/jenkins/rpmbuild/BUILDROOT/libvirt-3.4.0-1.el7.centos.x86_64/usr/lib64/libvirt/lock-driver/lockd.la /home/jenkins/rpmbuild/BUILDROOT/libvirt-3.4.0-1.el7.centos.x86_64/usr/lib64/libvirt/lock-driver/sanlock.la
+ rm -f '/home/jenkins/rpmbuild/BUILDROOT/libvirt-3.4.0-1.el7.centos.x86_64/usr/lib64/libvirt/lock-driver/*.a'
+ rm -f /home/jenkins/rpmbuild/BUILDROOT/libvirt-3.4.0-1.el7.centos.x86_64/usr/lib64/libvirt/connection-driver/libvirt_driver_interface.la /home/jenkins/rpmbuild/BUILDROOT/libvirt-3.4.0-1.el7.centos.x86_64/usr/lib64/libvirt/connection-driver/libvirt_driver_lxc.la /home/jenkins/rpmbuild/BUILDROOT/libvirt-3.4.0-1.el7.centos.x86_64/usr/lib64/libvirt/connection-driver/libvirt_driver_network.la /home/jenkins/rpmbuild/BUILDROOT/libvirt-3.4.0-1.el7.centos.x86_64/usr/lib64/libvirt/connection-driver/libvirt_driver_nodedev.la /home/jenkins/rpmbuild/BUILDROOT/libvirt-3.4.0-1.el7.centos.x86_64/usr/lib64/libvirt/connection-driver/libvirt_driver_nwfilter.la /home/jenkins/rpmbuild/BUILDROOT/libvirt-3.4.0-1.el7.centos.x86_64/usr/lib64/libvirt/connection-driver/libvirt_driver_qemu.la /home/jenkins/rpmbuild/BUILDROOT/libvirt-3.4.0-1.el7.centos.x86_64/usr/lib64/libvirt/connection-driver/libvirt_driver_secret.la /home/jenkins/rpmbuild/BUILDROOT/libvirt-3.4.0-1.el7.centos.x86_64/usr/lib64/libvirt/connection-driver/libvirt_driver_storage.la
+ rm -f '/home/jenkins/rpmbuild/BUILDROOT/libvirt-3.4.0-1.el7.centos.x86_64/usr/lib64/libvirt/connection-driver/*.a'
+ rm -f /home/jenkins/rpmbuild/BUILDROOT/libvirt-3.4.0-1.el7.centos.x86_64/usr/lib64/libvirt/storage-backend/libvirt_storage_backend_disk.la /home/jenkins/rpmbuild/BUILDROOT/libvirt-3.4.0-1.el7.centos.x86_64/usr/lib64/libvirt/storage-backend/libvirt_storage_backend_fs.la /home/jenkins/rpmbuild/BUILDROOT/libvirt-3.4.0-1.el7.centos.x86_64/usr/lib64/libvirt/storage-backend/libvirt_storage_backend_gluster.la /home/jenkins/rpmbuild/BUILDROOT/libvirt-3.4.0-1.el7.centos.x86_64/usr/lib64/libvirt/storage-backend/libvirt_storage_backend_iscsi.la /home/jenkins/rpmbuild/BUILDROOT/libvirt-3.4.0-1.el7.centos.x86_64/usr/lib64/libvirt/storage-backend/libvirt_storage_backend_logical.la /home/jenkins/rpmbuild/BUILDROOT/libvirt-3.4.0-1.el7.centos.x86_64/usr/lib64/libvirt/storage-backend/libvirt_storage_backend_mpath.la /home/jenkins/rpmbuild/BUILDROOT/libvirt-3.4.0-1.el7.centos.x86_64/usr/lib64/libvirt/storage-backend/libvirt_storage_backend_rbd.la /home/jenkins/rpmbuild/BUILDROOT/libvirt-3.4.0-1.el7.centos.x86_64/usr/lib64/libvirt/storage-backend/libvirt_storage_backend_scsi.la
+ rm -f '/home/jenkins/rpmbuild/BUILDROOT/libvirt-3.4.0-1.el7.centos.x86_64/usr/lib64/libvirt/storage-backend/*.a'
+ install -d -m 0755 /home/jenkins/rpmbuild/BUILDROOT/libvirt-3.4.0-1.el7.centos.x86_64/usr/share/lib/libvirt/dnsmasq/
+ install -d -m 0755 /home/jenkins/rpmbuild/BUILDROOT/libvirt-3.4.0-1.el7.centos.x86_64/usr/share/libvirt/networks/
+ cp /home/jenkins/rpmbuild/BUILDROOT/libvirt-3.4.0-1.el7.centos.x86_64/etc/libvirt/qemu/networks/default.xml /home/jenkins/rpmbuild/BUILDROOT/libvirt-3.4.0-1.el7.centos.x86_64/usr/share/libvirt/networks/default.xml
+ rm -f /home/jenkins/rpmbuild/BUILDROOT/libvirt-3.4.0-1.el7.centos.x86_64/etc/libvirt/qemu/networks/default.xml
+ rm -f /home/jenkins/rpmbuild/BUILDROOT/libvirt-3.4.0-1.el7.centos.x86_64/etc/libvirt/qemu/networks/autostart/default.xml
+ install -d -m 0755 /home/jenkins/rpmbuild/BUILDROOT/libvirt-3.4.0-1.el7.centos.x86_64/usr/share/libvirt/nwfilter/
+ cp -a /home/jenkins/rpmbuild/BUILDROOT/libvirt-3.4.0-1.el7.centos.x86_64/etc/libvirt/nwfilter/allow-arp.xml /home/jenkins/rpmbuild/BUILDROOT/libvirt-3.4.0-1.el7.centos.x86_64/etc/libvirt/nwfilter/allow-dhcp-server.xml /home/jenkins/rpmbuild/BUILDROOT/libvirt-3.4.0-1.el7.centos.x86_64/etc/libvirt/nwfilter/allow-dhcp.xml /home/jenkins/rpmbuild/BUILDROOT/libvirt-3.4.0-1.el7.centos.x86_64/etc/libvirt/nwfilter/allow-incoming-ipv4.xml /home/jenkins/rpmbuild/BUILDROOT/libvirt-3.4.0-1.el7.centos.x86_64/etc/libvirt/nwfilter/allow-ipv4.xml /home/jenkins/rpmbuild/BUILDROOT/libvirt-3.4.0-1.el7.centos.x86_64/etc/libvirt/nwfilter/clean-traffic.xml /home/jenkins/rpmbuild/BUILDROOT/libvirt-3.4.0-1.el7.centos.x86_64/etc/libvirt/nwfilter/no-arp-ip-spoofing.xml /home/jenkins/rpmbuild/BUILDROOT/libvirt-3.4.0-1.el7.centos.x86_64/etc/libvirt/nwfilter/no-arp-mac-spoofing.xml /home/jenkins/rpmbuild/BUILDROOT/libvirt-3.4.0-1.el7.centos.x86_64/etc/libvirt/nwfilter/no-arp-spoofing.xml /home/jenkins/rpmbuild/BUILDROOT/libvirt-3.4.0-1.el7.centos.x86_64/etc/libvirt/nwfilter/no-ip-multicast.xml /home/jenkins/rpmbuild/BUILDROOT/libvirt-3.4.0-1.el7.centos.x86_64/etc/libvirt/nwfilter/no-ip-spoofing.xml /home/jenkins/rpmbuild/BUILDROOT/libvirt-3.4.0-1.el7.centos.x86_64/etc/libvirt/nwfilter/no-mac-broadcast.xml /home/jenkins/rpmbuild/BUILDROOT/libvirt-3.4.0-1.el7.centos.x86_64/etc/libvirt/nwfilter/no-mac-spoofing.xml /home/jenkins/rpmbuild/BUILDROOT/libvirt-3.4.0-1.el7.centos.x86_64/etc/libvirt/nwfilter/no-other-l2-traffic.xml /home/jenkins/rpmbuild/BUILDROOT/libvirt-3.4.0-1.el7.centos.x86_64/etc/libvirt/nwfilter/no-other-rarp-traffic.xml /home/jenkins/rpmbuild/BUILDROOT/libvirt-3.4.0-1.el7.centos.x86_64/etc/libvirt/nwfilter/qemu-announce-self-rarp.xml /home/jenkins/rpmbuild/BUILDROOT/libvirt-3.4.0-1.el7.centos.x86_64/etc/libvirt/nwfilter/qemu-announce-self.xml /home/jenkins/rpmbuild/BUILDROOT/libvirt-3.4.0-1.el7.centos.x86_64/usr/share/libvirt/nwfilter/
+ sed -i -e '/<uuid>/d' /home/jenkins/rpmbuild/BUILDROOT/libvirt-3.4.0-1.el7.centos.x86_64/usr/share/libvirt/networks/default.xml
+ /usr/lib/rpm/find-lang.sh /home/jenkins/rpmbuild/BUILDROOT/libvirt-3.4.0-1.el7.centos.x86_64 libvirt
+ rm -rf /home/jenkins/rpmbuild/BUILDROOT/libvirt-3.4.0-1.el7.centos.x86_64/etc/libvirt/libxl.conf
+ rm -rf /home/jenkins/rpmbuild/BUILDROOT/libvirt-3.4.0-1.el7.centos.x86_64/etc/logrotate.d/libvirtd.libxl
+ rm -f /home/jenkins/rpmbuild/BUILDROOT/libvirt-3.4.0-1.el7.centos.x86_64/usr/share/augeas/lenses/libvirtd_libxl.aug
+ rm -f /home/jenkins/rpmbuild/BUILDROOT/libvirt-3.4.0-1.el7.centos.x86_64/usr/share/augeas/lenses/tests/test_libvirtd_libxl.aug
+ rm -rf /home/jenkins/rpmbuild/BUILDROOT/libvirt-3.4.0-1.el7.centos.x86_64/etc/logrotate.d/libvirtd.uml
+ mv /home/jenkins/rpmbuild/BUILDROOT/libvirt-3.4.0-1.el7.centos.x86_64/usr/share/doc/libvirt-3.4.0 libvirt-docs
+ mv /home/jenkins/rpmbuild/BUILDROOT/libvirt-3.4.0-1.el7.centos.x86_64/usr/share/systemtap/tapset/libvirt_probes.stp /home/jenkins/rpmbuild/BUILDROOT/libvirt-3.4.0-1.el7.centos.x86_64/usr/share/systemtap/tapset/libvirt_probes-64.stp
+ mv /home/jenkins/rpmbuild/BUILDROOT/libvirt-3.4.0-1.el7.centos.x86_64/usr/share/systemtap/tapset/libvirt_qemu_probes.stp /home/jenkins/rpmbuild/BUILDROOT/libvirt-3.4.0-1.el7.centos.x86_64/usr/share/systemtap/tapset/libvirt_qemu_probes-64.stp
+ /usr/lib/rpm/find-debuginfo.sh --strict-build-id -m --run-dwz --dwz-low-mem-die-limit 10000000 --dwz-max-die-limit 110000000 /home/jenkins/rpmbuild/BUILD/libvirt-3.4.0
extracting debug info from /home/jenkins/rpmbuild/BUILDROOT/libvirt-3.4.0-1.el7.centos.x86_64/usr/lib64/libvirt-admin.so.0.3004.0
extracting debug info from /home/jenkins/rpmbuild/BUILDROOT/libvirt-3.4.0-1.el7.centos.x86_64/usr/lib64/libvirt-lxc.so.0.3004.0
extracting debug info from /home/jenkins/rpmbuild/BUILDROOT/libvirt-3.4.0-1.el7.centos.x86_64/usr/lib64/libvirt-qemu.so.0.3004.0
extracting debug info from /home/jenkins/rpmbuild/BUILDROOT/libvirt-3.4.0-1.el7.centos.x86_64/usr/lib64/libnss_libvirt_guest.so.2
extracting debug info from /home/jenkins/rpmbuild/BUILDROOT/libvirt-3.4.0-1.el7.centos.x86_64/usr/lib64/libvirt.so.0.3004.0
extracting debug info from /home/jenkins/rpmbuild/BUILDROOT/libvirt-3.4.0-1.el7.centos.x86_64/usr/lib64/libnss_libvirt.so.2
extracting debug info from /home/jenkins/rpmbuild/BUILDROOT/libvirt-3.4.0-1.el7.centos.x86_64/usr/lib64/libvirt/lock-driver/sanlock.so
extracting debug info from /home/jenkins/rpmbuild/BUILDROOT/libvirt-3.4.0-1.el7.centos.x86_64/usr/lib64/libvirt/lock-driver/lockd.so
extracting debug info from /home/jenkins/rpmbuild/BUILDROOT/libvirt-3.4.0-1.el7.centos.x86_64/usr/lib64/libvirt/connection-driver/libvirt_driver_storage.so
extracting debug info from /home/jenkins/rpmbuild/BUILDROOT/libvirt-3.4.0-1.el7.centos.x86_64/usr/lib64/libvirt/connection-driver/libvirt_driver_interface.so
extracting debug info from /home/jenkins/rpmbuild/BUILDROOT/libvirt-3.4.0-1.el7.centos.x86_64/usr/lib64/libvirt/connection-driver/libvirt_driver_qemu.so
extracting debug info from /home/jenkins/rpmbuild/BUILDROOT/libvirt-3.4.0-1.el7.centos.x86_64/usr/lib64/libvirt/connection-driver/libvirt_driver_secret.so
extracting debug info from /home/jenkins/rpmbuild/BUILDROOT/libvirt-3.4.0-1.el7.centos.x86_64/usr/lib64/libvirt/connection-driver/libvirt_driver_nodedev.so
extracting debug info from /home/jenkins/rpmbuild/BUILDROOT/libvirt-3.4.0-1.el7.centos.x86_64/usr/lib64/libvirt/connection-driver/libvirt_driver_nwfilter.so
extracting debug info from /home/jenkins/rpmbuild/BUILDROOT/libvirt-3.4.0-1.el7.centos.x86_64/usr/lib64/libvirt/connection-driver/libvirt_driver_lxc.so
extracting debug info from /home/jenkins/rpmbuild/BUILDROOT/libvirt-3.4.0-1.el7.centos.x86_64/usr/lib64/libvirt/connection-driver/libvirt_driver_network.so
extracting debug info from /home/jenkins/rpmbuild/BUILDROOT/libvirt-3.4.0-1.el7.centos.x86_64/usr/lib64/libvirt/storage-backend/libvirt_storage_backend_disk.so
extracting debug info from /home/jenkins/rpmbuild/BUILDROOT/libvirt-3.4.0-1.el7.centos.x86_64/usr/lib64/libvirt/storage-backend/libvirt_storage_backend_iscsi.so
extracting debug info from /home/jenkins/rpmbuild/BUILDROOT/libvirt-3.4.0-1.el7.centos.x86_64/usr/lib64/libvirt/storage-backend/libvirt_storage_backend_scsi.so
extracting debug info from /home/jenkins/rpmbuild/BUILDROOT/libvirt-3.4.0-1.el7.centos.x86_64/usr/lib64/libvirt/storage-backend/libvirt_storage_backend_rbd.so
extracting debug info from /home/jenkins/rpmbuild/BUILDROOT/libvirt-3.4.0-1.el7.centos.x86_64/usr/lib64/libvirt/storage-backend/libvirt_storage_backend_logical.so
extracting debug info from /home/jenkins/rpmbuild/BUILDROOT/libvirt-3.4.0-1.el7.centos.x86_64/usr/lib64/libvirt/storage-backend/libvirt_storage_backend_fs.so
extracting debug info from /home/jenkins/rpmbuild/BUILDROOT/libvirt-3.4.0-1.el7.centos.x86_64/usr/lib64/libvirt/storage-backend/libvirt_storage_backend_mpath.so
extracting debug info from /home/jenkins/rpmbuild/BUILDROOT/libvirt-3.4.0-1.el7.centos.x86_64/usr/lib64/libvirt/storage-backend/libvirt_storage_backend_gluster.so
extracting debug info from /home/jenkins/rpmbuild/BUILDROOT/libvirt-3.4.0-1.el7.centos.x86_64/usr/sbin/libvirtd
extracting debug info from /home/jenkins/rpmbuild/BUILDROOT/libvirt-3.4.0-1.el7.centos.x86_64/usr/sbin/virtlogd
extracting debug info from /home/jenkins/rpmbuild/BUILDROOT/libvirt-3.4.0-1.el7.centos.x86_64/usr/sbin/virtlockd
extracting debug info from /home/jenkins/rpmbuild/BUILDROOT/libvirt-3.4.0-1.el7.centos.x86_64/usr/libexec/libvirt_parthelper
extracting debug info from /home/jenkins/rpmbuild/BUILDROOT/libvirt-3.4.0-1.el7.centos.x86_64/usr/libexec/libvirt_iohelper
extracting debug info from /home/jenkins/rpmbuild/BUILDROOT/libvirt-3.4.0-1.el7.centos.x86_64/usr/libexec/libvirt_sanlock_helper
extracting debug info from /home/jenkins/rpmbuild/BUILDROOT/libvirt-3.4.0-1.el7.centos.x86_64/usr/libexec/libvirt_leaseshelper
extracting debug info from /home/jenkins/rpmbuild/BUILDROOT/libvirt-3.4.0-1.el7.centos.x86_64/usr/libexec/libvirt_lxc
extracting debug info from /home/jenkins/rpmbuild/BUILDROOT/libvirt-3.4.0-1.el7.centos.x86_64/usr/bin/virt-login-shell
extracting debug info from /home/jenkins/rpmbuild/BUILDROOT/libvirt-3.4.0-1.el7.centos.x86_64/usr/bin/virt-host-validate
extracting debug info from /home/jenkins/rpmbuild/BUILDROOT/libvirt-3.4.0-1.el7.centos.x86_64/usr/bin/virt-admin
extracting debug info from /home/jenkins/rpmbuild/BUILDROOT/libvirt-3.4.0-1.el7.centos.x86_64/usr/bin/virsh
/usr/lib/rpm/sepdebugcrcfix: Updated 36 CRC32s, 0 CRC32s did match.
symlinked /usr/lib/debug/usr/lib64/libvirt-qemu.so.0.3004.0.debug to /usr/lib/debug/usr/lib64/libvirt-qemu.so.0.debug
symlinked /usr/lib/debug/usr/lib64/libvirt-admin.so.0.3004.0.debug to /usr/lib/debug/usr/lib64/libvirt-admin.so.0.debug
symlinked /usr/lib/debug/usr/lib64/libvirt-lxc.so.0.3004.0.debug to /usr/lib/debug/usr/lib64/libvirt-lxc.so.debug
symlinked /usr/lib/debug/usr/lib64/libvirt-qemu.so.0.3004.0.debug to /usr/lib/debug/usr/lib64/libvirt-qemu.so.debug
symlinked /usr/lib/debug/usr/lib64/libvirt.so.0.3004.0.debug to /usr/lib/debug/usr/lib64/libvirt.so.0.debug
symlinked /usr/lib/debug/usr/lib64/libvirt-admin.so.0.3004.0.debug to /usr/lib/debug/usr/lib64/libvirt-admin.so.debug
symlinked /usr/lib/debug/usr/lib64/libvirt.so.0.3004.0.debug to /usr/lib/debug/usr/lib64/libvirt.so.debug
symlinked /usr/lib/debug/usr/lib64/libvirt-lxc.so.0.3004.0.debug to /usr/lib/debug/usr/lib64/libvirt-lxc.so.0.debug
35890 blocks
+ /usr/lib/rpm/check-buildroot
+ /usr/lib/rpm/redhat/brp-compress
+ /usr/lib/rpm/redhat/brp-strip-static-archive /usr/bin/strip
+ /usr/lib/rpm/brp-python-bytecompile /usr/bin/python 1
+ /usr/lib/rpm/redhat/brp-python-hardlink
+ /usr/lib/rpm/redhat/brp-java-repack-jars
Executing(%check): /bin/sh -e /var/tmp/rpm-tmp.4jSpno
+ umask 022
+ cd /home/jenkins/rpmbuild/BUILD
+ cd libvirt-3.4.0
+ cd tests
+ for i in nodeinfotest seclabeltest
+ rm -f nodeinfotest
+ printf 'int main(void) { return 0; }'
+ printf '#!/bin/sh\nexit 0\n'
+ chmod +x nodeinfotest
+ for i in nodeinfotest seclabeltest
+ rm -f seclabeltest
+ printf 'int main(void) { return 0; }'
+ printf '#!/bin/sh\nexit 0\n'
+ chmod +x seclabeltest
+ make -j2 check VIR_TEST_DEBUG=1
make libshunload.la virportallocatormock.la virnetdaemonmock.la virnetserverclientmock.la vircgroupmock.la virpcimock.la virnetdevmock.la virrandommock.la virhostcpumock.la domaincapsmock.la virusbmock.la virnetdevbandwidthmock.la virnumamock.la virtestmock.la virdbusmock.la libqemumonitortestutils.la libqemutestdriver.la qemuxml2argvmock.la qemuxml2xmlmock.la qemucaps2xmlmock.la qemucapsprobemock.la qemucpumock.la nssmock.la virmacmapmock.la libsecurityselinuxhelper.la virshtest sockettest virhostcputest virbuftest commandtest seclabeltest virhashtest virconftest viratomictest utiltest shunloadtest virtimetest viruritest virkeyfiletest viralloctest virauthconfigtest virbitmaptest vircgrouptest vircryptotest virpcitest virendiantest virfiletest virfirewalltest viriscsitest virkeycodetest virlockspacetest virlogtest virrotatingfiletest virschematest virstringtest virportallocatortest sysinfotest virkmodtest vircapstest domaincapstest domainconftest virhostdevtest virnetdevtest virtypedparamtest virnetmessagetest virnetsockettest virnetdaemontest virnetserverclienttest virnettlscontexttest virnettlssessiontest fchosttest scsihosttest vircaps2xmltest fdstreamtest virdbustest virsystemdtest virpolkittest securityselinuxtest viridentitytest securityselinuxlabeltest virdrivermoduletest qemuxml2argvtest qemuxml2xmltest qemuargv2xmltest qemuhelptest domainsnapshotxml2xmltest qemumonitortest qemumonitorjsontest qemuhotplugtest qemuagenttest qemucapabilitiestest qemucaps2xmltest qemumemlocktest qemucommandutiltest lxcxml2xmltest lxcconf2xmltest esxutilstest vmx2xmltest xml2vmxtest jsontest networkxml2xmltest networkxml2xmlupdatetest networkxml2conftest networkxml2firewalltest nwfilterxml2xmltest nwfilterebiptablestest nwfilterxml2firewalltest storagevolxml2argvtest virstorageutiltest virstoragetest virscsitest nsstest nssguesttest storagevolxml2xmltest storagepoolxml2xmltest nodedevxml2xmltest interfacexml2xmltest cputest metadatatest secretxml2xmltest genericxml2xmltest virusbtest virnetdevbandwidthtest eventtest objecteventtest virmacmaptest commandhelper ssh qemucapsprobe nsslinktest nssguestlinktest
make[1]: Entering directory `/home/jenkins/rpmbuild/BUILD/libvirt-3.4.0/tests'
CC shunloadhelper.lo
CC virportallocatormock_la-virportallocatormock.lo
CC virnetdaemonmock_la-virnetdaemonmock.lo
CC virnetserverclientmock_la-virnetserverclientmock.lo
CC vircgroupmock_la-vircgroupmock.lo
CC virpcimock_la-virpcimock.lo
CC virnetdevmock_la-virnetdevmock.lo
CC virrandommock_la-virrandommock.lo
CC virhostcpumock_la-virhostcpumock.lo
CC domaincapsmock_la-domaincapsmock.lo
CC virusbmock_la-virusbmock.lo
CC virnetdevbandwidthmock_la-virnetdevbandwidthmock.lo
CC virnumamock_la-virnumamock.lo
CC virtestmock_la-virtestmock.lo
CC virdbusmock_la-virdbusmock.lo
CC qemumonitortestutils.lo
CCLD libqemutestdriver.la
CC qemuxml2argvmock_la-qemuxml2argvmock.lo
CC qemuxml2xmlmock_la-qemuxml2xmlmock.lo
CC qemucaps2xmlmock_la-qemucaps2xmlmock.lo
CC qemucapsprobemock_la-qemucapsprobemock.lo
CC qemucpumock_la-qemucpumock.lo
CC nssmock_la-nssmock.lo
CC virmacmapmock_la-virmacmapmock.lo
CC securityselinuxhelper.lo
CC virshtest.o
CC testutils.o
CC sockettest.o
CC virhostcputest.o
virhostcputest.c:13:28: fatal error: virfilewrapper.h: No such file or directory
#include "virfilewrapper.h"
^
compilation terminated.
CC virfilewrapper.o
virfilewrapper.c:27:28: fatal error: virfilewrapper.h: No such file or directory
#include "virfilewrapper.h"
^
compilation terminated.
make[1]: *** [virfilewrapper.o] Error 1
make[1]: *** Waiting for unfinished jobs....
make[1]: *** [virhostcputest.o] Error 1
make[1]: Leaving directory `/home/jenkins/rpmbuild/BUILD/libvirt-3.4.0/tests'
make: *** [check-am] Error 2
+ cat test-suite.log
cat: test-suite.log: No such file or directory
+ true
+ exit 1
error: Bad exit status from /var/tmp/rpm-tmp.4jSpno (%check)
RPM build errors:
Bad exit status from /var/tmp/rpm-tmp.4jSpno (%check)
Build step 'Execute shell' marked build as failure
1
1
[Libvirt-ci] Build failed in Jenkins: virt-manager-master-check » libvirt-centos-7 #512
by ci@centos.org 26 Oct '23
by ci@centos.org 26 Oct '23
26 Oct '23
See <https://ci.centos.org/job/virt-manager-master-check/systems=libvirt-centos-…>
------------------------------------------
Started by upstream project "virt-manager-master-check" build number 512
originally caused by:
Started by upstream project "virt-manager-master-build" build number 516
originally caused by:
Started by an SCM change
Started by an SCM change
Started by upstream project "libvirt-python-master-build" build number 402
originally caused by:
Started by upstream project "libvirt-master-build" build number 530
originally caused by:
Started by an SCM change
[EnvInject] - Loading node environment variables.
Building remotely on libvirt-centos-7 (libvirt) in workspace <https://ci.centos.org/job/virt-manager-master-check/systems=libvirt-centos-…>
[virt-manager-master] $ /bin/sh -xe /tmp/hudson4517815183538313100.sh
+ python setup.py test
running test
........................................................................................................................................................................................................................................................................................................................................................................................................................................
----------------------------------------------------------------------
Ran 424 tests in 210.656s
OK
/tmp/hudson4517815183538313100.sh: line 2: 3051 Segmentation fault (core dumped) python setup.py test
Build step 'Execute shell' marked build as failure
1
1
[Libvirt-ci] Build failed in Jenkins: libvirt-perl-master-build » libvirt-fedora-24 #423
by ci@centos.org 26 Oct '23
by ci@centos.org 26 Oct '23
26 Oct '23
See <https://ci.centos.org/job/libvirt-perl-master-build/systems=libvirt-fedora-…>
Changes:
[berrange] Set date for 3.3.0 release
[berrange] Post release version bump
------------------------------------------
Started by upstream project "libvirt-perl-master-build" build number 423
originally caused by:
Started by an SCM change
Started by an SCM change
Started by an SCM change
Started by an SCM change
Started by an SCM change
Started by an SCM change
Started by an SCM change
Started by an SCM change
Started by an SCM change
Started by an SCM change
Started by an SCM change
Started by an SCM change
Started by an SCM change
Started by an SCM change
Started by an SCM change
Started by an SCM change
Started by an SCM change
Started by an SCM change
Started by an SCM change
Started by an SCM change
Started by an SCM change
Started by an SCM change
Started by an SCM change
Started by an SCM change
Started by an SCM change
Started by an SCM change
Started by an SCM change
Started by an SCM change
Started by an SCM change
Started by an SCM change
Started by an SCM change
Started by an SCM change
Started by an SCM change
Started by an SCM change
Started by an SCM change
Started by an SCM change
Started by an SCM change
Started by an SCM change
Started by an SCM change
Started by an SCM change
Started by an SCM change
Started by an SCM change
Started by an SCM change
Started by an SCM change
Started by an SCM change
Started by an SCM change
Started by an SCM change
Started by an SCM change
Started by an SCM change
Started by an SCM change
Started by an SCM change
Started by an SCM change
Started by an SCM change
Started by an SCM change
Started by an SCM change
Started by an SCM change
Started by an SCM change
Started by an SCM change
Started by an SCM change
Started by an SCM change
Started by an SCM change
Started by an SCM change
Started by an SCM change
Started by an SCM change
Started by an SCM change
Started by an SCM change
Started by an SCM change
Started by an SCM change
Started by an SCM change
Started by an SCM change
Started by an SCM change
Started by an SCM change
Started by an SCM change
Started by an SCM change
Started by an SCM change
Started by an SCM change
Started by an SCM change
Started by an SCM change
Started by an SCM change
Started by an SCM change
Started by an SCM change
Started by an SCM change
Started by an SCM change
Started by an SCM change
Started by an SCM change
Started by an SCM change
Started by an SCM change
Started by an SCM change
Started by an SCM change
Started by an SCM change
Started by an SCM change
Started by an SCM change
Started by an SCM change
Started by an SCM change
Started by an SCM change
Started by an SCM change
Started by an SCM change
Started by an SCM change
Started by an SCM change
Started by an SCM change
Started by an SCM change
Started by an SCM change
Started by an SCM change
Started by an SCM change
Started by an SCM change
Started by an SCM change
Started by an SCM change
Started by an SCM change
Started by an SCM change
Started by an SCM change
Started by an SCM change
Started by an SCM change
Started by an SCM change
Started by an SCM change
Started by an SCM change
Started by an SCM change
Started by an SCM change
Started by an SCM change
Started by an SCM change
Started by an SCM change
[EnvInject] - Loading node environment variables.
Building remotely on libvirt-fedora-24 (libvirt) in workspace <https://ci.centos.org/job/libvirt-perl-master-build/systems=libvirt-fedora-…>
> git rev-parse --is-inside-work-tree # timeout=10
Fetching changes from the remote Git repository
> git config remote.origin.url git://n64.pufty.ci.centos.org/libvirt-perl.git # timeout=10
Fetching upstream changes from git://n64.pufty.ci.centos.org/libvirt-perl.git
> git --version # timeout=10
> git fetch --tags --progress git://n64.pufty.ci.centos.org/libvirt-perl.git +refs/heads/*:refs/remotes/origin/*
Checking out Revision 34c79370dd87c1fe4e395ec73a3d2162cacd04bb (refs/remotes/origin/master)
> git config core.sparsecheckout # timeout=10
> git checkout -f 34c79370dd87c1fe4e395ec73a3d2162cacd04bb
> git rev-list 6b85c52231d446fe37f867c3a69d878e82427997 # timeout=10
Cleaning workspace
> git rev-parse --verify HEAD # timeout=10
Resetting working tree
> git reset --hard # timeout=10
> git clean -fdx # timeout=10
[libvirt-perl-master] $ /bin/sh -xe /tmp/hudson1881947991189815018.sh
+ perl Makefile.PL PREFIX=/home/jenkins/build/libvirt
libvirt >= 3.4.0 is required
Build step 'Execute shell' marked build as failure
1
1
[Libvirt-ci] Build failed in Jenkins: libvirt-perl-master-build » libvirt-fedora-rawhide #423
by ci@centos.org 26 Oct '23
by ci@centos.org 26 Oct '23
26 Oct '23
See <https://ci.centos.org/job/libvirt-perl-master-build/systems=libvirt-fedora-…>
Changes:
[berrange] Set date for 3.3.0 release
[berrange] Post release version bump
------------------------------------------
Started by upstream project "libvirt-perl-master-build" build number 423
originally caused by:
Started by an SCM change
Started by an SCM change
Started by an SCM change
Started by an SCM change
Started by an SCM change
Started by an SCM change
Started by an SCM change
Started by an SCM change
Started by an SCM change
Started by an SCM change
Started by an SCM change
Started by an SCM change
Started by an SCM change
Started by an SCM change
Started by an SCM change
Started by an SCM change
Started by an SCM change
Started by an SCM change
Started by an SCM change
Started by an SCM change
Started by an SCM change
Started by an SCM change
Started by an SCM change
Started by an SCM change
Started by an SCM change
Started by an SCM change
Started by an SCM change
Started by an SCM change
Started by an SCM change
Started by an SCM change
Started by an SCM change
Started by an SCM change
Started by an SCM change
Started by an SCM change
Started by an SCM change
Started by an SCM change
Started by an SCM change
Started by an SCM change
Started by an SCM change
Started by an SCM change
Started by an SCM change
Started by an SCM change
Started by an SCM change
Started by an SCM change
Started by an SCM change
Started by an SCM change
Started by an SCM change
Started by an SCM change
Started by an SCM change
Started by an SCM change
Started by an SCM change
Started by an SCM change
Started by an SCM change
Started by an SCM change
Started by an SCM change
Started by an SCM change
Started by an SCM change
Started by an SCM change
Started by an SCM change
Started by an SCM change
Started by an SCM change
Started by an SCM change
Started by an SCM change
Started by an SCM change
Started by an SCM change
Started by an SCM change
Started by an SCM change
Started by an SCM change
Started by an SCM change
Started by an SCM change
Started by an SCM change
Started by an SCM change
Started by an SCM change
Started by an SCM change
Started by an SCM change
Started by an SCM change
Started by an SCM change
Started by an SCM change
Started by an SCM change
Started by an SCM change
Started by an SCM change
Started by an SCM change
Started by an SCM change
Started by an SCM change
Started by an SCM change
Started by an SCM change
Started by an SCM change
Started by an SCM change
Started by an SCM change
Started by an SCM change
Started by an SCM change
Started by an SCM change
Started by an SCM change
Started by an SCM change
Started by an SCM change
Started by an SCM change
Started by an SCM change
Started by an SCM change
Started by an SCM change
Started by an SCM change
Started by an SCM change
Started by an SCM change
Started by an SCM change
Started by an SCM change
Started by an SCM change
Started by an SCM change
Started by an SCM change
Started by an SCM change
Started by an SCM change
Started by an SCM change
Started by an SCM change
Started by an SCM change
Started by an SCM change
Started by an SCM change
Started by an SCM change
Started by an SCM change
Started by an SCM change
Started by an SCM change
Started by an SCM change
Started by an SCM change
[EnvInject] - Loading node environment variables.
Building remotely on libvirt-fedora-rawhide (libvirt) in workspace <https://ci.centos.org/job/libvirt-perl-master-build/systems=libvirt-fedora-…>
> git rev-parse --is-inside-work-tree # timeout=10
Fetching changes from the remote Git repository
> git config remote.origin.url git://n64.pufty.ci.centos.org/libvirt-perl.git # timeout=10
Fetching upstream changes from git://n64.pufty.ci.centos.org/libvirt-perl.git
> git --version # timeout=10
> git fetch --tags --progress git://n64.pufty.ci.centos.org/libvirt-perl.git +refs/heads/*:refs/remotes/origin/*
Checking out Revision 34c79370dd87c1fe4e395ec73a3d2162cacd04bb (refs/remotes/origin/master)
> git config core.sparsecheckout # timeout=10
> git checkout -f 34c79370dd87c1fe4e395ec73a3d2162cacd04bb
> git rev-list 6b85c52231d446fe37f867c3a69d878e82427997 # timeout=10
Cleaning workspace
> git rev-parse --verify HEAD # timeout=10
Resetting working tree
> git reset --hard # timeout=10
> git clean -fdx # timeout=10
[libvirt-perl-master] $ /bin/sh -xe /tmp/hudson4311258186613711020.sh
+ perl Makefile.PL PREFIX=/home/jenkins/build/libvirt
libvirt >= 3.4.0 is required
Build step 'Execute shell' marked build as failure
1
1
[Libvirt-ci] Build failed in Jenkins: libvirt-perl-master-build » libvirt-centos-7 #423
by ci@centos.org 26 Oct '23
by ci@centos.org 26 Oct '23
26 Oct '23
See <https://ci.centos.org/job/libvirt-perl-master-build/systems=libvirt-centos-…>
Changes:
[berrange] Set date for 3.3.0 release
[berrange] Post release version bump
------------------------------------------
Started by upstream project "libvirt-perl-master-build" build number 423
originally caused by:
Started by an SCM change
Started by an SCM change
Started by an SCM change
Started by an SCM change
Started by an SCM change
Started by an SCM change
Started by an SCM change
Started by an SCM change
Started by an SCM change
Started by an SCM change
Started by an SCM change
Started by an SCM change
Started by an SCM change
Started by an SCM change
Started by an SCM change
Started by an SCM change
Started by an SCM change
Started by an SCM change
Started by an SCM change
Started by an SCM change
Started by an SCM change
Started by an SCM change
Started by an SCM change
Started by an SCM change
Started by an SCM change
Started by an SCM change
Started by an SCM change
Started by an SCM change
Started by an SCM change
Started by an SCM change
Started by an SCM change
Started by an SCM change
Started by an SCM change
Started by an SCM change
Started by an SCM change
Started by an SCM change
Started by an SCM change
Started by an SCM change
Started by an SCM change
Started by an SCM change
Started by an SCM change
Started by an SCM change
Started by an SCM change
Started by an SCM change
Started by an SCM change
Started by an SCM change
Started by an SCM change
Started by an SCM change
Started by an SCM change
Started by an SCM change
Started by an SCM change
Started by an SCM change
Started by an SCM change
Started by an SCM change
Started by an SCM change
Started by an SCM change
Started by an SCM change
Started by an SCM change
Started by an SCM change
Started by an SCM change
Started by an SCM change
Started by an SCM change
Started by an SCM change
Started by an SCM change
Started by an SCM change
Started by an SCM change
Started by an SCM change
Started by an SCM change
Started by an SCM change
Started by an SCM change
Started by an SCM change
Started by an SCM change
Started by an SCM change
Started by an SCM change
Started by an SCM change
Started by an SCM change
Started by an SCM change
Started by an SCM change
Started by an SCM change
Started by an SCM change
Started by an SCM change
Started by an SCM change
Started by an SCM change
Started by an SCM change
Started by an SCM change
Started by an SCM change
Started by an SCM change
Started by an SCM change
Started by an SCM change
Started by an SCM change
Started by an SCM change
Started by an SCM change
Started by an SCM change
Started by an SCM change
Started by an SCM change
Started by an SCM change
Started by an SCM change
Started by an SCM change
Started by an SCM change
Started by an SCM change
Started by an SCM change
Started by an SCM change
Started by an SCM change
Started by an SCM change
Started by an SCM change
Started by an SCM change
Started by an SCM change
Started by an SCM change
Started by an SCM change
Started by an SCM change
Started by an SCM change
Started by an SCM change
Started by an SCM change
Started by an SCM change
Started by an SCM change
Started by an SCM change
Started by an SCM change
Started by an SCM change
Started by an SCM change
Started by an SCM change
[EnvInject] - Loading node environment variables.
Building remotely on libvirt-centos-7 (libvirt) in workspace <https://ci.centos.org/job/libvirt-perl-master-build/systems=libvirt-centos-…>
> git rev-parse --is-inside-work-tree # timeout=10
Fetching changes from the remote Git repository
> git config remote.origin.url git://n64.pufty.ci.centos.org/libvirt-perl.git # timeout=10
Fetching upstream changes from git://n64.pufty.ci.centos.org/libvirt-perl.git
> git --version # timeout=10
> git fetch --tags --progress git://n64.pufty.ci.centos.org/libvirt-perl.git +refs/heads/*:refs/remotes/origin/*
Checking out Revision 34c79370dd87c1fe4e395ec73a3d2162cacd04bb (refs/remotes/origin/master)
> git config core.sparsecheckout # timeout=10
> git checkout -f 34c79370dd87c1fe4e395ec73a3d2162cacd04bb
> git rev-list 6b85c52231d446fe37f867c3a69d878e82427997 # timeout=10
Cleaning workspace
> git rev-parse --verify HEAD # timeout=10
Resetting working tree
> git reset --hard # timeout=10
> git clean -fdx # timeout=10
[libvirt-perl-master] $ /bin/sh -xe /tmp/hudson7526774359300721548.sh
+ perl Makefile.PL PREFIX=/home/jenkins/build/libvirt
libvirt >= 3.4.0 is required
Build step 'Execute shell' marked build as failure
1
1