libvirt List Archives
Sign In Sign Up
Manage this list Sign In Sign Up

Keyboard Shortcuts

Thread View

  • j: Next unread message
  • k: Previous unread message
  • j a: Jump to all threads
  • j l: Jump to MailingList overview

CI

Thread Start a new thread
Download
Threads by month
  • ----- 2025 -----
  • August
  • July
  • June
  • May
  • April
  • March
  • February
  • January
  • ----- 2024 -----
  • December
  • November
  • October
  • September
  • August
  • July
  • June
  • May
  • April
  • March
  • February
  • January
  • ----- 2023 -----
  • December
  • November
  • October
  • September
  • August
  • July
  • June
  • May
  • April
  • March
  • February
  • January
  • ----- 2022 -----
  • December
  • November
  • October
  • September
  • August
  • July
  • June
  • May
  • April
  • March
  • February
  • January
  • ----- 2021 -----
  • December
  • November
  • October
  • September
  • August
  • July
  • June
  • May
  • April
  • March
  • February
  • January
  • ----- 2020 -----
  • December
  • November
  • October
  • September
  • August
  • July
  • June
  • May
  • April
  • March
  • February
  • January
  • ----- 2019 -----
  • December
  • November
  • October
  • September
  • August
  • July
  • June
  • May
  • April
  • March
  • February
  • January
  • ----- 2018 -----
  • December
  • November
  • October
  • September
  • August
  • July
  • June
  • May
  • April
  • March
  • February
  • January
  • ----- 2017 -----
  • December
  • November
  • October
  • September
  • August
  • July
  • June
  • May
  • April
  • March
  • February
  • January
  • ----- 2016 -----
  • December
  • November
  • October
  • September
  • August
  • July
ci@lists.libvirt.org

January 2020

  • 2 participants
  • 139 discussions
[Libvirt-ci] Build failed in Jenkins: virt-manager-check » libvirt-freebsd-11 #1388
by ci@centos.org 13 Jan '20

13 Jan '20
See <https://ci.centos.org/job/virt-manager-check/systems=libvirt-freebsd-11/138…> ------------------------------------------ Started by upstream project "virt-manager-check" build number 1388 originally caused by: Started by upstream project "virt-manager-build" build number 1392 originally caused by: Started by upstream project "libosinfo-build" build number 311 originally caused by: Started by upstream project "osinfo-db-build" build number 204 originally caused by: Started by an SCM change Started by upstream project "libvirt-python-build" build number 946 originally caused by: Started by upstream project "libvirt-build" build number 1098 originally caused by: Started by an SCM change Started by an SCM change Started by an SCM change Running as SYSTEM [EnvInject] - Loading node environment variables. Building remotely on libvirt-freebsd-11 (libvirt) in workspace <https://ci.centos.org/job/virt-manager-check/systems=libvirt-freebsd-11/ws/> [virt-manager] $ /bin/sh -xe /tmp/jenkins12861360353754643724.sh + /usr/local/bin/python3 ./setup.py test running test Traceback (most recent call last): File "./setup.py", line 738, in <module> distclass=VMMDistribution, File "/usr/local/lib/python3.7/distutils/core.py", line 148, in setup dist.run_commands() File "/usr/local/lib/python3.7/distutils/dist.py", line 966, in run_commands self.run_command(cmd) File "/usr/local/lib/python3.7/distutils/dist.py", line 985, in run_command cmd_obj.run() File "./setup.py", line 528, in run TestBaseCommand.run(self) File "./setup.py", line 448, in run import tests as testsmodule File "/usr<https://ci.centos.org/job/virt-manager-check/systems=libvirt-freebsd-11/ws/…",> line 16, in <module> from virtinst import buildconfig File "/usr<https://ci.centos.org/job/virt-manager-check/systems=libvirt-freebsd-11/ws/…",> line 9, in <module> gi.require_version('Libosinfo', '1.0') File "/usr/local/lib/python3.7/site-packages/gi/__init__.py", line 130, in require_version raise ValueError('Namespace %s not available' % namespace) ValueError: Namespace Libosinfo not available Build step 'Execute shell' marked build as failure
1 5
0 0
[Libvirt-ci] Build failed in Jenkins: virt-manager-check » libvirt-freebsd-12 #1388
by ci@centos.org 13 Jan '20

13 Jan '20
See <https://ci.centos.org/job/virt-manager-check/systems=libvirt-freebsd-12/138…> ------------------------------------------ Started by upstream project "virt-manager-check" build number 1388 originally caused by: Started by upstream project "virt-manager-build" build number 1392 originally caused by: Started by upstream project "libosinfo-build" build number 311 originally caused by: Started by upstream project "osinfo-db-build" build number 204 originally caused by: Started by an SCM change Started by upstream project "libvirt-python-build" build number 946 originally caused by: Started by upstream project "libvirt-build" build number 1098 originally caused by: Started by an SCM change Started by an SCM change Started by an SCM change Running as SYSTEM [EnvInject] - Loading node environment variables. Building remotely on libvirt-freebsd-12 (libvirt) in workspace <https://ci.centos.org/job/virt-manager-check/systems=libvirt-freebsd-12/ws/> [virt-manager] $ /bin/sh -xe /tmp/jenkins9112861702639127371.sh + /usr/local/bin/python3 ./setup.py test running test Traceback (most recent call last): File "./setup.py", line 738, in <module> distclass=VMMDistribution, File "/usr/local/lib/python3.7/distutils/core.py", line 148, in setup dist.run_commands() File "/usr/local/lib/python3.7/distutils/dist.py", line 966, in run_commands self.run_command(cmd) File "/usr/local/lib/python3.7/distutils/dist.py", line 985, in run_command cmd_obj.run() File "./setup.py", line 528, in run TestBaseCommand.run(self) File "./setup.py", line 448, in run import tests as testsmodule File "/usr<https://ci.centos.org/job/virt-manager-check/systems=libvirt-freebsd-12/ws/…",> line 16, in <module> from virtinst import buildconfig File "/usr<https://ci.centos.org/job/virt-manager-check/systems=libvirt-freebsd-12/ws/…",> line 9, in <module> gi.require_version('Libosinfo', '1.0') File "/usr/local/lib/python3.7/site-packages/gi/__init__.py", line 130, in require_version raise ValueError('Namespace %s not available' % namespace) ValueError: Namespace Libosinfo not available Build step 'Execute shell' marked build as failure
1 5
0 0
[Libvirt-ci] Build failed in Jenkins: libosinfo-check » libvirt-freebsd-12 #278
by ci@centos.org 13 Jan '20

13 Jan '20
See <https://ci.centos.org/job/libosinfo-check/systems=libvirt-freebsd-12/278/di…> ------------------------------------------ Started by upstream project "libosinfo-check" build number 278 originally caused by: Started by upstream project "libosinfo-build" build number 312 originally caused by: Started by an SCM change Running as SYSTEM [EnvInject] - Loading node environment variables. Building remotely on libvirt-freebsd-12 (libvirt) in workspace <https://ci.centos.org/job/libosinfo-check/systems=libvirt-freebsd-12/ws/> [libosinfo] $ /bin/sh -xe /tmp/jenkins15022555614624806910.sh + cd build + /usr/local/bin/ninja test [1/77] Compiling C object 'tools/f9d35d4@@osinfo-install-script@exe/osinfo-install-script.c.o'. [2/77] Compiling C object 'tools/f9d35d4@@osinfo-install-script@exe/meson-generated_.._.._osinfo_osinfo_enum_types.c.o'. [3/77] Compiling C object 'osinfo/2eb04f7@@osinfo-1.0@sha/osinfo_loader.c.o'. FAILED: osinfo/2eb04f7@@osinfo-1.0@sha/osinfo_loader.c.o ccache cc -Iosinfo/2eb04f7@@osinfo-1.0@sha -Iosinfo -I../osinfo -I. -I../ -I/usr/local/include/glib-2.0 -I/usr/local/lib/glib-2.0/include -I/usr/local/include -I/usr/local/include/libsoup-2.4 -I/usr/local/include/libxml2 -Xclang -fcolor-diagnostics -pipe -D_FILE_OFFSET_BITS=64 -Wall -Winvalid-pch -std=gnu99 -O2 -g -DGLIB_VERSION_MIN_REQUIRED=GLIB_VERSION_2_44 -DGLIB_VERSION_MAX_ALLOWED=GLIB_VERSION_2_44 '-DPKG_DATA_DIR="/home/jenkins/build/libvirt/share/libosinfo"' '-DDATA_DIR="/home/jenkins/build/libvirt/share"' '-DSYS_CONF_DIR="/home/jenkins/build/libvirt/etc"' '-DLOCALEDIR="/home/jenkins/build/libvirt/share/locale"' '-DGETTEXT_PACKAGE="libosinfo"' -W -Waddress -Wall -Warray-bounds -Wattributes -Wbuiltin-macro-redefined -Wchar-subscripts -Wcomment -Wcomments -Wcpp -Wdate-time -Wdeprecated-declarations -Wdisabled-optimization -Wdiv-by-zero -Wempty-body -Wendif-labels -Wenum-compare -Wextra -Wformat-extra-args -Wformat-security -Wformat-y2k -Wformat-zero-length -Wignored-qualifiers -Wimplicit -Wimplicit-function-declaration -Wimplicit-int -Winit-self -Winline -Wint-to-pointer-cast -Winvalid-pch -Wmain -Wmissing-braces -Wmissing-declarations -Wmissing-field-initializers -Wmissing-include-dirs -Wmissing-prototypes -Wmultichar -Wnarrowing -Wnested-externs -Wnonnull -Wold-style-definition -Woverflow -Woverlength-strings -Woverride-init -Wpacked -Wparentheses -Wpointer-arith -Wpointer-sign -Wpointer-to-int-cast -Wpragmas -Wreturn-type -Wsequence-point -Wshadow -Wsizeof-pointer-memaccess -Wstack-protector -Wstrict-aliasing -Wstrict-overflow -Wstrict-prototypes -Wswitch -Wswitch-default -Wtrigraphs -Wtype-limits -Wuninitialized -Wunknown-pragmas -Wunused -Wunused-function -Wunused-label -Wunused-local-typedefs -Wunused-parameter -Wunused-result -Wunused-value -Wunused-variable -Wvarargs -Wvariadic-macros -Wvla -Wvolatile-register-var -Wwrite-strings -Wno-sign-compare -Wno-sign-conversion -Wno-conversion -Wno-unused-parameter -Wframe-larger-than=4096 -Wno-overlength-strings --param=ssp-buffer-size=4 -fexceptions -fasynchronous-unwind-tables -fdiagnostics-show-option -funit-at-a-time -Wno-typedef-redefinition -Wno-missing-field-initializers -Werror '-DPCI_IDS="/usr/local/share/pciids/pci.ids"' '-DUSB_IDS="/usr/local/share/usbids/usb.ids"' -fPIC -pthread -MD -MQ 'osinfo/2eb04f7@@osinfo-1.0@sha/osinfo_loader.c.o' -MF 'osinfo/2eb04f7@@osinfo-1.0@sha/osinfo_loader.c.o.d' -o 'osinfo/2eb04f7@@osinfo-1.0@sha/osinfo_loader.c.o' -c ../osinfo/osinfo_loader.c ../osinfo/osinfo_loader.c:1288:58: error: adding 'unsigned long' to a string does not append to the string [-Werror,-Wstring-plus-int] OSINFO_TREE_PROP_TREEINFO_FAMILY + strlen("treeinfo-"))) ~~~~~~~~~~~~~~~~~~~~~~~~~~~~~~~~~^~~~~~~~~~~~~~~~~~~~~ ../osinfo/osinfo_loader.c:1288:58: note: use array indexing to silence this warning OSINFO_TREE_PROP_TREEINFO_FAMILY + strlen("treeinfo-"))) ^ & [ ] ../osinfo/osinfo_loader.c:1293:64: error: adding 'unsigned long' to a string does not append to the string [-Werror,-Wstring-plus-int] OSINFO_TREE_PROP_TREEINFO_VARIANT + strlen("treeinfo-"))) ~~~~~~~~~~~~~~~~~~~~~~~~~~~~~~~~~~^~~~~~~~~~~~~~~~~~~~~ ../osinfo/osinfo_loader.c:1293:64: note: use array indexing to silence this warning OSINFO_TREE_PROP_TREEINFO_VARIANT + strlen("treeinfo-"))) ^ & [ ] ../osinfo/osinfo_loader.c:1298:64: error: adding 'unsigned long' to a string does not append to the string [-Werror,-Wstring-plus-int] OSINFO_TREE_PROP_TREEINFO_VERSION + strlen("treeinfo-"))) ~~~~~~~~~~~~~~~~~~~~~~~~~~~~~~~~~~^~~~~~~~~~~~~~~~~~~~~ ../osinfo/osinfo_loader.c:1298:64: note: use array indexing to silence this warning OSINFO_TREE_PROP_TREEINFO_VERSION + strlen("treeinfo-"))) ^ & [ ] ../osinfo/osinfo_loader.c:1303:61: error: adding 'unsigned long' to a string does not append to the string [-Werror,-Wstring-plus-int] OSINFO_TREE_PROP_TREEINFO_ARCH + strlen("treeinfo-"))) ~~~~~~~~~~~~~~~~~~~~~~~~~~~~~~~^~~~~~~~~~~~~~~~~~~~~ ../osinfo/osinfo_loader.c:1303:61: note: use array indexing to silence this warning OSINFO_TREE_PROP_TREEINFO_ARCH + strlen("treeinfo-"))) ^ & [ ] 4 errors generated. [4/77] Compiling C object 'tools/f9d35d4@@osinfo-query@exe/meson-generated_.._.._osinfo_osinfo_enum_types.c.o'. [5/77] Compiling C object 'tools/f9d35d4@@osinfo-query@exe/osinfo-query.c.o'. ninja: build stopped: subcommand failed. + cat meson-logs/testlog.txt cat: meson-logs/testlog.txt: No such file or directory + true + exit 1 Build step 'Execute shell' marked build as failure
1 1
0 0
[Libvirt-ci] Build failed in Jenkins: libosinfo-check » libvirt-freebsd-11 #278
by ci@centos.org 13 Jan '20

13 Jan '20
See <https://ci.centos.org/job/libosinfo-check/systems=libvirt-freebsd-11/278/di…> ------------------------------------------ Started by upstream project "libosinfo-check" build number 278 originally caused by: Started by upstream project "libosinfo-build" build number 312 originally caused by: Started by an SCM change Running as SYSTEM [EnvInject] - Loading node environment variables. Building remotely on libvirt-freebsd-11 (libvirt) in workspace <https://ci.centos.org/job/libosinfo-check/systems=libvirt-freebsd-11/ws/> [libosinfo] $ /bin/sh -xe /tmp/jenkins18281253250641308100.sh + cd build + /usr/local/bin/ninja test [1/79] Compiling C object 'osinfo/2eb04f7@@osinfo-1.0@sha/osinfo_loader.c.o'. FAILED: osinfo/2eb04f7@@osinfo-1.0@sha/osinfo_loader.c.o ccache cc -Iosinfo/2eb04f7@@osinfo-1.0@sha -Iosinfo -I../osinfo -I. -I../ -I/usr/local/include/glib-2.0 -I/usr/local/lib/glib-2.0/include -I/usr/local/include -I/usr/local/include/libsoup-2.4 -I/usr/local/include/libxml2 -Xclang -fcolor-diagnostics -pipe -D_FILE_OFFSET_BITS=64 -Wall -Winvalid-pch -std=gnu99 -O2 -g -DGLIB_VERSION_MIN_REQUIRED=GLIB_VERSION_2_44 -DGLIB_VERSION_MAX_ALLOWED=GLIB_VERSION_2_44 '-DPKG_DATA_DIR="/home/jenkins/build/libvirt/share/libosinfo"' '-DDATA_DIR="/home/jenkins/build/libvirt/share"' '-DSYS_CONF_DIR="/home/jenkins/build/libvirt/etc"' '-DLOCALEDIR="/home/jenkins/build/libvirt/share/locale"' '-DGETTEXT_PACKAGE="libosinfo"' -W -Waddress -Wall -Warray-bounds -Wattributes -Wbuiltin-macro-redefined -Wchar-subscripts -Wcomment -Wcomments -Wcpp -Wdate-time -Wdeprecated-declarations -Wdisabled-optimization -Wdiv-by-zero -Wempty-body -Wendif-labels -Wenum-compare -Wextra -Wformat-extra-args -Wformat-security -Wformat-y2k -Wformat-zero-length -Wignored-qualifiers -Wimplicit -Wimplicit-function-declaration -Wimplicit-int -Winit-self -Winline -Wint-to-pointer-cast -Winvalid-pch -Wmain -Wmissing-braces -Wmissing-declarations -Wmissing-field-initializers -Wmissing-include-dirs -Wmissing-prototypes -Wmultichar -Wnarrowing -Wnested-externs -Wnonnull -Wold-style-definition -Woverflow -Woverlength-strings -Woverride-init -Wpacked -Wparentheses -Wpointer-arith -Wpointer-sign -Wpointer-to-int-cast -Wpragmas -Wreturn-type -Wsequence-point -Wshadow -Wsizeof-pointer-memaccess -Wstack-protector -Wstrict-aliasing -Wstrict-overflow -Wstrict-prototypes -Wswitch -Wswitch-default -Wtrigraphs -Wtype-limits -Wuninitialized -Wunknown-pragmas -Wunused -Wunused-function -Wunused-label -Wunused-local-typedefs -Wunused-parameter -Wunused-result -Wunused-value -Wunused-variable -Wvarargs -Wvariadic-macros -Wvla -Wvolatile-register-var -Wwrite-strings -Wno-sign-compare -Wno-sign-conversion -Wno-conversion -Wno-unused-parameter -Wframe-larger-than=4096 -Wno-overlength-strings --param=ssp-buffer-size=4 -fexceptions -fasynchronous-unwind-tables -fdiagnostics-show-option -funit-at-a-time -Wno-typedef-redefinition -Wno-missing-field-initializers -Werror '-DPCI_IDS="/usr/local/share/pciids/pci.ids"' '-DUSB_IDS="/usr/local/share/usbids/usb.ids"' -fPIC -pthread -MD -MQ 'osinfo/2eb04f7@@osinfo-1.0@sha/osinfo_loader.c.o' -MF 'osinfo/2eb04f7@@osinfo-1.0@sha/osinfo_loader.c.o.d' -o 'osinfo/2eb04f7@@osinfo-1.0@sha/osinfo_loader.c.o' -c ../osinfo/osinfo_loader.c ../osinfo/osinfo_loader.c:1288:58: error: adding 'unsigned long' to a string does not append to the string [-Werror,-Wstring-plus-int] OSINFO_TREE_PROP_TREEINFO_FAMILY + strlen("treeinfo-"))) ~~~~~~~~~~~~~~~~~~~~~~~~~~~~~~~~~^~~~~~~~~~~~~~~~~~~~~ ../osinfo/osinfo_loader.c:1288:58: note: use array indexing to silence this warning OSINFO_TREE_PROP_TREEINFO_FAMILY + strlen("treeinfo-"))) ^ & [ ] ../osinfo/osinfo_loader.c:1293:64: error: adding 'unsigned long' to a string does not append to the string [-Werror,-Wstring-plus-int] OSINFO_TREE_PROP_TREEINFO_VARIANT + strlen("treeinfo-"))) ~~~~~~~~~~~~~~~~~~~~~~~~~~~~~~~~~~^~~~~~~~~~~~~~~~~~~~~ ../osinfo/osinfo_loader.c:1293:64: note: use array indexing to silence this warning OSINFO_TREE_PROP_TREEINFO_VARIANT + strlen("treeinfo-"))) ^ & [ ] ../osinfo/osinfo_loader.c:1298:64: error: adding 'unsigned long' to a string does not append to the string [-Werror,-Wstring-plus-int] OSINFO_TREE_PROP_TREEINFO_VERSION + strlen("treeinfo-"))) ~~~~~~~~~~~~~~~~~~~~~~~~~~~~~~~~~~^~~~~~~~~~~~~~~~~~~~~ ../osinfo/osinfo_loader.c:1298:64: note: use array indexing to silence this warning OSINFO_TREE_PROP_TREEINFO_VERSION + strlen("treeinfo-"))) ^ & [ ] ../osinfo/osinfo_loader.c:1303:61: error: adding 'unsigned long' to a string does not append to the string [-Werror,-Wstring-plus-int] OSINFO_TREE_PROP_TREEINFO_ARCH + strlen("treeinfo-"))) ~~~~~~~~~~~~~~~~~~~~~~~~~~~~~~~^~~~~~~~~~~~~~~~~~~~~ ../osinfo/osinfo_loader.c:1303:61: note: use array indexing to silence this warning OSINFO_TREE_PROP_TREEINFO_ARCH + strlen("treeinfo-"))) ^ & [ ] 4 errors generated. [2/79] Compiling C object 'tools/f9d35d4@@osinfo-detect@exe/meson-generated_.._.._osinfo_osinfo_enum_types.c.o'. [3/79] Compiling C object 'tools/f9d35d4@@osinfo-detect@exe/osinfo-detect.c.o'. ninja: build stopped: subcommand failed. + cat meson-logs/testlog.txt cat: meson-logs/testlog.txt: No such file or directory + true + exit 1 Build step 'Execute shell' marked build as failure
1 1
0 0
[Libvirt-ci] Build failed in Jenkins: libosinfo-build » libvirt-freebsd-11 #313
by ci@centos.org 13 Jan '20

13 Jan '20
See <https://ci.centos.org/job/libosinfo-build/systems=libvirt-freebsd-11/313/di…> ------------------------------------------ [...truncated 3.42 KB...] Resetting working tree > git reset --hard # timeout=10 > git clean -fdx # timeout=10 [libosinfo] $ /bin/sh -xe /tmp/jenkins8429899528052535000.sh + rm -rf build + mkdir build + cd build + meson .. . '--prefix=/home/jenkins/build/libvirt' The Meson build system Version: 0.52.1 Source dir: /usr<https://ci.centos.org/job/libosinfo-build/systems=libvirt-freebsd-11/ws/> Build dir: /usr<https://ci.centos.org/job/libosinfo-build/systems=libvirt-freebsd-11/ws/bui…> Build type: native build Project name: libosinfo Project version: 1.8.0 C compiler for the host machine: ccache cc (clang 8.0.0 "FreeBSD clang version 8.0.0 (tags/RELEASE_800/final 356365) (based on LLVM 8.0.0)") C linker for the host machine: GNU ld.bfd 2.17.50 Host machine cpu family: x86_64 Host machine cpu: x86_64 Program g-ir-scanner found: YES (/usr/local/bin/g-ir-scanner) Vala compiler for the host machine: valac (valac 0.40.15) Configuring libosinfo.spec using configuration Configuring mingw-libosinfo.spec using configuration Program build-aux/dist.sh found: YES (/usr<https://ci.centos.org/job/libosinfo-build/systems=libvirt-freebsd-11/ws/bui…)> Found pkg-config: /usr/local/bin/pkg-config (1.6.3) Run-time dependency glib-2.0 found: YES 2.56.3 Run-time dependency gio-2.0 found: YES 2.56.3 Run-time dependency gobject-2.0 found: YES 2.56.3 Run-time dependency libsoup-2.4 found: YES 2.62.3 Run-time dependency libxml-2.0 found: YES 2.9.10 Run-time dependency libxslt found: YES 1.1.34 Compiler for C supports arguments -W: YES Compiler for C supports arguments -Waddress: YES Compiler for C supports arguments -Waggressive-loop-optimizations: NO Compiler for C supports arguments -Wall: YES Compiler for C supports arguments -Warray-bounds: YES Compiler for C supports arguments -Wattributes: YES Compiler for C supports arguments -Wbuiltin-macro-redefined: YES Compiler for C supports arguments -Wchar-subscripts: YES Compiler for C supports arguments -Wclobbered: NO Compiler for C supports arguments -Wcomment: YES Compiler for C supports arguments -Wcomments: YES Compiler for C supports arguments -Wcoverage-mismatch: NO Compiler for C supports arguments -Wcpp: YES Compiler for C supports arguments -Wdate-time: YES Compiler for C supports arguments -Wdeprecated-declarations: YES Compiler for C supports arguments -Wdisabled-optimization: YES Compiler for C supports arguments -Wdiv-by-zero: YES Compiler for C supports arguments -Wempty-body: YES Compiler for C supports arguments -Wendif-labels: YES Compiler for C supports arguments -Wenum-compare: YES Compiler for C supports arguments -Wextra: YES Compiler for C supports arguments -Wformat-contains-nul: NO Compiler for C supports arguments -Wformat-extra-args: YES Compiler for C supports arguments -Wformat-security: YES Compiler for C supports arguments -Wformat-y2k: YES Compiler for C supports arguments -Wformat-zero-length: YES Compiler for C supports arguments -Wfree-nonheap-object: NO Compiler for C supports arguments -Wignored-qualifiers: YES Compiler for C supports arguments -Wimplicit: YES Compiler for C supports arguments -Wimplicit-function-declaration: YES Compiler for C supports arguments -Wimplicit-int: YES Compiler for C supports arguments -Winit-self: YES Compiler for C supports arguments -Winline: YES Compiler for C supports arguments -Wint-to-pointer-cast: YES Compiler for C supports arguments -Winvalid-memory-model: NO Compiler for C supports arguments -Winvalid-pch: YES Compiler for C supports arguments -Wjump-misses-init: NO Compiler for C supports arguments -Wlogical-op: NO Compiler for C supports arguments -Wmain: YES Compiler for C supports arguments -Wmaybe-uninitialized: NO Compiler for C supports arguments -Wmissing-braces: YES Compiler for C supports arguments -Wmissing-declarations: YES Compiler for C supports arguments -Wmissing-field-initializers: YES Compiler for C supports arguments -Wmissing-include-dirs: YES Compiler for C supports arguments -Wmissing-parameter-type: NO Compiler for C supports arguments -Wmissing-prototypes: YES Compiler for C supports arguments -Wmultichar: YES Compiler for C supports arguments -Wnarrowing: YES Compiler for C supports arguments -Wnested-externs: YES Compiler for C supports arguments -Wnonnull: YES Compiler for C supports arguments -Wold-style-declaration: NO Compiler for C supports arguments -Wold-style-definition: YES Compiler for C supports arguments -Wopenmp-simd: NO Compiler for C supports arguments -Woverflow: YES Compiler for C supports arguments -Woverlength-strings: YES Compiler for C supports arguments -Woverride-init: YES Compiler for C supports arguments -Wpacked: YES Compiler for C supports arguments -Wpacked-bitfield-compat: NO Compiler for C supports arguments -Wparentheses: YES Compiler for C supports arguments -Wpointer-arith: YES Compiler for C supports arguments -Wpointer-sign: YES Compiler for C supports arguments -Wpointer-to-int-cast: YES Compiler for C supports arguments -Wpragmas: YES Compiler for C supports arguments -Wreturn-local-addr: NO Compiler for C supports arguments -Wreturn-type: YES Compiler for C supports arguments -Wsequence-point: YES Compiler for C supports arguments -Wshadow: YES Compiler for C supports arguments -Wsizeof-pointer-memaccess: YES Compiler for C supports arguments -Wstack-protector: YES Compiler for C supports arguments -Wstrict-aliasing: YES Compiler for C supports arguments -Wstrict-overflow: YES Compiler for C supports arguments -Wstrict-prototypes: YES Compiler for C supports arguments -Wsuggest-attribute=const: NO Compiler for C supports arguments -Wsuggest-attribute=format: NO Compiler for C supports arguments -Wsuggest-attribute=noreturn: NO Compiler for C supports arguments -Wsuggest-attribute=pure: NO Compiler for C supports arguments -Wswitch: YES Compiler for C supports arguments -Wswitch-default: YES Compiler for C supports arguments -Wsync-nand: NO Compiler for C supports arguments -Wtrampolines: NO Compiler for C supports arguments -Wtrigraphs: YES Compiler for C supports arguments -Wtype-limits: YES Compiler for C supports arguments -Wuninitialized: YES Compiler for C supports arguments -Wunknown-pragmas: YES Compiler for C supports arguments -Wunused: YES Compiler for C supports arguments -Wunused-but-set-parameter: NO Compiler for C supports arguments -Wunused-but-set-variable: NO Compiler for C supports arguments -Wunused-function: YES Compiler for C supports arguments -Wunused-label: YES Compiler for C supports arguments -Wunused-local-typedefs: YES Compiler for C supports arguments -Wunused-parameter: YES Compiler for C supports arguments -Wunused-result: YES Compiler for C supports arguments -Wunused-value: YES Compiler for C supports arguments -Wunused-variable: YES Compiler for C supports arguments -Wvarargs: YES Compiler for C supports arguments -Wvariadic-macros: YES Compiler for C supports arguments -Wvector-operation-performance: NO Compiler for C supports arguments -Wvla: YES Compiler for C supports arguments -Wvolatile-register-var: YES Compiler for C supports arguments -Wwrite-strings: YES Compiler for C supports arguments -Wnormalized=nfc: NO Compiler for C supports arguments -Wno-sign-compare: YES Compiler for C supports arguments -Wno-sign-conversion: YES Compiler for C supports arguments -Wno-conversion: YES Compiler for C supports arguments -Wno-unused-parameter: YES Compiler for C supports arguments -Wjump-misses-init: NO (cached) Compiler for C supports arguments -Wframe-larger-than=4096: YES Compiler for C supports arguments -Wno-overlength-strings: YES Compiler for C supports arguments --param=ssp-buffer-size=4: YES Compiler for C supports arguments -fexceptions: YES Compiler for C supports arguments -fasynchronous-unwind-tables: YES Compiler for C supports arguments -fdiagnostics-show-option: YES Compiler for C supports arguments -funit-at-a-time: YES Compiler for C supports arguments -fipa-pure-const: NO Compiler for C supports arguments -Wno-suggest-attribute=pure: NO Compiler for C supports arguments -Wno-suggest-attribute=const: NO Compiler for C supports arguments -Wno-typedef-redefinition: YES Compiler for C supports arguments -Wno-missing-field-initializers: YES Compiler for C supports arguments -Werror: YES Message: Location of pci.ids: "/usr/local/share/pciids/pci.ids" Message: Location of usb.ids: "/usr/local/share/usbids/usb.ids" WARNING: Consider using the builtin warning_level option instead of adding warning flags by hand. WARNING: Consider using the builtin warning_level option instead of adding warning flags by hand. Configuring osinfo_version.h using configuration Compiler for C supports link arguments -Wl,--no-undefined: YES Configuring libosinfo-1.0.pc using configuration Found pkg-config: /usr/local/bin/pkg-config (1.6.3) Program pod2man found: YES (/usr/local/bin/pod2man) Program gtkdoc-scan found: YES (/usr/local/bin/gtkdoc-scan) Program /usr<https://ci.centos.org/job/libosinfo-build/systems=libvirt-freebsd-11/ws/bui…> found: YES (/usr<https://ci.centos.org/job/libosinfo-build/systems=libvirt-freebsd-11/ws/bui…)> Build targets in project: 38 Found ninja-1.9.0 at /usr/local/bin/ninja + /usr/local/bin/ninja [1/125] Generating osinfo-detect.1 with a custom command. [2/125] Generating osinfo-install-script.1 with a custom command. [3/125] Generating osinfo-query.1 with a custom command. [4/125] Generating osinfo_enum_types.c with a meson_exe.py custom command. [5/125] Generating osinfo_enum_types.h with a meson_exe.py custom command. [6/125] Compiling C object 'osinfo/2eb04f7@@osinfo-1.0@sha/osinfo_avatar_format.c.o'. [7/125] Compiling C object 'osinfo/2eb04f7@@osinfo-1.0@sha/meson-generated_.._osinfo_enum_types.c.o'. [8/125] Compiling C object 'osinfo/2eb04f7@@osinfo-1.0@sha/osinfo_datamaplist.c.o'. [9/125] Compiling C object 'osinfo/2eb04f7@@osinfo-1.0@sha/osinfo_device.c.o'. [10/125] Compiling C object 'osinfo/2eb04f7@@osinfo-1.0@sha/osinfo_datamap.c.o'. [11/125] Compiling C object 'osinfo/2eb04f7@@osinfo-1.0@sha/osinfo_devicelink.c.o'. [12/125] Compiling C object 'osinfo/2eb04f7@@osinfo-1.0@sha/osinfo_devicelist.c.o'. [13/125] Compiling C object 'osinfo/2eb04f7@@osinfo-1.0@sha/osinfo_devicelinkfilter.c.o'. [14/125] Compiling C object 'osinfo/2eb04f7@@osinfo-1.0@sha/osinfo_devicelinklist.c.o'. [15/125] Compiling C object 'osinfo/2eb04f7@@osinfo-1.0@sha/osinfo_device_driver.c.o'. [16/125] Compiling C object 'osinfo/2eb04f7@@osinfo-1.0@sha/osinfo_device_driverlist.c.o'. [17/125] Compiling C object 'osinfo/2eb04f7@@osinfo-1.0@sha/osinfo_entity.c.o'. [18/125] Compiling C object 'osinfo/2eb04f7@@osinfo-1.0@sha/osinfo_filter.c.o'. [19/125] Compiling C object 'osinfo/2eb04f7@@osinfo-1.0@sha/osinfo_firmware.c.o'. [20/125] Compiling C object 'osinfo/2eb04f7@@osinfo-1.0@sha/osinfo_install_config_param.c.o'. [21/125] Compiling C object 'osinfo/2eb04f7@@osinfo-1.0@sha/osinfo_install_config.c.o'. [22/125] Compiling C object 'osinfo/2eb04f7@@osinfo-1.0@sha/osinfo_firmwarelist.c.o'. [23/125] Compiling C object 'osinfo/2eb04f7@@osinfo-1.0@sha/osinfo_install_scriptlist.c.o'. [24/125] Compiling C object 'osinfo/2eb04f7@@osinfo-1.0@sha/osinfo_install_config_paramlist.c.o'. [25/125] Compiling C object 'osinfo/2eb04f7@@osinfo-1.0@sha/osinfo_install_script.c.o'. [26/125] Compiling C object 'osinfo/2eb04f7@@osinfo-1.0@sha/osinfo_product.c.o'. [27/125] Compiling C object 'osinfo/2eb04f7@@osinfo-1.0@sha/osinfo_productfilter.c.o'. [28/125] Compiling C object 'osinfo/2eb04f7@@osinfo-1.0@sha/osinfo_productlist.c.o'. [29/125] Compiling C object 'osinfo/2eb04f7@@osinfo-1.0@sha/osinfo_platformlist.c.o'. [30/125] Compiling C object 'osinfo/2eb04f7@@osinfo-1.0@sha/osinfo_platform.c.o'. [31/125] Compiling C object 'osinfo/2eb04f7@@osinfo-1.0@sha/osinfo_oslist.c.o'. [32/125] Compiling C object 'osinfo/2eb04f7@@osinfo-1.0@sha/osinfo_list.c.o'. [33/125] Compiling C object 'osinfo/2eb04f7@@osinfo-1.0@sha/osinfo_os_variant.c.o'. [34/125] Compiling C object 'osinfo/2eb04f7@@osinfo-1.0@sha/osinfo_os_variantlist.c.o'. [35/125] Compiling C object 'osinfo/2eb04f7@@osinfo-1.0@sha/osinfo_os.c.o'. [36/125] Compiling C object 'osinfo/2eb04f7@@osinfo-1.0@sha/osinfo_deployment.c.o'. [37/125] Compiling C object 'osinfo/2eb04f7@@osinfo-1.0@sha/osinfo_media.c.o'. [38/125] Compiling C object 'osinfo/2eb04f7@@osinfo-1.0@sha/osinfo_deploymentlist.c.o'. [39/125] Compiling C object 'osinfo/2eb04f7@@osinfo-1.0@sha/osinfo_medialist.c.o'. [40/125] Compiling C object 'osinfo/2eb04f7@@osinfo-1.0@sha/osinfo_resourceslist.c.o'. [41/125] Compiling C object 'osinfo/2eb04f7@@osinfo-1.0@sha/osinfo_tree.c.o'. [42/125] Compiling C object 'osinfo/2eb04f7@@osinfo-1.0@sha/osinfo_treelist.c.o'. [43/125] Compiling C object 'osinfo/2eb04f7@@osinfo-1.0@sha/osinfo_resources.c.o'. [44/125] Compiling C object 'osinfo/2eb04f7@@osinfo-1.0@sha/osinfo_image.c.o'. [45/125] Compiling C object 'osinfo/2eb04f7@@osinfo-1.0@sha/osinfo_db.c.o'. [46/125] Compiling C object 'osinfo/2eb04f7@@osinfo-1.0@sha/osinfo_imagelist.c.o'. [47/125] Compiling C object 'osinfo/2eb04f7@@osinfo-1.0@sha/osinfo_util_private.c.o'. [48/125] Compiling C object 'tools/f9d35d4@@osinfo-detect@exe/meson-generated_.._.._osinfo_osinfo_enum_types.c.o'. [49/125] Compiling C object 'tools/f9d35d4@@osinfo-detect@exe/osinfo-detect.c.o'. [50/125] Compiling C object 'osinfo/2eb04f7@@osinfo-1.0@sha/osinfo_loader.c.o'. FAILED: osinfo/2eb04f7@@osinfo-1.0@sha/osinfo_loader.c.o ccache cc -Iosinfo/2eb04f7@@osinfo-1.0@sha -Iosinfo -I../osinfo -I. -I../ -I/usr/local/include/glib-2.0 -I/usr/local/lib/glib-2.0/include -I/usr/local/include -I/usr/local/include/libsoup-2.4 -I/usr/local/include/libxml2 -Xclang -fcolor-diagnostics -pipe -D_FILE_OFFSET_BITS=64 -Wall -Winvalid-pch -std=gnu99 -O2 -g -DGLIB_VERSION_MIN_REQUIRED=GLIB_VERSION_2_44 -DGLIB_VERSION_MAX_ALLOWED=GLIB_VERSION_2_44 '-DPKG_DATA_DIR="/home/jenkins/build/libvirt/share/libosinfo"' '-DDATA_DIR="/home/jenkins/build/libvirt/share"' '-DSYS_CONF_DIR="/home/jenkins/build/libvirt/etc"' '-DLOCALEDIR="/home/jenkins/build/libvirt/share/locale"' '-DGETTEXT_PACKAGE="libosinfo"' -W -Waddress -Wall -Warray-bounds -Wattributes -Wbuiltin-macro-redefined -Wchar-subscripts -Wcomment -Wcomments -Wcpp -Wdate-time -Wdeprecated-declarations -Wdisabled-optimization -Wdiv-by-zero -Wempty-body -Wendif-labels -Wenum-compare -Wextra -Wformat-extra-args -Wformat-security -Wformat-y2k -Wformat-zero-length -Wignored-qualifiers -Wimplicit -Wimplicit-function-declaration -Wimplicit-int -Winit-self -Winline -Wint-to-pointer-cast -Winvalid-pch -Wmain -Wmissing-braces -Wmissing-declarations -Wmissing-field-initializers -Wmissing-include-dirs -Wmissing-prototypes -Wmultichar -Wnarrowing -Wnested-externs -Wnonnull -Wold-style-definition -Woverflow -Woverlength-strings -Woverride-init -Wpacked -Wparentheses -Wpointer-arith -Wpointer-sign -Wpointer-to-int-cast -Wpragmas -Wreturn-type -Wsequence-point -Wshadow -Wsizeof-pointer-memaccess -Wstack-protector -Wstrict-aliasing -Wstrict-overflow -Wstrict-prototypes -Wswitch -Wswitch-default -Wtrigraphs -Wtype-limits -Wuninitialized -Wunknown-pragmas -Wunused -Wunused-function -Wunused-label -Wunused-local-typedefs -Wunused-parameter -Wunused-result -Wunused-value -Wunused-variable -Wvarargs -Wvariadic-macros -Wvla -Wvolatile-register-var -Wwrite-strings -Wno-sign-compare -Wno-sign-conversion -Wno-conversion -Wno-unused-parameter -Wframe-larger-than=4096 -Wno-overlength-strings --param=ssp-buffer-size=4 -fexceptions -fasynchronous-unwind-tables -fdiagnostics-show-option -funit-at-a-time -Wno-typedef-redefinition -Wno-missing-field-initializers -Werror '-DPCI_IDS="/usr/local/share/pciids/pci.ids"' '-DUSB_IDS="/usr/local/share/usbids/usb.ids"' -fPIC -pthread -MD -MQ 'osinfo/2eb04f7@@osinfo-1.0@sha/osinfo_loader.c.o' -MF 'osinfo/2eb04f7@@osinfo-1.0@sha/osinfo_loader.c.o.d' -o 'osinfo/2eb04f7@@osinfo-1.0@sha/osinfo_loader.c.o' -c ../osinfo/osinfo_loader.c ../osinfo/osinfo_loader.c:1288:58: error: adding 'unsigned long' to a string does not append to the string [-Werror,-Wstring-plus-int] OSINFO_TREE_PROP_TREEINFO_FAMILY + strlen("treeinfo-"))) ~~~~~~~~~~~~~~~~~~~~~~~~~~~~~~~~~^~~~~~~~~~~~~~~~~~~~~ ../osinfo/osinfo_loader.c:1288:58: note: use array indexing to silence this warning OSINFO_TREE_PROP_TREEINFO_FAMILY + strlen("treeinfo-"))) ^ & [ ] ../osinfo/osinfo_loader.c:1293:64: error: adding 'unsigned long' to a string does not append to the string [-Werror,-Wstring-plus-int] OSINFO_TREE_PROP_TREEINFO_VARIANT + strlen("treeinfo-"))) ~~~~~~~~~~~~~~~~~~~~~~~~~~~~~~~~~~^~~~~~~~~~~~~~~~~~~~~ ../osinfo/osinfo_loader.c:1293:64: note: use array indexing to silence this warning OSINFO_TREE_PROP_TREEINFO_VARIANT + strlen("treeinfo-"))) ^ & [ ] ../osinfo/osinfo_loader.c:1298:64: error: adding 'unsigned long' to a string does not append to the string [-Werror,-Wstring-plus-int] OSINFO_TREE_PROP_TREEINFO_VERSION + strlen("treeinfo-"))) ~~~~~~~~~~~~~~~~~~~~~~~~~~~~~~~~~~^~~~~~~~~~~~~~~~~~~~~ ../osinfo/osinfo_loader.c:1298:64: note: use array indexing to silence this warning OSINFO_TREE_PROP_TREEINFO_VERSION + strlen("treeinfo-"))) ^ & [ ] ../osinfo/osinfo_loader.c:1303:61: error: adding 'unsigned long' to a string does not append to the string [-Werror,-Wstring-plus-int] OSINFO_TREE_PROP_TREEINFO_ARCH + strlen("treeinfo-"))) ~~~~~~~~~~~~~~~~~~~~~~~~~~~~~~~^~~~~~~~~~~~~~~~~~~~~ ../osinfo/osinfo_loader.c:1303:61: note: use array indexing to silence this warning OSINFO_TREE_PROP_TREEINFO_ARCH + strlen("treeinfo-"))) ^ & [ ] 4 errors generated. [51/125] Compiling C object 'tools/f9d35d4@@osinfo-install-script@exe/osinfo-install-script.c.o'. [52/125] Compiling C object 'tools/f9d35d4@@osinfo-install-script@exe/meson-generated_.._.._osinfo_osinfo_enum_types.c.o'. ninja: build stopped: subcommand failed. Build step 'Execute shell' marked build as failure
1 3
0 0
[Libvirt-ci] Build failed in Jenkins: libosinfo-build » libvirt-freebsd-12 #313
by ci@centos.org 13 Jan '20

13 Jan '20
See <https://ci.centos.org/job/libosinfo-build/systems=libvirt-freebsd-12/313/di…> ------------------------------------------ [...truncated 3.21 KB...] Commit message: "ci: Build osinfo-db in all containers" > git rev-list --no-walk f249da087da2a8cc354918901dc768aaeeaee625 # timeout=10 Cleaning workspace > git rev-parse --verify HEAD # timeout=10 Resetting working tree > git reset --hard # timeout=10 > git clean -fdx # timeout=10 [libosinfo] $ /bin/sh -xe /tmp/jenkins4568319110042490619.sh + rm -rf build + mkdir build + cd build + meson .. . '--prefix=/home/jenkins/build/libvirt' The Meson build system Version: 0.52.1 Source dir: /usr<https://ci.centos.org/job/libosinfo-build/systems=libvirt-freebsd-12/ws/> Build dir: /usr<https://ci.centos.org/job/libosinfo-build/systems=libvirt-freebsd-12/ws/bui…> Build type: native build Project name: libosinfo Project version: 1.8.0 C compiler for the host machine: ccache cc (clang 8.0.1 "FreeBSD clang version 8.0.1 (tags/RELEASE_801/final 366581) (based on LLVM 8.0.1)") C linker for the host machine: lld 8.0.1 Host machine cpu family: x86_64 Host machine cpu: x86_64 Program g-ir-scanner found: YES (/usr/local/bin/g-ir-scanner) Vala compiler for the host machine: valac (valac 0.40.15) Configuring libosinfo.spec using configuration Configuring mingw-libosinfo.spec using configuration Program build-aux/dist.sh found: YES (/usr<https://ci.centos.org/job/libosinfo-build/systems=libvirt-freebsd-12/ws/bui…)> Found pkg-config: /usr/local/bin/pkg-config (1.6.3) Run-time dependency glib-2.0 found: YES 2.56.3 Run-time dependency gio-2.0 found: YES 2.56.3 Run-time dependency gobject-2.0 found: YES 2.56.3 Run-time dependency libsoup-2.4 found: YES 2.62.3 Run-time dependency libxml-2.0 found: YES 2.9.10 Run-time dependency libxslt found: YES 1.1.34 Compiler for C supports arguments -W: YES Compiler for C supports arguments -Waddress: YES Compiler for C supports arguments -Waggressive-loop-optimizations: NO Compiler for C supports arguments -Wall: YES Compiler for C supports arguments -Warray-bounds: YES Compiler for C supports arguments -Wattributes: YES Compiler for C supports arguments -Wbuiltin-macro-redefined: YES Compiler for C supports arguments -Wchar-subscripts: YES Compiler for C supports arguments -Wclobbered: NO Compiler for C supports arguments -Wcomment: YES Compiler for C supports arguments -Wcomments: YES Compiler for C supports arguments -Wcoverage-mismatch: NO Compiler for C supports arguments -Wcpp: YES Compiler for C supports arguments -Wdate-time: YES Compiler for C supports arguments -Wdeprecated-declarations: YES Compiler for C supports arguments -Wdisabled-optimization: YES Compiler for C supports arguments -Wdiv-by-zero: YES Compiler for C supports arguments -Wempty-body: YES Compiler for C supports arguments -Wendif-labels: YES Compiler for C supports arguments -Wenum-compare: YES Compiler for C supports arguments -Wextra: YES Compiler for C supports arguments -Wformat-contains-nul: NO Compiler for C supports arguments -Wformat-extra-args: YES Compiler for C supports arguments -Wformat-security: YES Compiler for C supports arguments -Wformat-y2k: YES Compiler for C supports arguments -Wformat-zero-length: YES Compiler for C supports arguments -Wfree-nonheap-object: NO Compiler for C supports arguments -Wignored-qualifiers: YES Compiler for C supports arguments -Wimplicit: YES Compiler for C supports arguments -Wimplicit-function-declaration: YES Compiler for C supports arguments -Wimplicit-int: YES Compiler for C supports arguments -Winit-self: YES Compiler for C supports arguments -Winline: YES Compiler for C supports arguments -Wint-to-pointer-cast: YES Compiler for C supports arguments -Winvalid-memory-model: NO Compiler for C supports arguments -Winvalid-pch: YES Compiler for C supports arguments -Wjump-misses-init: NO Compiler for C supports arguments -Wlogical-op: NO Compiler for C supports arguments -Wmain: YES Compiler for C supports arguments -Wmaybe-uninitialized: NO Compiler for C supports arguments -Wmissing-braces: YES Compiler for C supports arguments -Wmissing-declarations: YES Compiler for C supports arguments -Wmissing-field-initializers: YES Compiler for C supports arguments -Wmissing-include-dirs: YES Compiler for C supports arguments -Wmissing-parameter-type: NO Compiler for C supports arguments -Wmissing-prototypes: YES Compiler for C supports arguments -Wmultichar: YES Compiler for C supports arguments -Wnarrowing: YES Compiler for C supports arguments -Wnested-externs: YES Compiler for C supports arguments -Wnonnull: YES Compiler for C supports arguments -Wold-style-declaration: NO Compiler for C supports arguments -Wold-style-definition: YES Compiler for C supports arguments -Wopenmp-simd: NO Compiler for C supports arguments -Woverflow: YES Compiler for C supports arguments -Woverlength-strings: YES Compiler for C supports arguments -Woverride-init: YES Compiler for C supports arguments -Wpacked: YES Compiler for C supports arguments -Wpacked-bitfield-compat: NO Compiler for C supports arguments -Wparentheses: YES Compiler for C supports arguments -Wpointer-arith: YES Compiler for C supports arguments -Wpointer-sign: YES Compiler for C supports arguments -Wpointer-to-int-cast: YES Compiler for C supports arguments -Wpragmas: YES Compiler for C supports arguments -Wreturn-local-addr: NO Compiler for C supports arguments -Wreturn-type: YES Compiler for C supports arguments -Wsequence-point: YES Compiler for C supports arguments -Wshadow: YES Compiler for C supports arguments -Wsizeof-pointer-memaccess: YES Compiler for C supports arguments -Wstack-protector: YES Compiler for C supports arguments -Wstrict-aliasing: YES Compiler for C supports arguments -Wstrict-overflow: YES Compiler for C supports arguments -Wstrict-prototypes: YES Compiler for C supports arguments -Wsuggest-attribute=const: NO Compiler for C supports arguments -Wsuggest-attribute=format: NO Compiler for C supports arguments -Wsuggest-attribute=noreturn: NO Compiler for C supports arguments -Wsuggest-attribute=pure: NO Compiler for C supports arguments -Wswitch: YES Compiler for C supports arguments -Wswitch-default: YES Compiler for C supports arguments -Wsync-nand: NO Compiler for C supports arguments -Wtrampolines: NO Compiler for C supports arguments -Wtrigraphs: YES Compiler for C supports arguments -Wtype-limits: YES Compiler for C supports arguments -Wuninitialized: YES Compiler for C supports arguments -Wunknown-pragmas: YES Compiler for C supports arguments -Wunused: YES Compiler for C supports arguments -Wunused-but-set-parameter: NO Compiler for C supports arguments -Wunused-but-set-variable: NO Compiler for C supports arguments -Wunused-function: YES Compiler for C supports arguments -Wunused-label: YES Compiler for C supports arguments -Wunused-local-typedefs: YES Compiler for C supports arguments -Wunused-parameter: YES Compiler for C supports arguments -Wunused-result: YES Compiler for C supports arguments -Wunused-value: YES Compiler for C supports arguments -Wunused-variable: YES Compiler for C supports arguments -Wvarargs: YES Compiler for C supports arguments -Wvariadic-macros: YES Compiler for C supports arguments -Wvector-operation-performance: NO Compiler for C supports arguments -Wvla: YES Compiler for C supports arguments -Wvolatile-register-var: YES Compiler for C supports arguments -Wwrite-strings: YES Compiler for C supports arguments -Wnormalized=nfc: NO Compiler for C supports arguments -Wno-sign-compare: YES Compiler for C supports arguments -Wno-sign-conversion: YES Compiler for C supports arguments -Wno-conversion: YES Compiler for C supports arguments -Wno-unused-parameter: YES Compiler for C supports arguments -Wjump-misses-init: NO (cached) Compiler for C supports arguments -Wframe-larger-than=4096: YES Compiler for C supports arguments -Wno-overlength-strings: YES Compiler for C supports arguments --param=ssp-buffer-size=4: YES Compiler for C supports arguments -fexceptions: YES Compiler for C supports arguments -fasynchronous-unwind-tables: YES Compiler for C supports arguments -fdiagnostics-show-option: YES Compiler for C supports arguments -funit-at-a-time: YES Compiler for C supports arguments -fipa-pure-const: NO Compiler for C supports arguments -Wno-suggest-attribute=pure: NO Compiler for C supports arguments -Wno-suggest-attribute=const: NO Compiler for C supports arguments -Wno-typedef-redefinition: YES Compiler for C supports arguments -Wno-missing-field-initializers: YES Compiler for C supports arguments -Werror: YES Message: Location of pci.ids: "/usr/local/share/pciids/pci.ids" Message: Location of usb.ids: "/usr/local/share/usbids/usb.ids" WARNING: Consider using the builtin warning_level option instead of adding warning flags by hand. WARNING: Consider using the builtin warning_level option instead of adding warning flags by hand. Configuring osinfo_version.h using configuration Compiler for C supports link arguments -Wl,--no-undefined: YES Configuring libosinfo-1.0.pc using configuration Found pkg-config: /usr/local/bin/pkg-config (1.6.3) Program pod2man found: YES (/usr/local/bin/pod2man) Program gtkdoc-scan found: YES (/usr/local/bin/gtkdoc-scan) Program /usr<https://ci.centos.org/job/libosinfo-build/systems=libvirt-freebsd-12/ws/bui…> found: YES (/usr<https://ci.centos.org/job/libosinfo-build/systems=libvirt-freebsd-12/ws/bui…)> Build targets in project: 38 Found ninja-1.9.0 at /usr/local/bin/ninja + /usr/local/bin/ninja [1/125] Generating osinfo-detect.1 with a custom command. [2/125] Generating osinfo-install-script.1 with a custom command. [3/125] Generating osinfo-query.1 with a custom command. [4/125] Generating osinfo_enum_types.c with a meson_exe.py custom command. [5/125] Generating osinfo_enum_types.h with a meson_exe.py custom command. [6/125] Compiling C object 'osinfo/2eb04f7@@osinfo-1.0@sha/osinfo_avatar_format.c.o'. [7/125] Compiling C object 'osinfo/2eb04f7@@osinfo-1.0@sha/osinfo_datamap.c.o'. [8/125] Compiling C object 'osinfo/2eb04f7@@osinfo-1.0@sha/meson-generated_.._osinfo_enum_types.c.o'. [9/125] Compiling C object 'osinfo/2eb04f7@@osinfo-1.0@sha/osinfo_datamaplist.c.o'. [10/125] Compiling C object 'osinfo/2eb04f7@@osinfo-1.0@sha/osinfo_device.c.o'. [11/125] Compiling C object 'osinfo/2eb04f7@@osinfo-1.0@sha/osinfo_devicelink.c.o'. [12/125] Compiling C object 'osinfo/2eb04f7@@osinfo-1.0@sha/osinfo_devicelist.c.o'. [13/125] Compiling C object 'osinfo/2eb04f7@@osinfo-1.0@sha/osinfo_devicelinkfilter.c.o'. [14/125] Compiling C object 'osinfo/2eb04f7@@osinfo-1.0@sha/osinfo_devicelinklist.c.o'. [15/125] Compiling C object 'osinfo/2eb04f7@@osinfo-1.0@sha/osinfo_device_driver.c.o'. [16/125] Compiling C object 'osinfo/2eb04f7@@osinfo-1.0@sha/osinfo_device_driverlist.c.o'. [17/125] Compiling C object 'osinfo/2eb04f7@@osinfo-1.0@sha/osinfo_entity.c.o'. [18/125] Compiling C object 'osinfo/2eb04f7@@osinfo-1.0@sha/osinfo_filter.c.o'. [19/125] Compiling C object 'osinfo/2eb04f7@@osinfo-1.0@sha/osinfo_firmware.c.o'. [20/125] Compiling C object 'osinfo/2eb04f7@@osinfo-1.0@sha/osinfo_firmwarelist.c.o'. [21/125] Compiling C object 'osinfo/2eb04f7@@osinfo-1.0@sha/osinfo_install_config.c.o'. [22/125] Compiling C object 'osinfo/2eb04f7@@osinfo-1.0@sha/osinfo_install_config_param.c.o'. [23/125] Compiling C object 'osinfo/2eb04f7@@osinfo-1.0@sha/osinfo_install_config_paramlist.c.o'. [24/125] Compiling C object 'osinfo/2eb04f7@@osinfo-1.0@sha/osinfo_install_script.c.o'. [25/125] Compiling C object 'osinfo/2eb04f7@@osinfo-1.0@sha/osinfo_install_scriptlist.c.o'. [26/125] Compiling C object 'osinfo/2eb04f7@@osinfo-1.0@sha/osinfo_product.c.o'. [27/125] Compiling C object 'osinfo/2eb04f7@@osinfo-1.0@sha/osinfo_productfilter.c.o'. [28/125] Compiling C object 'osinfo/2eb04f7@@osinfo-1.0@sha/osinfo_productlist.c.o'. [29/125] Compiling C object 'osinfo/2eb04f7@@osinfo-1.0@sha/osinfo_platform.c.o'. [30/125] Compiling C object 'osinfo/2eb04f7@@osinfo-1.0@sha/osinfo_platformlist.c.o'. [31/125] Compiling C object 'osinfo/2eb04f7@@osinfo-1.0@sha/osinfo_oslist.c.o'. [32/125] Compiling C object 'osinfo/2eb04f7@@osinfo-1.0@sha/osinfo_list.c.o'. [33/125] Compiling C object 'osinfo/2eb04f7@@osinfo-1.0@sha/osinfo_os_variant.c.o'. [34/125] Compiling C object 'osinfo/2eb04f7@@osinfo-1.0@sha/osinfo_os_variantlist.c.o'. [35/125] Compiling C object 'osinfo/2eb04f7@@osinfo-1.0@sha/osinfo_os.c.o'. [36/125] Compiling C object 'osinfo/2eb04f7@@osinfo-1.0@sha/osinfo_deploymentlist.c.o'. [37/125] Compiling C object 'osinfo/2eb04f7@@osinfo-1.0@sha/osinfo_deployment.c.o'. [38/125] Compiling C object 'osinfo/2eb04f7@@osinfo-1.0@sha/osinfo_medialist.c.o'. [39/125] Compiling C object 'osinfo/2eb04f7@@osinfo-1.0@sha/osinfo_resources.c.o'. [40/125] Compiling C object 'osinfo/2eb04f7@@osinfo-1.0@sha/osinfo_media.c.o'. [41/125] Compiling C object 'osinfo/2eb04f7@@osinfo-1.0@sha/osinfo_resourceslist.c.o'. [42/125] Compiling C object 'osinfo/2eb04f7@@osinfo-1.0@sha/osinfo_treelist.c.o'. [43/125] Compiling C object 'osinfo/2eb04f7@@osinfo-1.0@sha/osinfo_image.c.o'. [44/125] Compiling C object 'osinfo/2eb04f7@@osinfo-1.0@sha/osinfo_tree.c.o'. [45/125] Compiling C object 'osinfo/2eb04f7@@osinfo-1.0@sha/osinfo_imagelist.c.o'. [46/125] Compiling C object 'osinfo/2eb04f7@@osinfo-1.0@sha/osinfo_loader.c.o'. FAILED: osinfo/2eb04f7@@osinfo-1.0@sha/osinfo_loader.c.o ccache cc -Iosinfo/2eb04f7@@osinfo-1.0@sha -Iosinfo -I../osinfo -I. -I../ -I/usr/local/include/glib-2.0 -I/usr/local/lib/glib-2.0/include -I/usr/local/include -I/usr/local/include/libsoup-2.4 -I/usr/local/include/libxml2 -Xclang -fcolor-diagnostics -pipe -D_FILE_OFFSET_BITS=64 -Wall -Winvalid-pch -std=gnu99 -O2 -g -DGLIB_VERSION_MIN_REQUIRED=GLIB_VERSION_2_44 -DGLIB_VERSION_MAX_ALLOWED=GLIB_VERSION_2_44 '-DPKG_DATA_DIR="/home/jenkins/build/libvirt/share/libosinfo"' '-DDATA_DIR="/home/jenkins/build/libvirt/share"' '-DSYS_CONF_DIR="/home/jenkins/build/libvirt/etc"' '-DLOCALEDIR="/home/jenkins/build/libvirt/share/locale"' '-DGETTEXT_PACKAGE="libosinfo"' -W -Waddress -Wall -Warray-bounds -Wattributes -Wbuiltin-macro-redefined -Wchar-subscripts -Wcomment -Wcomments -Wcpp -Wdate-time -Wdeprecated-declarations -Wdisabled-optimization -Wdiv-by-zero -Wempty-body -Wendif-labels -Wenum-compare -Wextra -Wformat-extra-args -Wformat-security -Wformat-y2k -Wformat-zero-length -Wignored-qualifiers -Wimplicit -Wimplicit-function-declaration -Wimplicit-int -Winit-self -Winline -Wint-to-pointer-cast -Winvalid-pch -Wmain -Wmissing-braces -Wmissing-declarations -Wmissing-field-initializers -Wmissing-include-dirs -Wmissing-prototypes -Wmultichar -Wnarrowing -Wnested-externs -Wnonnull -Wold-style-definition -Woverflow -Woverlength-strings -Woverride-init -Wpacked -Wparentheses -Wpointer-arith -Wpointer-sign -Wpointer-to-int-cast -Wpragmas -Wreturn-type -Wsequence-point -Wshadow -Wsizeof-pointer-memaccess -Wstack-protector -Wstrict-aliasing -Wstrict-overflow -Wstrict-prototypes -Wswitch -Wswitch-default -Wtrigraphs -Wtype-limits -Wuninitialized -Wunknown-pragmas -Wunused -Wunused-function -Wunused-label -Wunused-local-typedefs -Wunused-parameter -Wunused-result -Wunused-value -Wunused-variable -Wvarargs -Wvariadic-macros -Wvla -Wvolatile-register-var -Wwrite-strings -Wno-sign-compare -Wno-sign-conversion -Wno-conversion -Wno-unused-parameter -Wframe-larger-than=4096 -Wno-overlength-strings --param=ssp-buffer-size=4 -fexceptions -fasynchronous-unwind-tables -fdiagnostics-show-option -funit-at-a-time -Wno-typedef-redefinition -Wno-missing-field-initializers -Werror '-DPCI_IDS="/usr/local/share/pciids/pci.ids"' '-DUSB_IDS="/usr/local/share/usbids/usb.ids"' -fPIC -pthread -MD -MQ 'osinfo/2eb04f7@@osinfo-1.0@sha/osinfo_loader.c.o' -MF 'osinfo/2eb04f7@@osinfo-1.0@sha/osinfo_loader.c.o.d' -o 'osinfo/2eb04f7@@osinfo-1.0@sha/osinfo_loader.c.o' -c ../osinfo/osinfo_loader.c ../osinfo/osinfo_loader.c:1288:58: error: adding 'unsigned long' to a string does not append to the string [-Werror,-Wstring-plus-int] OSINFO_TREE_PROP_TREEINFO_FAMILY + strlen("treeinfo-"))) ~~~~~~~~~~~~~~~~~~~~~~~~~~~~~~~~~^~~~~~~~~~~~~~~~~~~~~ ../osinfo/osinfo_loader.c:1288:58: note: use array indexing to silence this warning OSINFO_TREE_PROP_TREEINFO_FAMILY + strlen("treeinfo-"))) ^ & [ ] ../osinfo/osinfo_loader.c:1293:64: error: adding 'unsigned long' to a string does not append to the string [-Werror,-Wstring-plus-int] OSINFO_TREE_PROP_TREEINFO_VARIANT + strlen("treeinfo-"))) ~~~~~~~~~~~~~~~~~~~~~~~~~~~~~~~~~~^~~~~~~~~~~~~~~~~~~~~ ../osinfo/osinfo_loader.c:1293:64: note: use array indexing to silence this warning OSINFO_TREE_PROP_TREEINFO_VARIANT + strlen("treeinfo-"))) ^ & [ ] ../osinfo/osinfo_loader.c:1298:64: error: adding 'unsigned long' to a string does not append to the string [-Werror,-Wstring-plus-int] OSINFO_TREE_PROP_TREEINFO_VERSION + strlen("treeinfo-"))) ~~~~~~~~~~~~~~~~~~~~~~~~~~~~~~~~~~^~~~~~~~~~~~~~~~~~~~~ ../osinfo/osinfo_loader.c:1298:64: note: use array indexing to silence this warning OSINFO_TREE_PROP_TREEINFO_VERSION + strlen("treeinfo-"))) ^ & [ ] ../osinfo/osinfo_loader.c:1303:61: error: adding 'unsigned long' to a string does not append to the string [-Werror,-Wstring-plus-int] OSINFO_TREE_PROP_TREEINFO_ARCH + strlen("treeinfo-"))) ~~~~~~~~~~~~~~~~~~~~~~~~~~~~~~~^~~~~~~~~~~~~~~~~~~~~ ../osinfo/osinfo_loader.c:1303:61: note: use array indexing to silence this warning OSINFO_TREE_PROP_TREEINFO_ARCH + strlen("treeinfo-"))) ^ & [ ] 4 errors generated. [47/125] Compiling C object 'osinfo/2eb04f7@@osinfo-1.0@sha/osinfo_util_private.c.o'. [48/125] Compiling C object 'osinfo/2eb04f7@@osinfo-1.0@sha/osinfo_db.c.o'. ninja: build stopped: subcommand failed. Build step 'Execute shell' marked build as failure
1 3
0 0
[Libvirt-ci] Build failed in Jenkins: libvirt-go-check » libvirt-fedora-31 #905
by ci@centos.org 10 Jan '20

10 Jan '20
See <https://ci.centos.org/job/libvirt-go-check/systems=libvirt-fedora-31/905/di…> ------------------------------------------ Started by upstream project "libvirt-go-check" build number 905 originally caused by: Started by upstream project "libvirt-go-build" build number 919 originally caused by: Started by upstream project "libvirt-build" build number 1088 originally caused by: Started by an SCM change Running as SYSTEM [EnvInject] - Loading node environment variables. Building remotely on libvirt-fedora-31 (libvirt) in workspace <https://ci.centos.org/job/libvirt-go-check/systems=libvirt-fedora-31/ws/> [libvirt-go] $ /bin/sh -xe /tmp/jenkins5627432192402574832.sh + export 'TEST_ARGS=-tags api' + TEST_ARGS='-tags api' + go test -tags api Missing enum 'VIR_DOMAIN_STATS_MEMORY' --- FAIL: TestAPICoverage (1.47s) panic: Missing symbols found [recovered] panic: Missing symbols found goroutine 20 [running]: testing.tRunner.func1(0xc0000c8100) /usr/lib/golang/src/testing/testing.go:874 +0x3a3 panic(0x5df9a0, 0x65c8f0) /usr/lib/golang/src/runtime/panic.go:679 +0x1b2 _<https://ci.centos.org/job/libvirt-go-check/systems=libvirt-fedora-31/ws/.Te…> <https://ci.centos.org/job/libvirt-go-check/systems=libvirt-fedora-31/ws/api…>:503 +0x551 testing.tRunner(0xc0000c8100, 0x635850) /usr/lib/golang/src/testing/testing.go:909 +0xc9 created by testing.(*T).Run /usr/lib/golang/src/testing/testing.go:960 +0x350 exit status 2 FAIL _<https://ci.centos.org/job/libvirt-go-check/systems=libvirt-fedora-31/ws/> 2.102s Build step 'Execute shell' marked build as failure
1 8
0 0
[Libvirt-ci] Build failed in Jenkins: libvirt-go-check » libvirt-fedora-30 #905
by ci@centos.org 10 Jan '20

10 Jan '20
See <https://ci.centos.org/job/libvirt-go-check/systems=libvirt-fedora-30/905/di…> ------------------------------------------ Started by upstream project "libvirt-go-check" build number 905 originally caused by: Started by upstream project "libvirt-go-build" build number 919 originally caused by: Started by upstream project "libvirt-build" build number 1088 originally caused by: Started by an SCM change Running as SYSTEM [EnvInject] - Loading node environment variables. Building remotely on libvirt-fedora-30 (libvirt) in workspace <https://ci.centos.org/job/libvirt-go-check/systems=libvirt-fedora-30/ws/> [libvirt-go] $ /bin/sh -xe /tmp/jenkins14277677892881352919.sh + export 'TEST_ARGS=-tags api' + TEST_ARGS='-tags api' + go test -tags api Missing enum 'VIR_DOMAIN_STATS_MEMORY' --- FAIL: TestAPICoverage (0.41s) panic: Missing symbols found [recovered] panic: Missing symbols found goroutine 19 [running]: testing.tRunner.func1(0xc0000c8100) /usr/lib/golang/src/testing/testing.go:830 +0x392 panic(0x5d26a0, 0x648190) /usr/lib/golang/src/runtime/panic.go:522 +0x1b5 _<https://ci.centos.org/job/libvirt-go-check/systems=libvirt-fedora-30/ws/.Te…> <https://ci.centos.org/job/libvirt-go-check/systems=libvirt-fedora-30/ws/api…>:503 +0x551 testing.tRunner(0xc0000c8100, 0x622630) /usr/lib/golang/src/testing/testing.go:865 +0xc0 created by testing.(*T).Run /usr/lib/golang/src/testing/testing.go:916 +0x35a exit status 2 FAIL _<https://ci.centos.org/job/libvirt-go-check/systems=libvirt-fedora-30/ws/> 0.524s Build step 'Execute shell' marked build as failure
1 8
0 0
[Libvirt-ci] Build failed in Jenkins: libvirt-go-check » libvirt-fedora-rawhide #905
by ci@centos.org 10 Jan '20

10 Jan '20
See <https://ci.centos.org/job/libvirt-go-check/systems=libvirt-fedora-rawhide/9…> ------------------------------------------ Started by upstream project "libvirt-go-check" build number 905 originally caused by: Started by upstream project "libvirt-go-build" build number 919 originally caused by: Started by upstream project "libvirt-build" build number 1088 originally caused by: Started by an SCM change Running as SYSTEM [EnvInject] - Loading node environment variables. Building remotely on libvirt-fedora-rawhide (libvirt) in workspace <https://ci.centos.org/job/libvirt-go-check/systems=libvirt-fedora-rawhide/w…> [libvirt-go] $ /bin/sh -xe /tmp/jenkins11253955005347995057.sh + export 'TEST_ARGS=-tags api' + TEST_ARGS='-tags api' + go test -tags api Missing enum 'VIR_DOMAIN_STATS_MEMORY' --- FAIL: TestAPICoverage (0.60s) panic: Missing symbols found [recovered] panic: Missing symbols found goroutine 7 [running]: testing.tRunner.func1(0xc0000a8100) /usr/lib/golang/src/testing/testing.go:874 +0x3a3 panic(0x5df9a0, 0x65c8f0) /usr/lib/golang/src/runtime/panic.go:679 +0x1b2 _<https://ci.centos.org/job/libvirt-go-check/systems=libvirt-fedora-rawhide/w…> <https://ci.centos.org/job/libvirt-go-check/systems=libvirt-fedora-rawhide/w…>:503 +0x551 testing.tRunner(0xc0000a8100, 0x635850) /usr/lib/golang/src/testing/testing.go:909 +0xc9 created by testing.(*T).Run /usr/lib/golang/src/testing/testing.go:960 +0x350 exit status 2 FAIL _<https://ci.centos.org/job/libvirt-go-check/systems=libvirt-fedora-rawhide/w…> 0.758s Build step 'Execute shell' marked build as failure
1 8
0 0
[Libvirt-ci] Build failed in Jenkins: libvirt-go-check » libvirt-debian-10 #905
by ci@centos.org 10 Jan '20

10 Jan '20
See <https://ci.centos.org/job/libvirt-go-check/systems=libvirt-debian-10/905/di…> ------------------------------------------ Started by upstream project "libvirt-go-check" build number 905 originally caused by: Started by upstream project "libvirt-go-build" build number 919 originally caused by: Started by upstream project "libvirt-build" build number 1088 originally caused by: Started by an SCM change Running as SYSTEM [EnvInject] - Loading node environment variables. Building remotely on libvirt-debian-10 (libvirt) in workspace <https://ci.centos.org/job/libvirt-go-check/systems=libvirt-debian-10/ws/> [libvirt-go] $ /bin/sh -xe /tmp/jenkins3229834481590385990.sh + export TEST_ARGS=-tags api + go test -tags api Missing enum 'VIR_DOMAIN_STATS_MEMORY' --- FAIL: TestAPICoverage (0.43s) panic: Missing symbols found [recovered] panic: Missing symbols found goroutine 18 [running]: testing.tRunner.func1(0xc0000b4100) /usr/lib/go-1.11/src/testing/testing.go:792 +0x387 panic(0x5cfc00, 0x63cfe0) /usr/lib/go-1.11/src/runtime/panic.go:513 +0x1b9 _<https://ci.centos.org/job/libvirt-go-check/systems=libvirt-debian-10/ws/.Te…> <https://ci.centos.org/job/libvirt-go-check/systems=libvirt-debian-10/ws/api…>:503 +0x554 testing.tRunner(0xc0000b4100, 0x61e430) /usr/lib/go-1.11/src/testing/testing.go:827 +0xbf created by testing.(*T).Run /usr/lib/go-1.11/src/testing/testing.go:878 +0x35c exit status 2 FAIL _<https://ci.centos.org/job/libvirt-go-check/systems=libvirt-debian-10/ws/> 0.578s Build step 'Execute shell' marked build as failure
1 8
0 0
  • ← Newer
  • 1
  • ...
  • 6
  • 7
  • 8
  • 9
  • 10
  • 11
  • 12
  • 13
  • 14
  • Older →

HyperKitty Powered by HyperKitty version 1.3.12.