libvirt List Archives
Sign In Sign Up
Manage this list Sign In Sign Up

Keyboard Shortcuts

Thread View

  • j: Next unread message
  • k: Previous unread message
  • j a: Jump to all threads
  • j l: Jump to MailingList overview

CI

Thread Start a new thread
Download
Threads by month
  • ----- 2025 -----
  • August
  • July
  • June
  • May
  • April
  • March
  • February
  • January
  • ----- 2024 -----
  • December
  • November
  • October
  • September
  • August
  • July
  • June
  • May
  • April
  • March
  • February
  • January
  • ----- 2023 -----
  • December
  • November
  • October
  • September
  • August
  • July
  • June
  • May
  • April
  • March
  • February
  • January
  • ----- 2022 -----
  • December
  • November
  • October
  • September
  • August
  • July
  • June
  • May
  • April
  • March
  • February
  • January
  • ----- 2021 -----
  • December
  • November
  • October
  • September
  • August
  • July
  • June
  • May
  • April
  • March
  • February
  • January
  • ----- 2020 -----
  • December
  • November
  • October
  • September
  • August
  • July
  • June
  • May
  • April
  • March
  • February
  • January
  • ----- 2019 -----
  • December
  • November
  • October
  • September
  • August
  • July
  • June
  • May
  • April
  • March
  • February
  • January
  • ----- 2018 -----
  • December
  • November
  • October
  • September
  • August
  • July
  • June
  • May
  • April
  • March
  • February
  • January
  • ----- 2017 -----
  • December
  • November
  • October
  • September
  • August
  • July
  • June
  • May
  • April
  • March
  • February
  • January
  • ----- 2016 -----
  • December
  • November
  • October
  • September
  • August
  • July
ci@lists.libvirt.org

January 2020

  • 2 participants
  • 139 discussions
Build failed in Jenkins: libvirt-go-xml-check » libvirt-fedora-rawhide #943
by ci@centos.org 16 Jan '20

16 Jan '20
See <https://ci.centos.org/job/libvirt-go-xml-check/systems=libvirt-fedora-rawhi…> ------------------------------------------ Started by upstream project "libvirt-go-xml-check" build number 943 originally caused by: Started by upstream project "libvirt-go-xml-build" build number 946 originally caused by: Started by upstream project "libvirt-build" build number 1110 originally caused by: Started by an SCM change Started by an SCM change Started by an SCM change Started by an SCM change Started by an SCM change Running as SYSTEM [EnvInject] - Loading node environment variables. Building remotely on libvirt-fedora-rawhide (libvirt) in workspace <https://ci.centos.org/job/libvirt-go-xml-check/systems=libvirt-fedora-rawhi…> [libvirt-go-xml] $ /bin/sh -xe /tmp/jenkins17219924860154657365.sh + export 'TEST_ARGS=-tags xmlroundtrip' + TEST_ARGS='-tags xmlroundtrip' + go test -tags xmlroundtrip --- FAIL: TestRoundTrip (23.31s) xml_test.go:374: testdata/libvirt/tests/cputestdata/x86_64-host+guest,model486-result.xml: /cpu[0]/topology[0]/@dies: attribute '1' in expected XML missing in actual XML FAIL exit status 1 FAIL _<https://ci.centos.org/job/libvirt-go-xml-check/systems=libvirt-fedora-rawhi…> 23.406s Build step 'Execute shell' marked build as failure
1 2
0 0
Build failed in Jenkins: libvirt-go-xml-check » libvirt-centos-7 #943
by ci@centos.org 16 Jan '20

16 Jan '20
See <https://ci.centos.org/job/libvirt-go-xml-check/systems=libvirt-centos-7/943…> ------------------------------------------ Started by upstream project "libvirt-go-xml-check" build number 943 originally caused by: Started by upstream project "libvirt-go-xml-build" build number 946 originally caused by: Started by upstream project "libvirt-build" build number 1110 originally caused by: Started by an SCM change Started by an SCM change Started by an SCM change Started by an SCM change Started by an SCM change Running as SYSTEM [EnvInject] - Loading node environment variables. Building remotely on libvirt-centos-7 (libvirt) in workspace <https://ci.centos.org/job/libvirt-go-xml-check/systems=libvirt-centos-7/ws/> [libvirt-go-xml] $ /bin/sh -xe /tmp/jenkins9928726380827620957.sh + export 'TEST_ARGS=-tags xmlroundtrip' + TEST_ARGS='-tags xmlroundtrip' + go test -tags xmlroundtrip --- FAIL: TestRoundTrip (30.15s) xml_test.go:374: testdata/libvirt/tests/cputestdata/x86_64-host+guest,model486-result.xml: /cpu[0]/topology[0]/@dies: attribute '1' in expected XML missing in actual XML FAIL exit status 1 FAIL _<https://ci.centos.org/job/libvirt-go-xml-check/systems=libvirt-centos-7/ws/> 30.260s Build step 'Execute shell' marked build as failure
1 2
0 0
Build failed in Jenkins: libvirt-go-xml-check » libvirt-fedora-31 #943
by ci@centos.org 16 Jan '20

16 Jan '20
See <https://ci.centos.org/job/libvirt-go-xml-check/systems=libvirt-fedora-31/94…> ------------------------------------------ Started by upstream project "libvirt-go-xml-check" build number 943 originally caused by: Started by upstream project "libvirt-go-xml-build" build number 946 originally caused by: Started by upstream project "libvirt-build" build number 1110 originally caused by: Started by an SCM change Started by an SCM change Started by an SCM change Started by an SCM change Started by an SCM change Running as SYSTEM [EnvInject] - Loading node environment variables. Building remotely on libvirt-fedora-31 (libvirt) in workspace <https://ci.centos.org/job/libvirt-go-xml-check/systems=libvirt-fedora-31/ws/> [libvirt-go-xml] $ /bin/sh -xe /tmp/jenkins8871619201909581341.sh + export 'TEST_ARGS=-tags xmlroundtrip' + TEST_ARGS='-tags xmlroundtrip' + go test -tags xmlroundtrip --- FAIL: TestRoundTrip (12.75s) xml_test.go:374: testdata/libvirt/tests/cputestdata/x86_64-host+guest,model486-result.xml: /cpu[0]/topology[0]/@dies: attribute '1' in expected XML missing in actual XML FAIL exit status 1 FAIL _<https://ci.centos.org/job/libvirt-go-xml-check/systems=libvirt-fedora-31/ws/> 12.800s Build step 'Execute shell' marked build as failure
1 2
0 0
Build failed in Jenkins: libvirt-go-xml-check » libvirt-debian-10 #943
by ci@centos.org 16 Jan '20

16 Jan '20
See <https://ci.centos.org/job/libvirt-go-xml-check/systems=libvirt-debian-10/94…> ------------------------------------------ Started by upstream project "libvirt-go-xml-check" build number 943 originally caused by: Started by upstream project "libvirt-go-xml-build" build number 946 originally caused by: Started by upstream project "libvirt-build" build number 1110 originally caused by: Started by an SCM change Started by an SCM change Started by an SCM change Started by an SCM change Started by an SCM change Running as SYSTEM [EnvInject] - Loading node environment variables. Building remotely on libvirt-debian-10 (libvirt) in workspace <https://ci.centos.org/job/libvirt-go-xml-check/systems=libvirt-debian-10/ws/> [libvirt-go-xml] $ /bin/sh -xe /tmp/jenkins9603786397909657315.sh + export TEST_ARGS=-tags xmlroundtrip + go test -tags xmlroundtrip --- FAIL: TestRoundTrip (10.08s) xml_test.go:374: testdata/libvirt/tests/cputestdata/x86_64-host+guest,model486-result.xml: /cpu[0]/topology[0]/@dies: attribute '1' in expected XML missing in actual XML FAIL exit status 1 FAIL _<https://ci.centos.org/job/libvirt-go-xml-check/systems=libvirt-debian-10/ws/> 10.156s Build step 'Execute shell' marked build as failure
1 2
0 0
Build failed in Jenkins: libvirt-go-xml-check » libvirt-debian-9 #943
by ci@centos.org 16 Jan '20

16 Jan '20
See <https://ci.centos.org/job/libvirt-go-xml-check/systems=libvirt-debian-9/943…> ------------------------------------------ Started by upstream project "libvirt-go-xml-check" build number 943 originally caused by: Started by upstream project "libvirt-go-xml-build" build number 946 originally caused by: Started by upstream project "libvirt-build" build number 1110 originally caused by: Started by an SCM change Started by an SCM change Started by an SCM change Started by an SCM change Started by an SCM change Running as SYSTEM [EnvInject] - Loading node environment variables. Building remotely on libvirt-debian-9 (libvirt) in workspace <https://ci.centos.org/job/libvirt-go-xml-check/systems=libvirt-debian-9/ws/> [libvirt-go-xml] $ /bin/sh -xe /tmp/jenkins5783976562425124838.sh + export TEST_ARGS=-tags xmlroundtrip + go test -tags xmlroundtrip --- FAIL: TestRoundTrip (44.66s) xml_test.go:374: testdata/libvirt/tests/cputestdata/x86_64-host+guest,model486-result.xml: /cpu[0]/topology[0]/@dies: attribute '1' in expected XML missing in actual XML FAIL exit status 1 FAIL _<https://ci.centos.org/job/libvirt-go-xml-check/systems=libvirt-debian-9/ws/> 44.874s Build step 'Execute shell' marked build as failure
1 2
0 0
Build failed in Jenkins: libvirt-go-xml-check » libvirt-freebsd-11 #943
by ci@centos.org 16 Jan '20

16 Jan '20
See <https://ci.centos.org/job/libvirt-go-xml-check/systems=libvirt-freebsd-11/9…> ------------------------------------------ Started by upstream project "libvirt-go-xml-check" build number 943 originally caused by: Started by upstream project "libvirt-go-xml-build" build number 946 originally caused by: Started by upstream project "libvirt-build" build number 1110 originally caused by: Started by an SCM change Started by an SCM change Started by an SCM change Started by an SCM change Started by an SCM change Running as SYSTEM [EnvInject] - Loading node environment variables. Building remotely on libvirt-freebsd-11 (libvirt) in workspace <https://ci.centos.org/job/libvirt-go-xml-check/systems=libvirt-freebsd-11/w…> [libvirt-go-xml] $ /bin/sh -xe /tmp/jenkins7776004798623233169.sh + export 'TEST_ARGS=-tags xmlroundtrip' + go test -tags xmlroundtrip --- FAIL: TestRoundTrip (5.03s) xml_test.go:374: testdata/libvirt/tests/cputestdata/x86_64-host+guest,model486-result.xml: /cpu[0]/topology[0]/@dies: attribute '1' in expected XML missing in actual XML FAIL exit status 1 FAIL _/usr<https://ci.centos.org/job/libvirt-go-xml-check/systems=libvirt-freebsd-11/w…> 5.134s Build step 'Execute shell' marked build as failure
1 2
0 0
Build failed in Jenkins: libvirt-go-xml-check » libvirt-freebsd-12 #943
by ci@centos.org 16 Jan '20

16 Jan '20
See <https://ci.centos.org/job/libvirt-go-xml-check/systems=libvirt-freebsd-12/9…> ------------------------------------------ Started by upstream project "libvirt-go-xml-check" build number 943 originally caused by: Started by upstream project "libvirt-go-xml-build" build number 946 originally caused by: Started by upstream project "libvirt-build" build number 1110 originally caused by: Started by an SCM change Started by an SCM change Started by an SCM change Started by an SCM change Started by an SCM change Running as SYSTEM [EnvInject] - Loading node environment variables. Building remotely on libvirt-freebsd-12 (libvirt) in workspace <https://ci.centos.org/job/libvirt-go-xml-check/systems=libvirt-freebsd-12/w…> [libvirt-go-xml] $ /bin/sh -xe /tmp/jenkins8662554435103805269.sh + export 'TEST_ARGS=-tags xmlroundtrip' + go test -tags xmlroundtrip --- FAIL: TestRoundTrip (5.59s) xml_test.go:374: testdata/libvirt/tests/cputestdata/x86_64-host+guest,model486-result.xml: /cpu[0]/topology[0]/@dies: attribute '1' in expected XML missing in actual XML FAIL exit status 1 FAIL _/usr<https://ci.centos.org/job/libvirt-go-xml-check/systems=libvirt-freebsd-12/w…> 5.661s Build step 'Execute shell' marked build as failure
1 2
0 0
[Libvirt-ci] Passed: libvirt/libvirt-python#72 (v6.0.0 - ae8e5b1)
by Travis CI 15 Jan '20

15 Jan '20
Build Update for libvirt/libvirt-python ------------------------------------- Build: #72 Status: Passed Duration: 13 mins and 26 secs Commit: ae8e5b1 (v6.0.0) Author: Daniel Veillard Message: Release of libvirt-python-6.0.0 * setup.py: updated for the release Signed-off-by: Daniel Veillard <veillard(a)redhat.com> View the changeset: https://github.com/libvirt/libvirt-python/compare/v6.0.0 View the full build log and details: https://travis-ci.org/libvirt/libvirt-python/builds/637490813?utm_medium=no… -- You can unsubscribe from build emails from the libvirt/libvirt-python repository going to https://travis-ci.org/account/preferences/unsubscribe?repository=4872050&ut…. Or unsubscribe from *all* email updating your settings at https://travis-ci.org/account/preferences/unsubscribe?utm_medium=notificati…. Or configure specific recipients for build notifications in your .travis.yml file. See https://docs.travis-ci.com/user/notifications.
1 0
0 0
[Libvirt-ci] Passed: libvirt/libvirt#3045 (v6.0.0 - 10ff799)
by Travis CI 15 Jan '20

15 Jan '20
Build Update for libvirt/libvirt ------------------------------------- Build: #3045 Status: Passed Duration: 46 mins and 42 secs Commit: 10ff799 (v6.0.0) Author: Daniel Veillard Message: Release of libvirt-6.0.0 * docs/news.xml: updated for the release Signed-off-by: Daniel Veillard <veillard(a)redhat.com> View the changeset: https://github.com/libvirt/libvirt/compare/v6.0.0 View the full build log and details: https://travis-ci.org/libvirt/libvirt/builds/637490702?utm_medium=notificat… -- You can unsubscribe from build emails from the libvirt/libvirt repository going to https://travis-ci.org/account/preferences/unsubscribe?repository=4872032&ut…. Or unsubscribe from *all* email updating your settings at https://travis-ci.org/account/preferences/unsubscribe?utm_medium=notificati…. Or configure specific recipients for build notifications in your .travis.yml file. See https://docs.travis-ci.com/user/notifications.
1 0
0 0
[Libvirt-ci] Passed: libvirt/libvirt#3042 (v6.0.0-rc2 - 7d60846)
by Travis CI 13 Jan '20

13 Jan '20
Build Update for libvirt/libvirt ------------------------------------- Build: #3042 Status: Passed Duration: 45 mins and 7 secs Commit: 7d60846 (v6.0.0-rc2) Author: Pavel Hrdina Message: vircgroupv2devices: free BPF map when replacing with new one This leaks the FD of BPF map which means it will not be freed. Signed-off-by: Pavel Hrdina <phrdina(a)redhat.com> Reviewed-by: Jiri Denemark <jdenemar(a)redhat.com> View the changeset: https://github.com/libvirt/libvirt/compare/v6.0.0-rc2 View the full build log and details: https://travis-ci.org/libvirt/libvirt/builds/636477195?utm_medium=notificat… -- You can unsubscribe from build emails from the libvirt/libvirt repository going to https://travis-ci.org/account/preferences/unsubscribe?repository=4872032&ut…. Or unsubscribe from *all* email updating your settings at https://travis-ci.org/account/preferences/unsubscribe?utm_medium=notificati…. Or configure specific recipients for build notifications in your .travis.yml file. See https://docs.travis-ci.com/user/notifications.
1 0
0 0
  • ← Newer
  • 1
  • ...
  • 5
  • 6
  • 7
  • 8
  • 9
  • 10
  • 11
  • ...
  • 14
  • Older →

HyperKitty Powered by HyperKitty version 1.3.12.