libvirt List Archives
Sign In Sign Up
Manage this list Sign In Sign Up

Keyboard Shortcuts

Thread View

  • j: Next unread message
  • k: Previous unread message
  • j a: Jump to all threads
  • j l: Jump to MailingList overview

CI

Thread Start a new thread
Download
Threads by month
  • ----- 2025 -----
  • August
  • July
  • June
  • May
  • April
  • March
  • February
  • January
  • ----- 2024 -----
  • December
  • November
  • October
  • September
  • August
  • July
  • June
  • May
  • April
  • March
  • February
  • January
  • ----- 2023 -----
  • December
  • November
  • October
  • September
  • August
  • July
  • June
  • May
  • April
  • March
  • February
  • January
  • ----- 2022 -----
  • December
  • November
  • October
  • September
  • August
  • July
  • June
  • May
  • April
  • March
  • February
  • January
  • ----- 2021 -----
  • December
  • November
  • October
  • September
  • August
  • July
  • June
  • May
  • April
  • March
  • February
  • January
  • ----- 2020 -----
  • December
  • November
  • October
  • September
  • August
  • July
  • June
  • May
  • April
  • March
  • February
  • January
  • ----- 2019 -----
  • December
  • November
  • October
  • September
  • August
  • July
  • June
  • May
  • April
  • March
  • February
  • January
  • ----- 2018 -----
  • December
  • November
  • October
  • September
  • August
  • July
  • June
  • May
  • April
  • March
  • February
  • January
  • ----- 2017 -----
  • December
  • November
  • October
  • September
  • August
  • July
  • June
  • May
  • April
  • March
  • February
  • January
  • ----- 2016 -----
  • December
  • November
  • October
  • September
  • August
  • July
ci@lists.libvirt.org

January 2020

  • 2 participants
  • 139 discussions
Still Failing: libvirt/libvirt#3103 (master - 72ed254)
by Travis CI 31 Jan '20

31 Jan '20
Build Update for libvirt/libvirt ------------------------------------- Build: #3103 Status: Still Failing Duration: 36 mins and 58 secs Commit: 72ed254 (master) Author: Jim Fehlig Message: build: Drop execute permissions on virsh bash completion command rpmlint complains about "script-without-shebang" due to the execute permissions on /usr/share/bash-completion/completions/vsh. Use INSTALL_DATA instead of INSTALL_SCRIPT to avoid the unnecessary execute permissions. Signed-off-by: Jim Fehlig <jfehlig(a)suse.com> Reviewed-by: Michal Privoznik <mprivozn(a)redhat.com> View the changeset: https://github.com/libvirt/libvirt/compare/e8d5eb0cdec4...72ed254b3857 View the full build log and details: https://travis-ci.org/libvirt/libvirt/builds/644420671?utm_medium=notificat… -- You can unsubscribe from build emails from the libvirt/libvirt repository going to https://travis-ci.org/account/preferences/unsubscribe?repository=4872032&ut…. Or unsubscribe from *all* email updating your settings at https://travis-ci.org/account/preferences/unsubscribe?utm_medium=notificati…. Or configure specific recipients for build notifications in your .travis.yml file. See https://docs.travis-ci.com/user/notifications.
1 0
0 0
Build failed in Jenkins: virt-manager-check » libvirt-freebsd-12 #1456
by ci@centos.org 30 Jan '20

30 Jan '20
See <https://ci.centos.org/job/virt-manager-check/systems=libvirt-freebsd-12/145…> ------------------------------------------ Started by upstream project "virt-manager-check" build number 1456 originally caused by: Started by upstream project "virt-manager-build" build number 1460 originally caused by: Started by an SCM change Running as SYSTEM [EnvInject] - Loading node environment variables. Building remotely on libvirt-freebsd-12 (libvirt) in workspace <https://ci.centos.org/job/virt-manager-check/systems=libvirt-freebsd-12/ws/> [virt-manager] $ /bin/sh -xe /tmp/jenkins10331693705854594085.sh + /usr/local/bin/python3 ./setup.py test running test ............................................................F......................................................................................................................................................GLib-GIO-Message: 00:05:03.661: Using the 'memory' GSettings backend. Your settings will not be saved or shared with other applications. ..................................................................................................................................................................................................................................................................................................................................................................sssssssssssssssss ====================================================================== FAIL: test_dir_searchable (tests.test_xmlconfig.TestXMLMisc) ---------------------------------------------------------------------- Traceback (most recent call last): File "/usr<https://ci.centos.org/job/virt-manager-check/systems=libvirt-freebsd-12/ws/…",> line 230, in wrapper_cb return cb(*args, **kwargs) File "/usr<https://ci.centos.org/job/virt-manager-check/systems=libvirt-freebsd-12/ws/…",> line 204, in test_dir_searchable self.assertTrue(bool(searchdata.fixlist)) AssertionError: False is not true ---------------------------------------------------------------------- Ran 582 tests in 118.388s FAILED (failures=1, skipped=17) Build step 'Execute shell' marked build as failure
1 7
0 0
Build failed in Jenkins: virt-manager-check » libvirt-freebsd-11 #1456
by ci@centos.org 30 Jan '20

30 Jan '20
See <https://ci.centos.org/job/virt-manager-check/systems=libvirt-freebsd-11/145…> ------------------------------------------ Started by upstream project "virt-manager-check" build number 1456 originally caused by: Started by upstream project "virt-manager-build" build number 1460 originally caused by: Started by an SCM change Running as SYSTEM [EnvInject] - Loading node environment variables. Building remotely on libvirt-freebsd-11 (libvirt) in workspace <https://ci.centos.org/job/virt-manager-check/systems=libvirt-freebsd-11/ws/> [virt-manager] $ /bin/sh -xe /tmp/jenkins14796128689004324296.sh + /usr/local/bin/python3 ./setup.py test running test ............................................................F......................................................................................................................................................GLib-GIO-Message: 00:05:01.192: Using the 'memory' GSettings backend. Your settings will not be saved or shared with other applications. ..................................................................................................................................................................................................................................................................................................................................................................sssssssssssssssss ====================================================================== FAIL: test_dir_searchable (tests.test_xmlconfig.TestXMLMisc) ---------------------------------------------------------------------- Traceback (most recent call last): File "/usr<https://ci.centos.org/job/virt-manager-check/systems=libvirt-freebsd-11/ws/…",> line 230, in wrapper_cb return cb(*args, **kwargs) File "/usr<https://ci.centos.org/job/virt-manager-check/systems=libvirt-freebsd-11/ws/…",> line 204, in test_dir_searchable self.assertTrue(bool(searchdata.fixlist)) AssertionError: False is not true ---------------------------------------------------------------------- Ran 582 tests in 118.174s FAILED (failures=1, skipped=17) Build step 'Execute shell' marked build as failure
1 7
0 0
Build failed in Jenkins: virt-manager-check » libvirt-fedora-30 #1456
by ci@centos.org 30 Jan '20

30 Jan '20
See <https://ci.centos.org/job/virt-manager-check/systems=libvirt-fedora-30/1456…> ------------------------------------------ Started by upstream project "virt-manager-check" build number 1456 originally caused by: Started by upstream project "virt-manager-build" build number 1460 originally caused by: Started by an SCM change Running as SYSTEM [EnvInject] - Loading node environment variables. Building remotely on libvirt-fedora-30 (libvirt) in workspace <https://ci.centos.org/job/virt-manager-check/systems=libvirt-fedora-30/ws/> [virt-manager] $ /bin/sh -xe /tmp/jenkins13999224590799386200.sh + /usr/bin/python3 ./setup.py test running test ............................................................F........................................................................................................................................................................................................................................................................................................................................................................................................................................................................................................................sssssssssssssssss ====================================================================== FAIL: test_dir_searchable (tests.test_xmlconfig.TestXMLMisc) ---------------------------------------------------------------------- Traceback (most recent call last): File "<https://ci.centos.org/job/virt-manager-check/systems=libvirt-fedora-30/ws/t…",> line 230, in wrapper_cb return cb(*args, **kwargs) File "<https://ci.centos.org/job/virt-manager-check/systems=libvirt-fedora-30/ws/t…",> line 204, in test_dir_searchable self.assertTrue(bool(searchdata.fixlist)) AssertionError: False is not true ---------------------------------------------------------------------- Ran 582 tests in 106.038s FAILED (failures=1, skipped=17) Build step 'Execute shell' marked build as failure
1 7
0 0
Build failed in Jenkins: virt-manager-check » libvirt-fedora-31 #1456
by ci@centos.org 30 Jan '20

30 Jan '20
See <https://ci.centos.org/job/virt-manager-check/systems=libvirt-fedora-31/1456…> ------------------------------------------ Started by upstream project "virt-manager-check" build number 1456 originally caused by: Started by upstream project "virt-manager-build" build number 1460 originally caused by: Started by an SCM change Running as SYSTEM [EnvInject] - Loading node environment variables. Building remotely on libvirt-fedora-31 (libvirt) in workspace <https://ci.centos.org/job/virt-manager-check/systems=libvirt-fedora-31/ws/> [virt-manager] $ /bin/sh -xe /tmp/jenkins11486929816797868222.sh + /usr/bin/python3 ./setup.py test running test ............................................................F........................................................................................................................................................................................................................................................................................................................................................................................................................................................................................................................sssssssssssssssss ====================================================================== FAIL: test_dir_searchable (tests.test_xmlconfig.TestXMLMisc) ---------------------------------------------------------------------- Traceback (most recent call last): File "<https://ci.centos.org/job/virt-manager-check/systems=libvirt-fedora-31/ws/t…",> line 230, in wrapper_cb return cb(*args, **kwargs) File "<https://ci.centos.org/job/virt-manager-check/systems=libvirt-fedora-31/ws/t…",> line 204, in test_dir_searchable self.assertTrue(bool(searchdata.fixlist)) AssertionError: False is not true ---------------------------------------------------------------------- Ran 582 tests in 104.985s FAILED (failures=1, skipped=17) Build step 'Execute shell' marked build as failure
1 7
0 0
Build failed in Jenkins: virt-manager-check » libvirt-fedora-rawhide #1456
by ci@centos.org 30 Jan '20

30 Jan '20
See <https://ci.centos.org/job/virt-manager-check/systems=libvirt-fedora-rawhide…> ------------------------------------------ Started by upstream project "virt-manager-check" build number 1456 originally caused by: Started by upstream project "virt-manager-build" build number 1460 originally caused by: Started by an SCM change Running as SYSTEM [EnvInject] - Loading node environment variables. Building remotely on libvirt-fedora-rawhide (libvirt) in workspace <https://ci.centos.org/job/virt-manager-check/systems=libvirt-fedora-rawhide…> [virt-manager] $ /bin/sh -xe /tmp/jenkins2290827070297983228.sh + /usr/bin/python3 ./setup.py test running test ............................................................F........................................................................................................................................................................................................................................................................................................................................................................................................................................................................................................................sssssssssssssssss ====================================================================== FAIL: test_dir_searchable (tests.test_xmlconfig.TestXMLMisc) ---------------------------------------------------------------------- Traceback (most recent call last): File "<https://ci.centos.org/job/virt-manager-check/systems=libvirt-fedora-rawhide…",> line 230, in wrapper_cb return cb(*args, **kwargs) File "<https://ci.centos.org/job/virt-manager-check/systems=libvirt-fedora-rawhide…",> line 204, in test_dir_searchable self.assertTrue(bool(searchdata.fixlist)) AssertionError: False is not true ---------------------------------------------------------------------- Ran 582 tests in 94.958s FAILED (failures=1, skipped=17) Build step 'Execute shell' marked build as failure
1 7
0 0
Build failed in Jenkins: virt-manager-check » libvirt-debian-9 #1456
by ci@centos.org 30 Jan '20

30 Jan '20
See <https://ci.centos.org/job/virt-manager-check/systems=libvirt-debian-9/1456/…> ------------------------------------------ Started by upstream project "virt-manager-check" build number 1456 originally caused by: Started by upstream project "virt-manager-build" build number 1460 originally caused by: Started by an SCM change Running as SYSTEM [EnvInject] - Loading node environment variables. Building remotely on libvirt-debian-9 (libvirt) in workspace <https://ci.centos.org/job/virt-manager-check/systems=libvirt-debian-9/ws/> [virt-manager] $ /bin/sh -xe /tmp/jenkins9219505022267693857.sh + /usr/bin/python3 ./setup.py test running test ............................................................F........................................................................................................................................................................................................................................................................................................................................................................................................................................................................................................................sssssssssssssssss ====================================================================== FAIL: test_dir_searchable (tests.test_xmlconfig.TestXMLMisc) ---------------------------------------------------------------------- Traceback (most recent call last): File "<https://ci.centos.org/job/virt-manager-check/systems=libvirt-debian-9/ws/te…",> line 230, in wrapper_cb return cb(*args, **kwargs) File "<https://ci.centos.org/job/virt-manager-check/systems=libvirt-debian-9/ws/te…",> line 205, in test_dir_searchable self.assertEqual(searchdata.user, "qemu") AssertionError: '_chrony' != 'qemu' - _chrony + qemu ---------------------------------------------------------------------- Ran 582 tests in 103.816s FAILED (failures=1, skipped=17) Build step 'Execute shell' marked build as failure
1 5
0 0
Build failed in Jenkins: virt-manager-check » libvirt-debian-10 #1456
by ci@centos.org 30 Jan '20

30 Jan '20
See <https://ci.centos.org/job/virt-manager-check/systems=libvirt-debian-10/1456…> ------------------------------------------ Started by upstream project "virt-manager-check" build number 1456 originally caused by: Started by upstream project "virt-manager-build" build number 1460 originally caused by: Started by an SCM change Running as SYSTEM [EnvInject] - Loading node environment variables. Building remotely on libvirt-debian-10 (libvirt) in workspace <https://ci.centos.org/job/virt-manager-check/systems=libvirt-debian-10/ws/> [virt-manager] $ /bin/sh -xe /tmp/jenkins17644955340335300203.sh + /usr/bin/python3 ./setup.py test running test ............................................................F........................................................................................................................................................................................................................................................................................................................................................................................................................................................................................................................sssssssssssssssss ====================================================================== FAIL: test_dir_searchable (tests.test_xmlconfig.TestXMLMisc) ---------------------------------------------------------------------- Traceback (most recent call last): File "<https://ci.centos.org/job/virt-manager-check/systems=libvirt-debian-10/ws/t…",> line 230, in wrapper_cb return cb(*args, **kwargs) File "<https://ci.centos.org/job/virt-manager-check/systems=libvirt-debian-10/ws/t…",> line 205, in test_dir_searchable self.assertEqual(searchdata.user, "qemu") AssertionError: 'radvd' != 'qemu' - radvd + qemu ---------------------------------------------------------------------- Ran 582 tests in 83.554s FAILED (failures=1, skipped=17) Build step 'Execute shell' marked build as failure
1 5
0 0
Build failed in Jenkins: virt-viewer-build » libvirt-fedora-31 #971
by ci@centos.org 30 Jan '20

30 Jan '20
See <https://ci.centos.org/job/virt-viewer-build/systems=libvirt-fedora-31/971/d…> ------------------------------------------ Started by upstream project "virt-viewer-build" build number 971 originally caused by: Started by upstream project "libvirt-glib-build" build number 954 originally caused by: Started by upstream project "libvirt-build" build number 1142 originally caused by: Started by an SCM change Running as SYSTEM [EnvInject] - Loading node environment variables. Building remotely on libvirt-fedora-31 (libvirt) in workspace <https://ci.centos.org/job/virt-viewer-build/systems=libvirt-fedora-31/ws/> No credentials specified > git rev-parse --is-inside-work-tree # timeout=10 Fetching changes from the remote Git repository > git config remote.origin.url https://pagure.io/virt-viewer.git # timeout=10 Fetching upstream changes from https://pagure.io/virt-viewer.git > git --version # timeout=10 > git fetch --tags --force --progress https://pagure.io/virt-viewer.git +refs/heads/*:refs/remotes/origin/* ERROR: Error fetching remote repo 'origin' hudson.plugins.git.GitException: Failed to fetch from https://pagure.io/virt-viewer.git at hudson.plugins.git.GitSCM.fetchFrom(GitSCM.java:894) at hudson.plugins.git.GitSCM.retrieveChanges(GitSCM.java:1161) at hudson.plugins.git.GitSCM.checkout(GitSCM.java:1192) at hudson.scm.SCM.checkout(SCM.java:504) at hudson.model.AbstractProject.checkout(AbstractProject.java:1208) at hudson.model.AbstractBuild$AbstractBuildExecution.defaultCheckout(AbstractBuild.java:574) at jenkins.scm.SCMCheckoutStrategy.checkout(SCMCheckoutStrategy.java:86) at hudson.model.AbstractBuild$AbstractBuildExecution.run(AbstractBuild.java:499) at hudson.model.Run.execute(Run.java:1818) at hudson.matrix.MatrixRun.run(MatrixRun.java:153) at hudson.model.ResourceController.execute(ResourceController.java:97) at hudson.model.Executor.run(Executor.java:429) Caused by: hudson.plugins.git.GitException: Command "git fetch --tags --force --progress https://pagure.io/virt-viewer.git +refs/heads/*:refs/remotes/origin/*" returned status code 128: stdout: stderr: fatal: unable to access 'https://pagure.io/virt-viewer.git/': The requested URL returned error: 500 at org.jenkinsci.plugins.gitclient.CliGitAPIImpl.launchCommandIn(CliGitAPIImpl.java:2042) at org.jenkinsci.plugins.gitclient.CliGitAPIImpl.launchCommandWithCredentials(CliGitAPIImpl.java:1761) at org.jenkinsci.plugins.gitclient.CliGitAPIImpl.access$400(CliGitAPIImpl.java:72) at org.jenkinsci.plugins.gitclient.CliGitAPIImpl$1.execute(CliGitAPIImpl.java:442) at org.jenkinsci.plugins.gitclient.RemoteGitImpl$CommandInvocationHandler$1.call(RemoteGitImpl.java:153) at org.jenkinsci.plugins.gitclient.RemoteGitImpl$CommandInvocationHandler$1.call(RemoteGitImpl.java:146) at hudson.remoting.UserRequest.perform(UserRequest.java:212) at hudson.remoting.UserRequest.perform(UserRequest.java:54) at hudson.remoting.Request$2.run(Request.java:369) at hudson.remoting.InterceptingExecutorService$1.call(InterceptingExecutorService.java:72) at java.util.concurrent.FutureTask.run(FutureTask.java:264) at java.util.concurrent.ThreadPoolExecutor.runWorker(ThreadPoolExecutor.java:1128) at java.util.concurrent.ThreadPoolExecutor$Worker.run(ThreadPoolExecutor.java:628) at hudson.remoting.Engine$1.lambda$newThread$0(Engine.java:93) at java.lang.Thread.run(Thread.java:834) Suppressed: hudson.remoting.Channel$CallSiteStackTrace: Remote call to JNLP4-connect connection from n64.gusty.ci.centos.org/172.19.2.192:42648 at hudson.remoting.Channel.attachCallSiteStackTrace(Channel.java:1743) at hudson.remoting.UserRequest$ExceptionResponse.retrieve(UserRequest.java:357) at hudson.remoting.Channel.call(Channel.java:957) at org.jenkinsci.plugins.gitclient.RemoteGitImpl$CommandInvocationHandler.execute(RemoteGitImpl.java:146) at sun.reflect.GeneratedMethodAccessor491.invoke(Unknown Source) at sun.reflect.DelegatingMethodAccessorImpl.invoke(DelegatingMethodAccessorImpl.java:43) at java.lang.reflect.Method.invoke(Method.java:498) at org.jenkinsci.plugins.gitclient.RemoteGitImpl$CommandInvocationHandler.invoke(RemoteGitImpl.java:132) at com.sun.proxy.$Proxy86.execute(Unknown Source) at hudson.plugins.git.GitSCM.fetchFrom(GitSCM.java:892) at hudson.plugins.git.GitSCM.retrieveChanges(GitSCM.java:1161) at hudson.plugins.git.GitSCM.checkout(GitSCM.java:1192) at hudson.scm.SCM.checkout(SCM.java:504) at hudson.model.AbstractProject.checkout(AbstractProject.java:1208) at hudson.model.AbstractBuild$AbstractBuildExecution.defaultCheckout(AbstractBuild.java:574) at jenkins.scm.SCMCheckoutStrategy.checkout(SCMCheckoutStrategy.java:86) at hudson.model.AbstractBuild$AbstractBuildExecution.run(AbstractBuild.java:499) at hudson.model.Run.execute(Run.java:1818) at hudson.matrix.MatrixRun.run(MatrixRun.java:153) at hudson.model.ResourceController.execute(ResourceController.java:97) at hudson.model.Executor.run(Executor.java:429) ERROR: Error fetching remote repo 'origin'
1 1
0 0
Build failed in Jenkins: libvirt-go-xml-check » libvirt-fedora-rawhide #969
by ci@centos.org 29 Jan '20

29 Jan '20
See <https://ci.centos.org/job/libvirt-go-xml-check/systems=libvirt-fedora-rawhi…> ------------------------------------------ Started by upstream project "libvirt-go-xml-check" build number 969 originally caused by: Started by upstream project "libvirt-go-xml-build" build number 972 originally caused by: Started by upstream project "libvirt-build" build number 1138 originally caused by: Started by an SCM change Running as SYSTEM [EnvInject] - Loading node environment variables. Building remotely on libvirt-fedora-rawhide (libvirt) in workspace <https://ci.centos.org/job/libvirt-go-xml-check/systems=libvirt-fedora-rawhi…> [libvirt-go-xml] $ /bin/sh -xe /tmp/jenkins2991078690034175603.sh + export 'TEST_ARGS=-tags xmlroundtrip' + TEST_ARGS='-tags xmlroundtrip' + go test -tags xmlroundtrip --- FAIL: TestRoundTrip (13.61s) xml_test.go:403: Unable to update libvirt.git: exit status 1: fatal: the remote end hung up unexpectedly FAIL exit status 1 FAIL _<https://ci.centos.org/job/libvirt-go-xml-check/systems=libvirt-fedora-rawhi…> 13.732s Build step 'Execute shell' marked build as failure
1 1
0 0
  • ← Newer
  • 1
  • 2
  • 3
  • 4
  • 5
  • ...
  • 14
  • Older →

HyperKitty Powered by HyperKitty version 1.3.12.