libvirt List Archives
Sign In Sign Up
Manage this list Sign In Sign Up

Keyboard Shortcuts

Thread View

  • j: Next unread message
  • k: Previous unread message
  • j a: Jump to all threads
  • j l: Jump to MailingList overview

CI

Thread Start a new thread
Download
Threads by month
  • ----- 2025 -----
  • August
  • July
  • June
  • May
  • April
  • March
  • February
  • January
  • ----- 2024 -----
  • December
  • November
  • October
  • September
  • August
  • July
  • June
  • May
  • April
  • March
  • February
  • January
  • ----- 2023 -----
  • December
  • November
  • October
  • September
  • August
  • July
  • June
  • May
  • April
  • March
  • February
  • January
  • ----- 2022 -----
  • December
  • November
  • October
  • September
  • August
  • July
  • June
  • May
  • April
  • March
  • February
  • January
  • ----- 2021 -----
  • December
  • November
  • October
  • September
  • August
  • July
  • June
  • May
  • April
  • March
  • February
  • January
  • ----- 2020 -----
  • December
  • November
  • October
  • September
  • August
  • July
  • June
  • May
  • April
  • March
  • February
  • January
  • ----- 2019 -----
  • December
  • November
  • October
  • September
  • August
  • July
  • June
  • May
  • April
  • March
  • February
  • January
  • ----- 2018 -----
  • December
  • November
  • October
  • September
  • August
  • July
  • June
  • May
  • April
  • March
  • February
  • January
  • ----- 2017 -----
  • December
  • November
  • October
  • September
  • August
  • July
  • June
  • May
  • April
  • March
  • February
  • January
  • ----- 2016 -----
  • December
  • November
  • October
  • September
  • August
  • July
ci@lists.libvirt.org

January 2020

  • 2 participants
  • 139 discussions
[Libvirt-ci] Build failed in Jenkins: libvirt-perl-check » libvirt-debian-9 #925
by ci@centos.org 10 Jan '20

10 Jan '20
See <https://ci.centos.org/job/libvirt-perl-check/systems=libvirt-debian-9/925/d…> ------------------------------------------ Started by upstream project "libvirt-perl-check" build number 925 originally caused by: Started by upstream project "libvirt-perl-build" build number 926 originally caused by: Started by upstream project "libvirt-build" build number 1088 originally caused by: Started by an SCM change Running as SYSTEM [EnvInject] - Loading node environment variables. Building remotely on libvirt-debian-9 (libvirt) in workspace <https://ci.centos.org/job/libvirt-perl-check/systems=libvirt-debian-9/ws/> [libvirt-perl] $ /bin/sh -xe /tmp/jenkins217997515766084880.sh + export TEST_MAINTAINER=1 + perl Build test t/005-pod.t ............ ok t/010-pod-coverage.t ... ok t/015-changes.t ........ ok t/020-constants.t ...... ok # Failed test 'VIR_DOMAIN_STATS_MEMORY' # at t/030-api-coverage.t line 175. # Looks like you failed 1 test of 1750. t/030-api-coverage.t ... Dubious, test returned 1 (wstat 256, 0x100) Failed 1/1750 subtests t/100-connect.t ........ ok t/200-domains.t ........ ok t/300-networks.t ....... ok t/400-storage-pools.t .. ok t/500-storage-vols.t ... ok t/600-interfaces.t ..... ok t/800-events.t ......... ok Test Summary Report ------------------- t/030-api-coverage.t (Wstat: 256 Tests: 1750 Failed: 1) Failed test: 1114 Non-zero exit status: 1 Files=12, Tests=2008, 16 wallclock secs ( 0.55 usr 0.13 sys + 11.81 cusr 0.56 csys = 13.05 CPU) Result: FAIL Failed 1/12 test programs. 1/2008 subtests failed. Build step 'Execute shell' marked build as failure
1 7
0 0
[Libvirt-ci] Build failed in Jenkins: libvirt-perl-check » libvirt-debian-10 #925
by ci@centos.org 10 Jan '20

10 Jan '20
See <https://ci.centos.org/job/libvirt-perl-check/systems=libvirt-debian-10/925/…> ------------------------------------------ Started by upstream project "libvirt-perl-check" build number 925 originally caused by: Started by upstream project "libvirt-perl-build" build number 926 originally caused by: Started by upstream project "libvirt-build" build number 1088 originally caused by: Started by an SCM change Running as SYSTEM [EnvInject] - Loading node environment variables. Building remotely on libvirt-debian-10 (libvirt) in workspace <https://ci.centos.org/job/libvirt-perl-check/systems=libvirt-debian-10/ws/> [libvirt-perl] $ /bin/sh -xe /tmp/jenkins17043231792513463273.sh + export TEST_MAINTAINER=1 + perl Build test t/005-pod.t ............ ok t/010-pod-coverage.t ... ok t/015-changes.t ........ ok t/020-constants.t ...... ok # Failed test 'VIR_DOMAIN_STATS_MEMORY' # at t/030-api-coverage.t line 175. # Looks like you failed 1 test of 1750. t/030-api-coverage.t ... Dubious, test returned 1 (wstat 256, 0x100) Failed 1/1750 subtests t/100-connect.t ........ ok t/200-domains.t ........ ok t/300-networks.t ....... ok t/400-storage-pools.t .. ok t/500-storage-vols.t ... ok t/600-interfaces.t ..... ok t/800-events.t ......... ok Test Summary Report ------------------- t/030-api-coverage.t (Wstat: 256 Tests: 1750 Failed: 1) Failed test: 1114 Non-zero exit status: 1 Files=12, Tests=2008, 13 wallclock secs ( 0.57 usr 0.65 sys + 11.56 cusr 0.87 csys = 13.65 CPU) Result: FAIL Failed 1/12 test programs. 1/2008 subtests failed. Build step 'Execute shell' marked build as failure
1 7
0 0
[Libvirt-ci] Passed: libvirt/libvirt#3033 (v6.0.0-rc1 - e012726)
by Travis CI 10 Jan '20

10 Jan '20
Build Update for libvirt/libvirt ------------------------------------- Build: #3033 Status: Passed Duration: 23 mins and 28 secs Commit: e012726 (v6.0.0-rc1) Author: Jiri Denemark Message: qemu: Don't use NULL path from qemuDomainGetHostdevPath Commit v5.10.0-290-g3a4787a301 refactored qemuDomainGetHostdevPath to return a single path rather than an array of paths. When the function is called on a missing device, it will now return NULL in @path rather than a NULL array with zero items and the callers need to be adapted properly. Signed-off-by: Jiri Denemark <jdenemar(a)redhat.com> Reviewed-by: Michal Privoznik <mprivozn(a)redhat.com> View the changeset: https://github.com/libvirt/libvirt/compare/v6.0.0-rc1 View the full build log and details: https://travis-ci.org/libvirt/libvirt/builds/635203701?utm_medium=notificat… -- You can unsubscribe from build emails from the libvirt/libvirt repository going to https://travis-ci.org/account/preferences/unsubscribe?repository=4872032&ut…. Or unsubscribe from *all* email updating your settings at https://travis-ci.org/account/preferences/unsubscribe?utm_medium=notificati…. Or configure specific recipients for build notifications in your .travis.yml file. See https://docs.travis-ci.com/user/notifications.
1 0
0 0
[Libvirt-ci] Build failed in Jenkins: gtk-vnc-build » libvirt-centos-7 #1
by ci@centos.org 08 Jan '20

08 Jan '20
See <https://ci.centos.org/job/gtk-vnc-build/systems=libvirt-centos-7/1/display/…> ------------------------------------------ Started by upstream project "gtk-vnc-build" build number 1 originally caused by: Started by user Libvirt Running as SYSTEM [EnvInject] - Loading node environment variables. Building remotely on libvirt-centos-7 (libvirt) in workspace <https://ci.centos.org/job/gtk-vnc-build/systems=libvirt-centos-7/ws/> No credentials specified Cloning the remote Git repository Cloning repository https://gitlab.gnome.org/GNOME/gtk-vnc.git > git init <https://ci.centos.org/job/gtk-vnc-build/systems=libvirt-centos-7/ws/> # timeout=10 Fetching upstream changes from https://gitlab.gnome.org/GNOME/gtk-vnc.git > git --version # timeout=10 > git fetch --tags --progress https://gitlab.gnome.org/GNOME/gtk-vnc.git +refs/heads/*:refs/remotes/origin/* > git config remote.origin.url https://gitlab.gnome.org/GNOME/gtk-vnc.git # timeout=10 > git config --add remote.origin.fetch +refs/heads/*:refs/remotes/origin/* # timeout=10 > git config remote.origin.url https://gitlab.gnome.org/GNOME/gtk-vnc.git # timeout=10 Fetching upstream changes from https://gitlab.gnome.org/GNOME/gtk-vnc.git > git fetch --tags --progress https://gitlab.gnome.org/GNOME/gtk-vnc.git +refs/heads/*:refs/remotes/origin/* Checking out Revision 423405a724645f1b205ca86d39397cfcb6fb1461 (refs/remotes/origin/master) > git config core.sparsecheckout # timeout=10 > git checkout -f 423405a724645f1b205ca86d39397cfcb6fb1461 Commit message: "Relax min x11 dep for Debian 9 portability" First time build. Skipping changelog. Cleaning workspace > git rev-parse --verify HEAD # timeout=10 Resetting working tree > git reset --hard # timeout=10 > git clean -fdx # timeout=10 [gtk-vnc] $ /bin/sh -xe /tmp/jenkins13992175769377819881.sh + rm -rf build + mkdir build + cd build + meson .. . --prefix=/home/jenkins/build/libvirt The Meson build system Version: 0.49.0 Source dir: <https://ci.centos.org/job/gtk-vnc-build/systems=libvirt-centos-7/ws/> Build dir: <https://ci.centos.org/job/gtk-vnc-build/systems=libvirt-centos-7/ws/build> Build type: native build Project name: gtk-vnc Project version: 1.0.0 Native C compiler: cc (gcc 4.8.5 "cc (GCC) 4.8.5 20150623 (Red Hat 4.8.5-39)") Build machine cpu family: x86_64 Build machine cpu: x86_64 Program build-aux/dist.sh found: YES (/bin/sh <https://ci.centos.org/job/gtk-vnc-build/systems=libvirt-centos-7/ws/build-a…)> Program <https://ci.centos.org/job/gtk-vnc-build/systems=libvirt-centos-7/ws/build-a…> found: YES (/bin/sh <https://ci.centos.org/job/gtk-vnc-build/systems=libvirt-centos-7/ws/build-a…)> Program pod2man found: YES (/usr/bin/pod2man) Found pkg-config: /usr/bin/pkg-config (0.27.1) Dependency gobject-2.0 found: YES 2.56.1 Dependency gio-2.0 found: YES 2.56.1 Dependency gio-unix-2.0 found: YES 2.56.1 Dependency gdk-pixbuf-2.0 found: YES 2.36.12 Dependency gtk+-3.0 found: YES 3.22.30 Found libgcrypt-config: /usr/bin/libgcrypt-config (1.5.3) Dependency libgcrypt found: YES 1.5.3 Dependency gnutls found: YES 3.3.29 Dependency cairo found: YES 1.15.12 Dependency x11 found: YES 1.6.7 Dependency libpulse-simple found: YES 10.0 Dependency zlib found: YES 1.2.7 Dependency libsasl2 found: YES 2.1.26 meson.build:106:0: ERROR: Failed to initialize 'subprojects/keycodemapdb': Subproject exists but has no meson.build file A full log can be found at <https://ci.centos.org/job/gtk-vnc-build/systems=libvirt-centos-7/ws/build/m…> Build step 'Execute shell' marked build as failure
1 3
0 0
[Libvirt-ci] Build failed in Jenkins: gtk-vnc+mingw64-build » libvirt-fedora-30 #1
by ci@centos.org 08 Jan '20

08 Jan '20
See <https://ci.centos.org/job/gtk-vnc+mingw64-build/systems=libvirt-fedora-30/1…> ------------------------------------------ [...truncated 1.23 KB...] Fetching upstream changes from https://gitlab.gnome.org/GNOME/gtk-vnc.git > git --version # timeout=10 > git fetch --tags --force --progress https://gitlab.gnome.org/GNOME/gtk-vnc.git +refs/heads/*:refs/remotes/origin/* > git config remote.origin.url https://gitlab.gnome.org/GNOME/gtk-vnc.git # timeout=10 > git config --add remote.origin.fetch +refs/heads/*:refs/remotes/origin/* # timeout=10 > git config remote.origin.url https://gitlab.gnome.org/GNOME/gtk-vnc.git # timeout=10 Fetching upstream changes from https://gitlab.gnome.org/GNOME/gtk-vnc.git > git fetch --tags --force --progress https://gitlab.gnome.org/GNOME/gtk-vnc.git +refs/heads/*:refs/remotes/origin/* Checking out Revision 423405a724645f1b205ca86d39397cfcb6fb1461 (refs/remotes/origin/master) > git config core.sparsecheckout # timeout=10 > git checkout -f 423405a724645f1b205ca86d39397cfcb6fb1461 Commit message: "Relax min x11 dep for Debian 9 portability" First time build. Skipping changelog. Cleaning workspace > git rev-parse --verify HEAD # timeout=10 Resetting working tree > git reset --hard # timeout=10 > git clean -fdx # timeout=10 [gtk-vnc+mingw64] $ /bin/sh -xe /tmp/jenkins14326955072698477373.sh + export VIRT_PREFIX=/home/jenkins/build/libvirt/x86_64-w64-mingw32/sys-root/mingw + VIRT_PREFIX=/home/jenkins/build/libvirt/x86_64-w64-mingw32/sys-root/mingw + export PKG_CONFIG_PATH=/home/jenkins/build/libvirt/x86_64-w64-mingw32/sys-root/mingw/lib/pkgconfig + PKG_CONFIG_PATH=/home/jenkins/build/libvirt/x86_64-w64-mingw32/sys-root/mingw/lib/pkgconfig + export PKG_CONFIG_LIBDIR=/usr/x86_64-w64-mingw32/sys-root/mingw/lib/pkgconfig:/usr/x86_64-w64-mingw32/sys-root/mingw/share/pkgconfig + PKG_CONFIG_LIBDIR=/usr/x86_64-w64-mingw32/sys-root/mingw/lib/pkgconfig:/usr/x86_64-w64-mingw32/sys-root/mingw/share/pkgconfig + rm -rf build + mkdir build + cd build + meson .. . --prefix=/home/jenkins/build/libvirt/x86_64-w64-mingw32/sys-root/mingw --cross-file=/usr/share/mingw/toolchain-mingw64.meson Submodule 'src/keycodemapdb' (https://gitlab.com/keycodemap/keycodemapdb.git) registered for path 'keycodemapdb' Cloning into '<https://ci.centos.org/job/gtk-vnc+mingw64-build/systems=libvirt-fedora-30/w…'...> Submodule path 'keycodemapdb': checked out '6280c94f306df6a20bbc100ba15a5a81af0366e6' The Meson build system Version: 0.52.0 Source dir: <https://ci.centos.org/job/gtk-vnc+mingw64-build/systems=libvirt-fedora-30/w…> Build dir: <https://ci.centos.org/job/gtk-vnc+mingw64-build/systems=libvirt-fedora-30/w…> Build type: cross build Project name: gtk-vnc Project version: 1.0.0 C compiler for the build machine: ccache cc (gcc 9.2.1 "cc (GCC) 9.2.1 20190827 (Red Hat 9.2.1-1)") C linker for the build machine: GNU ld.bfd 2.31.1-36 C compiler for the host machine: /usr/bin/x86_64-w64-mingw32-gcc (gcc 8.3.0 "x86_64-w64-mingw32-gcc (GCC) 8.3.0 20190222 (Fedora MinGW 8.3.0-2.fc30)") C linker for the host machine: GNU ld.bfd 2.30 Build machine cpu family: x86_64 Build machine cpu: x86_64 Host machine cpu family: x86_64 Host machine cpu: x86_64 Target machine cpu family: x86_64 Target machine cpu: x86_64 Program build-aux/dist.sh found: YES (/bin/sh <https://ci.centos.org/job/gtk-vnc+mingw64-build/systems=libvirt-fedora-30/w…)> Program <https://ci.centos.org/job/gtk-vnc+mingw64-build/systems=libvirt-fedora-30/w…> found: YES (/bin/sh <https://ci.centos.org/job/gtk-vnc+mingw64-build/systems=libvirt-fedora-30/w…)> Program pod2man found: YES (/usr/bin/pod2man) Found pkg-config: /usr/bin/x86_64-w64-mingw32-pkg-config (0.28) Run-time dependency gobject-2.0 found: YES 2.58.3 Run-time dependency gio-2.0 found: YES 2.58.3 Found CMake: NO Run-time dependency gio-unix-2.0 found: NO (tried pkgconfig and cmake) Run-time dependency gthread-2.0 found: YES 2.58.3 Run-time dependency gdk-pixbuf-2.0 found: YES 2.36.11 Run-time dependency gtk+-3.0 found: YES 3.22.30 DEPRECATION: No entry for libgcrypt-config specified in your cross file. Falling back to searching PATH. This may find a native version of libgcrypt-config! This will become a hard error in a future version of meson libgcrypt-config found: YES (/usr/bin/libgcrypt-config) 1.8.5 Run-time dependency libgcrypt found: YES 1.8.5 Run-time dependency gnutls found: YES 3.6.3 Run-time dependency cairo found: YES 1.14.10 Run-time dependency x11 found: NO (tried pkgconfig and cmake) Run-time dependency libpulse-simple found: NO (tried pkgconfig and cmake) Run-time dependency zlib found: YES 1.2.5 Run-time dependency libsasl2 found: NO (tried pkgconfig and cmake) |Executing subproject keycodemapdb method meson | |Project name: keycodemapdb |Project version: undefined |Build targets in project: 0 |Subproject keycodemapdb finished. Compiler for C supports arguments -W: YES Compiler for C supports arguments -Waddress: YES Compiler for C supports arguments -Waggressive-loop-optimizations: YES Compiler for C supports arguments -Wall: YES Compiler for C supports arguments -Warray-bounds: YES Compiler for C supports arguments -Wattributes: YES Compiler for C supports arguments -Wbuiltin-macro-redefined: YES Compiler for C supports arguments -Wchar-subscripts: YES Compiler for C supports arguments -Wclobbered: YES Compiler for C supports arguments -Wcomment: YES Compiler for C supports arguments -Wcomments: YES Compiler for C supports arguments -Wcoverage-mismatch: YES Compiler for C supports arguments -Wcpp: YES Compiler for C supports arguments -Wdate-time: YES Compiler for C supports arguments -Wno-deprecated-declarations -Wdeprecated-declarations: YES Compiler for C supports arguments -Wdisabled-optimization: YES Compiler for C supports arguments -Wdiv-by-zero: YES Compiler for C supports arguments -Wdouble-promotion: YES Compiler for C supports arguments -Wempty-body: YES Compiler for C supports arguments -Wendif-labels: YES Compiler for C supports arguments -Wenum-compare: YES Compiler for C supports arguments -Wextra: YES Compiler for C supports arguments -Wformat-contains-nul: YES Compiler for C supports arguments -Wformat-extra-args: YES Compiler for C supports arguments -Wformat-security: YES Compiler for C supports arguments -Wformat-y2k: YES Compiler for C supports arguments -Wformat-zero-length: YES Compiler for C supports arguments -Wfree-nonheap-object: YES Compiler for C supports arguments -Wignored-qualifiers: YES Compiler for C supports arguments -Wimplicit: YES Compiler for C supports arguments -Wimplicit-function-declaration: YES Compiler for C supports arguments -Wimplicit-int: YES Compiler for C supports arguments -Winit-self: YES Compiler for C supports arguments -Winline: YES Compiler for C supports arguments -Wint-to-pointer-cast: YES Compiler for C supports arguments -Winvalid-memory-model: YES Compiler for C supports arguments -Winvalid-pch: YES Compiler for C supports arguments -Wjump-misses-init: YES Compiler for C supports arguments -Wlogical-op: YES Compiler for C supports arguments -Wmain: YES Compiler for C supports arguments -Wmaybe-uninitialized: YES Compiler for C supports arguments -Wmissing-braces: YES Compiler for C supports arguments -Wmissing-declarations: YES Compiler for C supports arguments -Wmissing-field-initializers: YES Compiler for C supports arguments -Wmissing-parameter-type: YES Compiler for C supports arguments -Wmissing-prototypes: YES Compiler for C supports arguments -Wmultichar: YES Compiler for C supports arguments -Wnarrowing: YES Compiler for C supports arguments -Wnested-externs: YES Compiler for C supports arguments -Wnonnull: YES Compiler for C supports arguments -Wold-style-declaration: YES Compiler for C supports arguments -Wold-style-definition: YES Compiler for C supports arguments -Wopenmp-simd: YES Compiler for C supports arguments -Woverflow: YES Compiler for C supports arguments -Woverride-init: YES Compiler for C supports arguments -Wpacked: YES Compiler for C supports arguments -Wpacked-bitfield-compat: YES Compiler for C supports arguments -Wparentheses: YES Compiler for C supports arguments -Wpointer-arith: YES Compiler for C supports arguments -Wpointer-sign: YES Compiler for C supports arguments -Wpointer-to-int-cast: YES Compiler for C supports arguments -Wpragmas: YES Compiler for C supports arguments -Wreturn-local-addr: YES Compiler for C supports arguments -Wreturn-type: YES Compiler for C supports arguments -Wsequence-point: YES Compiler for C supports arguments -Wshadow: YES Compiler for C supports arguments -Wsizeof-pointer-memaccess: YES Compiler for C supports arguments -Wstack-protector: YES Compiler for C supports arguments -Wstrict-aliasing: YES Compiler for C supports arguments -Wstrict-overflow: YES Compiler for C supports arguments -Wstrict-prototypes: YES Compiler for C supports arguments -Wsuggest-attribute=const: YES Compiler for C supports arguments -Wsuggest-attribute=format: YES Compiler for C supports arguments -Wsuggest-attribute=noreturn: YES Compiler for C supports arguments -Wsuggest-attribute=pure: YES Compiler for C supports arguments -Wswitch: YES Compiler for C supports arguments -Wswitch-default: YES Compiler for C supports arguments -Wsync-nand: YES Compiler for C supports arguments -Wtrampolines: YES Compiler for C supports arguments -Wtrigraphs: YES Compiler for C supports arguments -Wtype-limits: YES Compiler for C supports arguments -Wuninitialized: YES Compiler for C supports arguments -Wunknown-pragmas: YES Compiler for C supports arguments -Wunsafe-loop-optimizations: YES Compiler for C supports arguments -Wunused: YES Compiler for C supports arguments -Wunused-but-set-parameter: YES Compiler for C supports arguments -Wunused-but-set-variable: YES Compiler for C supports arguments -Wunused-function: YES Compiler for C supports arguments -Wunused-label: YES Compiler for C supports arguments -Wunused-local-typedefs: YES Compiler for C supports arguments -Wunused-parameter: YES Compiler for C supports arguments -Wunused-result: YES Compiler for C supports arguments -Wunused-value: YES Compiler for C supports arguments -Wunused-variable: YES Compiler for C supports arguments -Wvarargs: YES Compiler for C supports arguments -Wvariadic-macros: YES Compiler for C supports arguments -Wvector-operation-performance: YES Compiler for C supports arguments -Wvla: YES Compiler for C supports arguments -Wvolatile-register-var: YES Compiler for C supports arguments -Wwrite-strings: YES Compiler for C supports arguments -Wnormalized=nfc: YES Compiler for C supports arguments -Wno-sign-compare -Wsign-compare: YES Compiler for C supports arguments -Wno-sign-conversion -Wsign-conversion: YES Compiler for C supports arguments -Wno-conversion -Wconversion: YES Compiler for C supports arguments -Wno-unsafe-loop-optimizations -Wunsafe-loop-optimizations: YES Compiler for C supports arguments -Wno-cast-function-type -Wcast-function-type: YES Compiler for C supports arguments -Wjump-misses-init: YES (cached) Compiler for C supports arguments -Wframe-larger-than=40096: YES Compiler for C supports arguments -O2: YES Compiler for C supports arguments -Wp,-D_FORTIFY_SOURCE=2: YES Compiler for C supports arguments -fexceptions: YES Compiler for C supports arguments -fasynchronous-unwind-tables: YES Compiler for C supports arguments -fdiagnostics-show-option: YES Compiler for C supports arguments -funit-at-a-time: YES Compiler for C supports arguments -fipa-pure-const: YES Compiler for C supports arguments -Wno-suggest-attribute=pure -Wsuggest-attribute=pure: YES Compiler for C supports arguments -Wno-suggest-attribute=const -Wsuggest-attribute=const: YES WARNING: Consider using the builtin warning_level option instead of adding warning flags by hand. WARNING: Consider using the builtin warning_level option instead of adding warning flags by hand. WARNING: Consider using the builtin optimization level rather than adding flags by hand. Configuring config.h using configuration Found pkg-config: /usr/bin/pkg-config (1.6.1) Compiler for C supports link arguments -Wl,--no-undefined: YES Program python3 found: YES (/usr/bin/python3) Compiler for C supports link arguments -Wl,--no-undefined: YES (cached) Program pod2man found: YES (/usr/bin/pod2man) Configuring gvnc-1.0.pc using configuration Configuring gtk-vnc-2.0.pc using configuration Configuring gtk-vnc.spec using configuration Configuring mingw-gtk-vnc.spec using configuration Build targets in project: 22 Found ninja-1.9.0 at /usr/bin/ninja + /usr/bin/ninja [1/50] Generating vncmarshal_h with a custom command. INFO: Reading ../src/vncmarshal.txt... [2/50] Generating vncmarshal_c with a custom command. INFO: Reading ../src/vncmarshal.txt... [3/50] Generating vncconnectionenums.c with a meson_exe.py custom command. [4/50] Generating vncdisplayenums.h with a meson_exe.py custom command. [5/50] Generating vncconnectionenums.h with a meson_exe.py custom command. [6/50] Compiling C object 'src/25a6634@@gvnc-1.0@sha/meson-generated_.._vncconnectionenums.c.obj'. [7/50] Generating vncdisplaykeymap_xorgevdev2qnum.h with a meson_exe.py custom command. [8/50] Compiling C object 'src/25a6634@@gvnc-1.0@sha/vncutil.c.obj'. [9/50] Compiling C object 'src/25a6634@@gvnc-1.0@sha/vncaudioformat.c.obj'. [10/50] Compiling C object 'src/25a6634@@gvnc-1.0@sha/vncaudiosample.c.obj'. [11/50] Generating vncdisplayenums.c with a meson_exe.py custom command. [12/50] Compiling C object 'src/25a6634@@gvnc-1.0@sha/meson-generated_.._vncmarshal.c.obj'. [13/50] Compiling C object 'src/25a6634@@gvnc-1.0@sha/vncpixelformat.c.obj'. [14/50] Compiling C object 'src/25a6634@@gvnc-1.0@sha/vncaudio.c.obj'. [15/50] Compiling C object 'src/25a6634@@gvnc-1.0@sha/vncbaseaudio.c.obj'. [16/50] Compiling C object 'src/25a6634@@gvnc-1.0@sha/vncframebuffer.c.obj'. [17/50] Compiling C object 'src/25a6634@@gvnc-1.0@sha/vnccolormap.c.obj'. [18/50] Compiling C object 'src/25a6634@@gvnc-1.0@sha/vnccursor.c.obj'. [19/50] Compiling C object 'src/25a6634@@gvnc-1.0@sha/dh.c.obj'. FAILED: src/25a6634@@gvnc-1.0@sha/dh.c.obj /usr/bin/x86_64-w64-mingw32-gcc -Isrc/25a6634@@gvnc-1.0@sha -Isrc -I../src -I. -I../ -I/usr/x86_64-w64-mingw32/sys-root/mingw/include/glib-2.0 -I/usr/x86_64-w64-mingw32/sys-root/mingw/lib/glib-2.0/include -I/usr/x86_64-w64-mingw32/sys-root/mingw/include -I/usr/x86_64-w64-mingw32/sys-root/mingw/include/gdk-pixbuf-2.0 -I/usr/x86_64-w64-mingw32/sys-root/mingw/include/libpng16 -I/usr/x86_64-w64-mingw32/sys-root/mingw/include/p11-kit-1 -fdiagnostics-color=always -pipe -Wall -Winvalid-pch -std=gnu99 -O2 -g -W -Waddress -Waggressive-loop-optimizations -Wall -Warray-bounds -Wattributes -Wbuiltin-macro-redefined -Wchar-subscripts -Wclobbered -Wcomment -Wcomments -Wcoverage-mismatch -Wcpp -Wdate-time -Wno-deprecated-declarations -Wdisabled-optimization -Wdiv-by-zero -Wdouble-promotion -Wempty-body -Wendif-labels -Wenum-compare -Wextra -Wformat-contains-nul -Wformat-extra-args -Wformat-security -Wformat-y2k -Wformat-zero-length -Wfree-nonheap-object -Wignored-qualifiers -Wimplicit -Wimplicit-function-declaration -Wimplicit-int -Winit-self -Winline -Wint-to-pointer-cast -Winvalid-memory-model -Winvalid-pch -Wjump-misses-init -Wlogical-op -Wmain -Wmaybe-uninitialized -Wmissing-braces -Wmissing-declarations -Wmissing-field-initializers -Wmissing-parameter-type -Wmissing-prototypes -Wmultichar -Wnarrowing -Wnested-externs -Wnonnull -Wold-style-declaration -Wold-style-definition -Wopenmp-simd -Woverflow -Woverride-init -Wpacked -Wpacked-bitfield-compat -Wparentheses -Wpointer-arith -Wpointer-sign -Wpointer-to-int-cast -Wpragmas -Wreturn-local-addr -Wreturn-type -Wsequence-point -Wshadow -Wsizeof-pointer-memaccess -Wstack-protector -Wstrict-aliasing -Wstrict-overflow -Wstrict-prototypes -Wsuggest-attribute=const -Wsuggest-attribute=format -Wsuggest-attribute=noreturn -Wsuggest-attribute=pure -Wswitch -Wswitch-default -Wsync-nand -Wtrampolines -Wtrigraphs -Wtype-limits -Wuninitialized -Wunknown-pragmas -Wunsafe-loop-optimizations -Wunused -Wunused-but-set-parameter -Wunused-but-set-variable -Wunused-function -Wunused-label -Wunused-local-typedefs -Wunused-parameter -Wunused-result -Wunused-value -Wunused-variable -Wvarargs -Wvariadic-macros -Wvector-operation-performance -Wvla -Wvolatile-register-var -Wwrite-strings -Wnormalized=nfc -Wno-sign-compare -Wno-sign-conversion -Wno-conversion -Wno-unsafe-loop-optimizations -Wno-cast-function-type -Wjump-misses-init -Wframe-larger-than=40096 -O2 -Wp,-D_FORTIFY_SOURCE=2 -fexceptions -fasynchronous-unwind-tables -fdiagnostics-show-option -funit-at-a-time -fipa-pure-const -Wno-suggest-attribute=pure -Wno-suggest-attribute=const -mms-bitfields -mms-bitfields -mms-bitfields -MD -MQ 'src/25a6634@@gvnc-1.0@sha/dh.c.obj' -MF 'src/25a6634@@gvnc-1.0@sha/dh.c.obj.d' -o 'src/25a6634@@gvnc-1.0@sha/dh.c.obj' -c ../src/dh.c In file included from ../src/dh.c:25: ../src/dh.h:25:10: fatal error: gcrypt.h: No such file or directory #include <gcrypt.h> ^~~~~~~~~~ compilation terminated. [20/50] Compiling C object 'src/25a6634@@gvnc-1.0@sha/vncconnection.c.obj'. FAILED: src/25a6634@@gvnc-1.0@sha/vncconnection.c.obj /usr/bin/x86_64-w64-mingw32-gcc -Isrc/25a6634@@gvnc-1.0@sha -Isrc -I../src -I. -I../ -I/usr/x86_64-w64-mingw32/sys-root/mingw/include/glib-2.0 -I/usr/x86_64-w64-mingw32/sys-root/mingw/lib/glib-2.0/include -I/usr/x86_64-w64-mingw32/sys-root/mingw/include -I/usr/x86_64-w64-mingw32/sys-root/mingw/include/gdk-pixbuf-2.0 -I/usr/x86_64-w64-mingw32/sys-root/mingw/include/libpng16 -I/usr/x86_64-w64-mingw32/sys-root/mingw/include/p11-kit-1 -fdiagnostics-color=always -pipe -Wall -Winvalid-pch -std=gnu99 -O2 -g -W -Waddress -Waggressive-loop-optimizations -Wall -Warray-bounds -Wattributes -Wbuiltin-macro-redefined -Wchar-subscripts -Wclobbered -Wcomment -Wcomments -Wcoverage-mismatch -Wcpp -Wdate-time -Wno-deprecated-declarations -Wdisabled-optimization -Wdiv-by-zero -Wdouble-promotion -Wempty-body -Wendif-labels -Wenum-compare -Wextra -Wformat-contains-nul -Wformat-extra-args -Wformat-security -Wformat-y2k -Wformat-zero-length -Wfree-nonheap-object -Wignored-qualifiers -Wimplicit -Wimplicit-function-declaration -Wimplicit-int -Winit-self -Winline -Wint-to-pointer-cast -Winvalid-memory-model -Winvalid-pch -Wjump-misses-init -Wlogical-op -Wmain -Wmaybe-uninitialized -Wmissing-braces -Wmissing-declarations -Wmissing-field-initializers -Wmissing-parameter-type -Wmissing-prototypes -Wmultichar -Wnarrowing -Wnested-externs -Wnonnull -Wold-style-declaration -Wold-style-definition -Wopenmp-simd -Woverflow -Woverride-init -Wpacked -Wpacked-bitfield-compat -Wparentheses -Wpointer-arith -Wpointer-sign -Wpointer-to-int-cast -Wpragmas -Wreturn-local-addr -Wreturn-type -Wsequence-point -Wshadow -Wsizeof-pointer-memaccess -Wstack-protector -Wstrict-aliasing -Wstrict-overflow -Wstrict-prototypes -Wsuggest-attribute=const -Wsuggest-attribute=format -Wsuggest-attribute=noreturn -Wsuggest-attribute=pure -Wswitch -Wswitch-default -Wsync-nand -Wtrampolines -Wtrigraphs -Wtype-limits -Wuninitialized -Wunknown-pragmas -Wunsafe-loop-optimizations -Wunused -Wunused-but-set-parameter -Wunused-but-set-variable -Wunused-function -Wunused-label -Wunused-local-typedefs -Wunused-parameter -Wunused-result -Wunused-value -Wunused-variable -Wvarargs -Wvariadic-macros -Wvector-operation-performance -Wvla -Wvolatile-register-var -Wwrite-strings -Wnormalized=nfc -Wno-sign-compare -Wno-sign-conversion -Wno-conversion -Wno-unsafe-loop-optimizations -Wno-cast-function-type -Wjump-misses-init -Wframe-larger-than=40096 -O2 -Wp,-D_FORTIFY_SOURCE=2 -fexceptions -fasynchronous-unwind-tables -fdiagnostics-show-option -funit-at-a-time -fipa-pure-const -Wno-suggest-attribute=pure -Wno-suggest-attribute=const -mms-bitfields -mms-bitfields -mms-bitfields -MD -MQ 'src/25a6634@@gvnc-1.0@sha/vncconnection.c.obj' -MF 'src/25a6634@@gvnc-1.0@sha/vncconnection.c.obj.d' -o 'src/25a6634@@gvnc-1.0@sha/vncconnection.c.obj' -c ../src/vncconnection.c In file included from ../src/vncconnection.c:57: ../src/dh.h:25:10: fatal error: gcrypt.h: No such file or directory #include <gcrypt.h> ^~~~~~~~~~ compilation terminated. [21/50] Compiling C object 'src/25a6634@@gvnc-1.0@sha/vncbaseframebuffer.c.obj'. ninja: build stopped: subcommand failed. Build step 'Execute shell' marked build as failure
1 3
0 0
[Libvirt-ci] Build failed in Jenkins: gtk-vnc+mingw32-build » libvirt-fedora-30 #1
by ci@centos.org 08 Jan '20

08 Jan '20
See <https://ci.centos.org/job/gtk-vnc+mingw32-build/systems=libvirt-fedora-30/1…> ------------------------------------------ [...truncated 1.40 KB...] Cloning repository https://gitlab.gnome.org/GNOME/gtk-vnc.git > git init <https://ci.centos.org/job/gtk-vnc+mingw32-build/systems=libvirt-fedora-30/w…> # timeout=10 Fetching upstream changes from https://gitlab.gnome.org/GNOME/gtk-vnc.git > git --version # timeout=10 > git fetch --tags --force --progress https://gitlab.gnome.org/GNOME/gtk-vnc.git +refs/heads/*:refs/remotes/origin/* > git config remote.origin.url https://gitlab.gnome.org/GNOME/gtk-vnc.git # timeout=10 > git config --add remote.origin.fetch +refs/heads/*:refs/remotes/origin/* # timeout=10 > git config remote.origin.url https://gitlab.gnome.org/GNOME/gtk-vnc.git # timeout=10 Fetching upstream changes from https://gitlab.gnome.org/GNOME/gtk-vnc.git > git fetch --tags --force --progress https://gitlab.gnome.org/GNOME/gtk-vnc.git +refs/heads/*:refs/remotes/origin/* Checking out Revision 423405a724645f1b205ca86d39397cfcb6fb1461 (refs/remotes/origin/master) > git config core.sparsecheckout # timeout=10 > git checkout -f 423405a724645f1b205ca86d39397cfcb6fb1461 Commit message: "Relax min x11 dep for Debian 9 portability" First time build. Skipping changelog. Cleaning workspace > git rev-parse --verify HEAD # timeout=10 Resetting working tree > git reset --hard # timeout=10 > git clean -fdx # timeout=10 [gtk-vnc+mingw32] $ /bin/sh -xe /tmp/jenkins1569761188177124010.sh + export VIRT_PREFIX=/home/jenkins/build/libvirt/i686-w64-mingw32/sys-root/mingw + VIRT_PREFIX=/home/jenkins/build/libvirt/i686-w64-mingw32/sys-root/mingw + export PKG_CONFIG_PATH=/home/jenkins/build/libvirt/i686-w64-mingw32/sys-root/mingw/lib/pkgconfig + PKG_CONFIG_PATH=/home/jenkins/build/libvirt/i686-w64-mingw32/sys-root/mingw/lib/pkgconfig + export PKG_CONFIG_LIBDIR=/usr/i686-w64-mingw32/sys-root/mingw/lib/pkgconfig:/usr/i686-w64-mingw32/sys-root/mingw/share/pkgconfig + PKG_CONFIG_LIBDIR=/usr/i686-w64-mingw32/sys-root/mingw/lib/pkgconfig:/usr/i686-w64-mingw32/sys-root/mingw/share/pkgconfig + rm -rf build + mkdir build + cd build + meson .. . --prefix=/home/jenkins/build/libvirt/i686-w64-mingw32/sys-root/mingw --cross-file=/usr/share/mingw/toolchain-mingw32.meson Submodule 'src/keycodemapdb' (https://gitlab.com/keycodemap/keycodemapdb.git) registered for path 'keycodemapdb' Cloning into '<https://ci.centos.org/job/gtk-vnc+mingw32-build/systems=libvirt-fedora-30/w…'...> Submodule path 'keycodemapdb': checked out '6280c94f306df6a20bbc100ba15a5a81af0366e6' The Meson build system Version: 0.52.0 Source dir: <https://ci.centos.org/job/gtk-vnc+mingw32-build/systems=libvirt-fedora-30/w…> Build dir: <https://ci.centos.org/job/gtk-vnc+mingw32-build/systems=libvirt-fedora-30/w…> Build type: cross build Project name: gtk-vnc Project version: 1.0.0 C compiler for the build machine: ccache cc (gcc 9.2.1 "cc (GCC) 9.2.1 20190827 (Red Hat 9.2.1-1)") C linker for the build machine: GNU ld.bfd 2.31.1-36 C compiler for the host machine: /usr/bin/i686-w64-mingw32-gcc (gcc 8.3.0 "i686-w64-mingw32-gcc (GCC) 8.3.0 20190222 (Fedora MinGW 8.3.0-2.fc30)") C linker for the host machine: GNU ld.bfd 2.30 Build machine cpu family: x86_64 Build machine cpu: x86_64 Host machine cpu family: x86 Host machine cpu: i686 Target machine cpu family: x86 Target machine cpu: i686 Program build-aux/dist.sh found: YES (/bin/sh <https://ci.centos.org/job/gtk-vnc+mingw32-build/systems=libvirt-fedora-30/w…)> Program <https://ci.centos.org/job/gtk-vnc+mingw32-build/systems=libvirt-fedora-30/w…> found: YES (/bin/sh <https://ci.centos.org/job/gtk-vnc+mingw32-build/systems=libvirt-fedora-30/w…)> Program pod2man found: YES (/usr/bin/pod2man) Found pkg-config: /usr/bin/i686-w64-mingw32-pkg-config (0.28) Run-time dependency gobject-2.0 found: YES 2.58.3 Run-time dependency gio-2.0 found: YES 2.58.3 Found CMake: NO Run-time dependency gio-unix-2.0 found: NO (tried pkgconfig and cmake) Run-time dependency gthread-2.0 found: YES 2.58.3 Run-time dependency gdk-pixbuf-2.0 found: YES 2.36.11 Run-time dependency gtk+-3.0 found: YES 3.22.30 DEPRECATION: No entry for libgcrypt-config specified in your cross file. Falling back to searching PATH. This may find a native version of libgcrypt-config! This will become a hard error in a future version of meson libgcrypt-config found: YES (/usr/bin/libgcrypt-config) 1.8.5 Run-time dependency libgcrypt found: YES 1.8.5 Run-time dependency gnutls found: YES 3.6.3 Run-time dependency cairo found: YES 1.14.10 Run-time dependency x11 found: NO (tried pkgconfig and cmake) Run-time dependency libpulse-simple found: NO (tried pkgconfig and cmake) Run-time dependency zlib found: YES 1.2.5 Run-time dependency libsasl2 found: NO (tried pkgconfig and cmake) |Executing subproject keycodemapdb method meson | |Project name: keycodemapdb |Project version: undefined |Build targets in project: 0 |Subproject keycodemapdb finished. Compiler for C supports arguments -W: YES Compiler for C supports arguments -Waddress: YES Compiler for C supports arguments -Waggressive-loop-optimizations: YES Compiler for C supports arguments -Wall: YES Compiler for C supports arguments -Warray-bounds: YES Compiler for C supports arguments -Wattributes: YES Compiler for C supports arguments -Wbuiltin-macro-redefined: YES Compiler for C supports arguments -Wchar-subscripts: YES Compiler for C supports arguments -Wclobbered: YES Compiler for C supports arguments -Wcomment: YES Compiler for C supports arguments -Wcomments: YES Compiler for C supports arguments -Wcoverage-mismatch: YES Compiler for C supports arguments -Wcpp: YES Compiler for C supports arguments -Wdate-time: YES Compiler for C supports arguments -Wno-deprecated-declarations -Wdeprecated-declarations: YES Compiler for C supports arguments -Wdisabled-optimization: YES Compiler for C supports arguments -Wdiv-by-zero: YES Compiler for C supports arguments -Wdouble-promotion: YES Compiler for C supports arguments -Wempty-body: YES Compiler for C supports arguments -Wendif-labels: YES Compiler for C supports arguments -Wenum-compare: YES Compiler for C supports arguments -Wextra: YES Compiler for C supports arguments -Wformat-contains-nul: YES Compiler for C supports arguments -Wformat-extra-args: YES Compiler for C supports arguments -Wformat-security: YES Compiler for C supports arguments -Wformat-y2k: YES Compiler for C supports arguments -Wformat-zero-length: YES Compiler for C supports arguments -Wfree-nonheap-object: YES Compiler for C supports arguments -Wignored-qualifiers: YES Compiler for C supports arguments -Wimplicit: YES Compiler for C supports arguments -Wimplicit-function-declaration: YES Compiler for C supports arguments -Wimplicit-int: YES Compiler for C supports arguments -Winit-self: YES Compiler for C supports arguments -Winline: YES Compiler for C supports arguments -Wint-to-pointer-cast: YES Compiler for C supports arguments -Winvalid-memory-model: YES Compiler for C supports arguments -Winvalid-pch: YES Compiler for C supports arguments -Wjump-misses-init: YES Compiler for C supports arguments -Wlogical-op: YES Compiler for C supports arguments -Wmain: YES Compiler for C supports arguments -Wmaybe-uninitialized: YES Compiler for C supports arguments -Wmissing-braces: YES Compiler for C supports arguments -Wmissing-declarations: YES Compiler for C supports arguments -Wmissing-field-initializers: YES Compiler for C supports arguments -Wmissing-parameter-type: YES Compiler for C supports arguments -Wmissing-prototypes: YES Compiler for C supports arguments -Wmultichar: YES Compiler for C supports arguments -Wnarrowing: YES Compiler for C supports arguments -Wnested-externs: YES Compiler for C supports arguments -Wnonnull: YES Compiler for C supports arguments -Wold-style-declaration: YES Compiler for C supports arguments -Wold-style-definition: YES Compiler for C supports arguments -Wopenmp-simd: YES Compiler for C supports arguments -Woverflow: YES Compiler for C supports arguments -Woverride-init: YES Compiler for C supports arguments -Wpacked: YES Compiler for C supports arguments -Wpacked-bitfield-compat: YES Compiler for C supports arguments -Wparentheses: YES Compiler for C supports arguments -Wpointer-arith: YES Compiler for C supports arguments -Wpointer-sign: YES Compiler for C supports arguments -Wpointer-to-int-cast: YES Compiler for C supports arguments -Wpragmas: YES Compiler for C supports arguments -Wreturn-local-addr: YES Compiler for C supports arguments -Wreturn-type: YES Compiler for C supports arguments -Wsequence-point: YES Compiler for C supports arguments -Wshadow: YES Compiler for C supports arguments -Wsizeof-pointer-memaccess: YES Compiler for C supports arguments -Wstack-protector: YES Compiler for C supports arguments -Wstrict-aliasing: YES Compiler for C supports arguments -Wstrict-overflow: YES Compiler for C supports arguments -Wstrict-prototypes: YES Compiler for C supports arguments -Wsuggest-attribute=const: YES Compiler for C supports arguments -Wsuggest-attribute=format: YES Compiler for C supports arguments -Wsuggest-attribute=noreturn: YES Compiler for C supports arguments -Wsuggest-attribute=pure: YES Compiler for C supports arguments -Wswitch: YES Compiler for C supports arguments -Wswitch-default: YES Compiler for C supports arguments -Wsync-nand: YES Compiler for C supports arguments -Wtrampolines: YES Compiler for C supports arguments -Wtrigraphs: YES Compiler for C supports arguments -Wtype-limits: YES Compiler for C supports arguments -Wuninitialized: YES Compiler for C supports arguments -Wunknown-pragmas: YES Compiler for C supports arguments -Wunsafe-loop-optimizations: YES Compiler for C supports arguments -Wunused: YES Compiler for C supports arguments -Wunused-but-set-parameter: YES Compiler for C supports arguments -Wunused-but-set-variable: YES Compiler for C supports arguments -Wunused-function: YES Compiler for C supports arguments -Wunused-label: YES Compiler for C supports arguments -Wunused-local-typedefs: YES Compiler for C supports arguments -Wunused-parameter: YES Compiler for C supports arguments -Wunused-result: YES Compiler for C supports arguments -Wunused-value: YES Compiler for C supports arguments -Wunused-variable: YES Compiler for C supports arguments -Wvarargs: YES Compiler for C supports arguments -Wvariadic-macros: YES Compiler for C supports arguments -Wvector-operation-performance: YES Compiler for C supports arguments -Wvla: YES Compiler for C supports arguments -Wvolatile-register-var: YES Compiler for C supports arguments -Wwrite-strings: YES Compiler for C supports arguments -Wnormalized=nfc: YES Compiler for C supports arguments -Wno-sign-compare -Wsign-compare: YES Compiler for C supports arguments -Wno-sign-conversion -Wsign-conversion: YES Compiler for C supports arguments -Wno-conversion -Wconversion: YES Compiler for C supports arguments -Wno-unsafe-loop-optimizations -Wunsafe-loop-optimizations: YES Compiler for C supports arguments -Wno-cast-function-type -Wcast-function-type: YES Compiler for C supports arguments -Wjump-misses-init: YES (cached) Compiler for C supports arguments -Wframe-larger-than=40096: YES Compiler for C supports arguments -O2: YES Compiler for C supports arguments -Wp,-D_FORTIFY_SOURCE=2: YES Compiler for C supports arguments -fexceptions: YES Compiler for C supports arguments -fasynchronous-unwind-tables: YES Compiler for C supports arguments -fdiagnostics-show-option: YES Compiler for C supports arguments -funit-at-a-time: YES Compiler for C supports arguments -fipa-pure-const: YES Compiler for C supports arguments -Wno-suggest-attribute=pure -Wsuggest-attribute=pure: YES Compiler for C supports arguments -Wno-suggest-attribute=const -Wsuggest-attribute=const: YES WARNING: Consider using the builtin warning_level option instead of adding warning flags by hand. WARNING: Consider using the builtin warning_level option instead of adding warning flags by hand. WARNING: Consider using the builtin optimization level rather than adding flags by hand. Configuring config.h using configuration Found pkg-config: /usr/bin/pkg-config (1.6.1) Compiler for C supports link arguments -Wl,--no-undefined: YES Program python3 found: YES (/usr/bin/python3) Compiler for C supports link arguments -Wl,--no-undefined: YES (cached) Program pod2man found: YES (/usr/bin/pod2man) Configuring gvnc-1.0.pc using configuration Configuring gtk-vnc-2.0.pc using configuration Configuring gtk-vnc.spec using configuration Configuring mingw-gtk-vnc.spec using configuration Build targets in project: 22 Found ninja-1.9.0 at /usr/bin/ninja + /usr/bin/ninja [1/50] Generating vncmarshal_c with a custom command. INFO: Reading ../src/vncmarshal.txt... [2/50] Generating vncmarshal_h with a custom command. INFO: Reading ../src/vncmarshal.txt... [3/50] Generating vncconnectionenums.h with a meson_exe.py custom command. [4/50] Generating vncconnectionenums.c with a meson_exe.py custom command. [5/50] Generating vncdisplayenums.h with a meson_exe.py custom command. [6/50] Compiling C object 'src/25a6634@@gvnc-1.0@sha/vncutil.c.obj'. [7/50] Compiling C object 'src/25a6634@@gvnc-1.0@sha/vncaudioformat.c.obj'. [8/50] Compiling C object 'src/25a6634@@gvnc-1.0@sha/vncaudiosample.c.obj'. [9/50] Compiling C object 'src/25a6634@@gvnc-1.0@sha/meson-generated_.._vncconnectionenums.c.obj'. [10/50] Compiling C object 'src/25a6634@@gvnc-1.0@sha/meson-generated_.._vncmarshal.c.obj'. [11/50] Compiling C object 'src/25a6634@@gvnc-1.0@sha/vncpixelformat.c.obj'. [12/50] Compiling C object 'src/25a6634@@gvnc-1.0@sha/vncaudio.c.obj'. [13/50] Compiling C object 'src/25a6634@@gvnc-1.0@sha/vncbaseaudio.c.obj'. [14/50] Compiling C object 'src/25a6634@@gvnc-1.0@sha/vncframebuffer.c.obj'. [15/50] Compiling C object 'src/25a6634@@gvnc-1.0@sha/vnccursor.c.obj'. [16/50] Compiling C object 'src/25a6634@@gvnc-1.0@sha/vnccolormap.c.obj'. [17/50] Compiling C object 'src/25a6634@@gvnc-1.0@sha/dh.c.obj'. FAILED: src/25a6634@@gvnc-1.0@sha/dh.c.obj /usr/bin/i686-w64-mingw32-gcc -Isrc/25a6634@@gvnc-1.0@sha -Isrc -I../src -I. -I../ -I/usr/i686-w64-mingw32/sys-root/mingw/include/glib-2.0 -I/usr/i686-w64-mingw32/sys-root/mingw/lib/glib-2.0/include -I/usr/i686-w64-mingw32/sys-root/mingw/include -I/usr/i686-w64-mingw32/sys-root/mingw/include/gdk-pixbuf-2.0 -I/usr/i686-w64-mingw32/sys-root/mingw/include/libpng16 -I/usr/i686-w64-mingw32/sys-root/mingw/include/p11-kit-1 -fdiagnostics-color=always -pipe -Wall -Winvalid-pch -std=gnu99 -O2 -g -W -Waddress -Waggressive-loop-optimizations -Wall -Warray-bounds -Wattributes -Wbuiltin-macro-redefined -Wchar-subscripts -Wclobbered -Wcomment -Wcomments -Wcoverage-mismatch -Wcpp -Wdate-time -Wno-deprecated-declarations -Wdisabled-optimization -Wdiv-by-zero -Wdouble-promotion -Wempty-body -Wendif-labels -Wenum-compare -Wextra -Wformat-contains-nul -Wformat-extra-args -Wformat-security -Wformat-y2k -Wformat-zero-length -Wfree-nonheap-object -Wignored-qualifiers -Wimplicit -Wimplicit-function-declaration -Wimplicit-int -Winit-self -Winline -Wint-to-pointer-cast -Winvalid-memory-model -Winvalid-pch -Wjump-misses-init -Wlogical-op -Wmain -Wmaybe-uninitialized -Wmissing-braces -Wmissing-declarations -Wmissing-field-initializers -Wmissing-parameter-type -Wmissing-prototypes -Wmultichar -Wnarrowing -Wnested-externs -Wnonnull -Wold-style-declaration -Wold-style-definition -Wopenmp-simd -Woverflow -Woverride-init -Wpacked -Wpacked-bitfield-compat -Wparentheses -Wpointer-arith -Wpointer-sign -Wpointer-to-int-cast -Wpragmas -Wreturn-local-addr -Wreturn-type -Wsequence-point -Wshadow -Wsizeof-pointer-memaccess -Wstack-protector -Wstrict-aliasing -Wstrict-overflow -Wstrict-prototypes -Wsuggest-attribute=const -Wsuggest-attribute=format -Wsuggest-attribute=noreturn -Wsuggest-attribute=pure -Wswitch -Wswitch-default -Wsync-nand -Wtrampolines -Wtrigraphs -Wtype-limits -Wuninitialized -Wunknown-pragmas -Wunsafe-loop-optimizations -Wunused -Wunused-but-set-parameter -Wunused-but-set-variable -Wunused-function -Wunused-label -Wunused-local-typedefs -Wunused-parameter -Wunused-result -Wunused-value -Wunused-variable -Wvarargs -Wvariadic-macros -Wvector-operation-performance -Wvla -Wvolatile-register-var -Wwrite-strings -Wnormalized=nfc -Wno-sign-compare -Wno-sign-conversion -Wno-conversion -Wno-unsafe-loop-optimizations -Wno-cast-function-type -Wjump-misses-init -Wframe-larger-than=40096 -O2 -Wp,-D_FORTIFY_SOURCE=2 -fexceptions -fasynchronous-unwind-tables -fdiagnostics-show-option -funit-at-a-time -fipa-pure-const -Wno-suggest-attribute=pure -Wno-suggest-attribute=const -mms-bitfields -mms-bitfields -mms-bitfields -MD -MQ 'src/25a6634@@gvnc-1.0@sha/dh.c.obj' -MF 'src/25a6634@@gvnc-1.0@sha/dh.c.obj.d' -o 'src/25a6634@@gvnc-1.0@sha/dh.c.obj' -c ../src/dh.c In file included from ../src/dh.c:25: ../src/dh.h:25:10: fatal error: gcrypt.h: No such file or directory #include <gcrypt.h> ^~~~~~~~~~ compilation terminated. [18/50] Compiling C object 'src/25a6634@@gvnc-1.0@sha/vncconnection.c.obj'. FAILED: src/25a6634@@gvnc-1.0@sha/vncconnection.c.obj /usr/bin/i686-w64-mingw32-gcc -Isrc/25a6634@@gvnc-1.0@sha -Isrc -I../src -I. -I../ -I/usr/i686-w64-mingw32/sys-root/mingw/include/glib-2.0 -I/usr/i686-w64-mingw32/sys-root/mingw/lib/glib-2.0/include -I/usr/i686-w64-mingw32/sys-root/mingw/include -I/usr/i686-w64-mingw32/sys-root/mingw/include/gdk-pixbuf-2.0 -I/usr/i686-w64-mingw32/sys-root/mingw/include/libpng16 -I/usr/i686-w64-mingw32/sys-root/mingw/include/p11-kit-1 -fdiagnostics-color=always -pipe -Wall -Winvalid-pch -std=gnu99 -O2 -g -W -Waddress -Waggressive-loop-optimizations -Wall -Warray-bounds -Wattributes -Wbuiltin-macro-redefined -Wchar-subscripts -Wclobbered -Wcomment -Wcomments -Wcoverage-mismatch -Wcpp -Wdate-time -Wno-deprecated-declarations -Wdisabled-optimization -Wdiv-by-zero -Wdouble-promotion -Wempty-body -Wendif-labels -Wenum-compare -Wextra -Wformat-contains-nul -Wformat-extra-args -Wformat-security -Wformat-y2k -Wformat-zero-length -Wfree-nonheap-object -Wignored-qualifiers -Wimplicit -Wimplicit-function-declaration -Wimplicit-int -Winit-self -Winline -Wint-to-pointer-cast -Winvalid-memory-model -Winvalid-pch -Wjump-misses-init -Wlogical-op -Wmain -Wmaybe-uninitialized -Wmissing-braces -Wmissing-declarations -Wmissing-field-initializers -Wmissing-parameter-type -Wmissing-prototypes -Wmultichar -Wnarrowing -Wnested-externs -Wnonnull -Wold-style-declaration -Wold-style-definition -Wopenmp-simd -Woverflow -Woverride-init -Wpacked -Wpacked-bitfield-compat -Wparentheses -Wpointer-arith -Wpointer-sign -Wpointer-to-int-cast -Wpragmas -Wreturn-local-addr -Wreturn-type -Wsequence-point -Wshadow -Wsizeof-pointer-memaccess -Wstack-protector -Wstrict-aliasing -Wstrict-overflow -Wstrict-prototypes -Wsuggest-attribute=const -Wsuggest-attribute=format -Wsuggest-attribute=noreturn -Wsuggest-attribute=pure -Wswitch -Wswitch-default -Wsync-nand -Wtrampolines -Wtrigraphs -Wtype-limits -Wuninitialized -Wunknown-pragmas -Wunsafe-loop-optimizations -Wunused -Wunused-but-set-parameter -Wunused-but-set-variable -Wunused-function -Wunused-label -Wunused-local-typedefs -Wunused-parameter -Wunused-result -Wunused-value -Wunused-variable -Wvarargs -Wvariadic-macros -Wvector-operation-performance -Wvla -Wvolatile-register-var -Wwrite-strings -Wnormalized=nfc -Wno-sign-compare -Wno-sign-conversion -Wno-conversion -Wno-unsafe-loop-optimizations -Wno-cast-function-type -Wjump-misses-init -Wframe-larger-than=40096 -O2 -Wp,-D_FORTIFY_SOURCE=2 -fexceptions -fasynchronous-unwind-tables -fdiagnostics-show-option -funit-at-a-time -fipa-pure-const -Wno-suggest-attribute=pure -Wno-suggest-attribute=const -mms-bitfields -mms-bitfields -mms-bitfields -MD -MQ 'src/25a6634@@gvnc-1.0@sha/vncconnection.c.obj' -MF 'src/25a6634@@gvnc-1.0@sha/vncconnection.c.obj.d' -o 'src/25a6634@@gvnc-1.0@sha/vncconnection.c.obj' -c ../src/vncconnection.c In file included from ../src/vncconnection.c:57: ../src/dh.h:25:10: fatal error: gcrypt.h: No such file or directory #include <gcrypt.h> ^~~~~~~~~~ compilation terminated. [19/50] Compiling C object 'src/25a6634@@gvnc-1.0@sha/vncbaseframebuffer.c.obj'. ninja: build stopped: subcommand failed. Build step 'Execute shell' marked build as failure
1 2
0 0
[Libvirt-ci] Build failed in Jenkins: libvirt-syntax-check » libvirt-debian-9 #890
by ci@centos.org 08 Jan '20

08 Jan '20
See <https://ci.centos.org/job/libvirt-syntax-check/systems=libvirt-debian-9/890…> ------------------------------------------ Started by upstream project "libvirt-syntax-check" build number 890 originally caused by: Started by upstream project "libvirt-build" build number 1088 originally caused by: Started by an SCM change Running as SYSTEM [EnvInject] - Loading node environment variables. Building remotely on libvirt-debian-9 (libvirt) in workspace <https://ci.centos.org/job/libvirt-syntax-check/systems=libvirt-debian-9/ws/> [libvirt] $ /bin/sh -xe /tmp/jenkins5607611037077421033.sh + cd build + /usr/bin/make syntax-check GEN spacing-check GEN prohibit-duplicate-header GEN test-wrap-argv GEN mock-noinline GEN group-qemu-caps GEN header-ifdef GFDL_version TAB_in_indentation Wundef_boolean avoid_ctype_macros avoid_g_gnuc_unused_in_header avoid_if_before_free avoid_strcase avoid_write bindtextdomain cast_of_argument_to_free cast_of_x_alloc_return_value changelog const_long_option copyright_check copyright_format copyright_usage correct_id_types curly_braces_style error_message_period error_message_warn_fatal flags_debug flags_usage flake8 forbid_const_pointer_typedef forbid_manual_xml_indent gettext_init libvirt_unmarked_diagnostics m4_quote_check makefile_TAB_only_indentation makefile_at_at_check makefile_conditionals /usr/bin/make -C src generated-sources po_check preprocessor_indentation prohibit_HAVE_MBRTOWC prohibit_PATH_MAX prohibit_VIR_ERR_NO_MEMORY prohibit_access_xok prohibit_always-defined_macros prohibit_always_true_header_tests prohibit_argmatch_without_use prohibit_asprintf prohibit_assert_without_use prohibit_atoi prohibit_attribute_macros prohibit_author prohibit_backslash_alignment prohibit_backup_files prohibit_canonicalize_file_name prohibit_canonicalize_without_use prohibit_class prohibit_cloexec_without_use prohibit_close prohibit_close_stream_without_use prohibit_config_h_in_headers prohibit_cross_inclusion prohibit_ctype_h prohibit_cvs_keyword prohibit_defined_have_decl_tests prohibit_devname prohibit_diagnostic_without_format prohibit_dirent_d_type prohibit_dirent_without_use prohibit_double_semicolon prohibit_doubled_word prohibit_empty_first_line prohibit_empty_lines_at_EOF prohibit_error_without_use prohibit_exit_in_tests prohibit_fork_wrappers prohibit_gethostname prohibit_getopt_without_use prohibit_gettext_markup prohibit_gettext_noop prohibit_hash_pjw_without_use prohibit_have_config_h prohibit_http_urls prohibit_ignore_value_without_use prohibit_include_public_headers_brackets prohibit_include_public_headers_quote prohibit_int_assign_bool prohibit_int_ijk prohibit_int_index prohibit_internal_functions prohibit_intprops_without_use prohibit_inttostr_without_use prohibit_libgen prohibit_long_lines prohibit_long_options_without_use prohibit_loop_iijjkk prohibit_loop_var_decl prohibit_magic_number_exit make[1]: Entering directory '<https://ci.centos.org/job/libvirt-syntax-check/systems=libvirt-debian-9/ws/…'> prohibit_mixed_case_abbreviations make[1]: Nothing to be done for 'generated-sources'. make[1]: Leaving directory '<https://ci.centos.org/job/libvirt-syntax-check/systems=libvirt-debian-9/ws/…'> prohibit_mkdtemp prohibit_mkstemp prohibit_newline_at_end_of_diagnostic prohibit_non_glib_macros prohibit_not_streq prohibit_nonreentrant prohibit_obj_free_apis_in_virsh prohibit_openat_without_use prohibit_paren_brace prohibit_path_max_allocation prohibit_posixver_without_use prohibit_pthread_create prohibit_raw_allocation prohibit_raw_virclassnew prohibit_readdir prohibit_readlink prohibit_return_as_function prohibit_reversed_compare_failure prohibit_risky_id_promotion prohibit_root_dev_ino_without_use prohibit_same_without_use prohibit_safe_read_without_use prohibit_setuid prohibit_select prohibit_signal_without_use prohibit_snprintf prohibit_space_in_label prohibit_sprintf prohibit_static_zero_init prohibit_stddef_without_use prohibit_stdio--_without_use prohibit_stdio-safer_without_use prohibit_strcmp prohibit_strdup prohibit_strings_without_use prohibit_strncmp prohibit_strncpy prohibit_strtol prohibit_sysconf_pagesize prohibit_system_error_with_vir_err prohibit_test_double_equal prohibit_test_minus_ao prohibit_unbounded_arrays_in_rpc prohibit_unsigned_pid prohibit_useless_translation prohibit_verbose_strcat prohibit_verify_without_use prohibit_virBufferAdd_with_string_literal prohibit_virBufferAsprintf_with_string_literal prohibit_virConnectOpen_in_virsh prohibit_virSecurity prohibit_virXXXFree prohibit_windows_special_chars_in_filename prohibit_wrong_filename_in_comment prohibit_xalloc_without_use prohibit_xfreopen_without_use prohibit_xmlGetProp prohibit_xmlURI prohobit_vsnprintf proper_name_utf8_requires_ICONV redundant_const require_attribute_cleanup_initialization require_config_h require_config_h_first require_enum_last_marker require_if_else_matching_braces require_locale_h require_space_before_label require_whitespace_in_translation size_of_brackets spec_indentation trailing_blank unmarked_diagnostics vulnerable_makefile_CVE-2009-4029 vulnerable_makefile_CVE-2012-3386 build-aux/syntax-check.mk: skipping test sc_preprocessor_indentation: cppi not installed ../po/Makefile.am:60: -e "s|POT-Creation-Date:[^\]*|POT-Creation-Date: $(POT_CREATION_DATE)|" \ build-aux/syntax-check.mk: Wrap long lines in Makefiles ../build-aux/syntax-check.mk:826: recipe for target 'sc_prohibit_long_lines' failed make: *** [sc_prohibit_long_lines] Error 1 make: *** Waiting for unfinished jobs.... Build step 'Execute shell' marked build as failure
1 1
0 0
[Libvirt-ci] Build failed in Jenkins: libvirt-syntax-check » libvirt-centos-7 #890
by ci@centos.org 08 Jan '20

08 Jan '20
See <https://ci.centos.org/job/libvirt-syntax-check/systems=libvirt-centos-7/890…> ------------------------------------------ Started by upstream project "libvirt-syntax-check" build number 890 originally caused by: Started by upstream project "libvirt-build" build number 1088 originally caused by: Started by an SCM change Running as SYSTEM [EnvInject] - Loading node environment variables. Building remotely on libvirt-centos-7 (libvirt) in workspace <https://ci.centos.org/job/libvirt-syntax-check/systems=libvirt-centos-7/ws/> [libvirt] $ /bin/sh -xe /tmp/jenkins3465307134076386090.sh + cd build + /usr/bin/gmake syntax-check GEN spacing-check GEN test-wrap-argv GEN prohibit-duplicate-header GEN mock-noinline GEN group-qemu-caps GEN header-ifdef GFDL_version TAB_in_indentation Wundef_boolean avoid_ctype_macros avoid_g_gnuc_unused_in_header avoid_if_before_free avoid_strcase avoid_write bindtextdomain cast_of_argument_to_free cast_of_x_alloc_return_value changelog const_long_option copyright_check copyright_format copyright_usage correct_id_types curly_braces_style error_message_period error_message_warn_fatal flags_debug flags_usage flake8 forbid_const_pointer_typedef forbid_manual_xml_indent gettext_init libvirt_unmarked_diagnostics m4_quote_check makefile_TAB_only_indentation makefile_at_at_check makefile_conditionals /usr/bin/gmake -C src generated-sources po_check preprocessor_indentation prohibit_HAVE_MBRTOWC prohibit_PATH_MAX prohibit_VIR_ERR_NO_MEMORY prohibit_access_xok prohibit_always-defined_macros prohibit_always_true_header_tests prohibit_argmatch_without_use prohibit_asprintf prohibit_assert_without_use prohibit_atoi prohibit_attribute_macros prohibit_author prohibit_backslash_alignment prohibit_backup_files prohibit_canonicalize_file_name prohibit_canonicalize_without_use prohibit_class prohibit_cloexec_without_use prohibit_close prohibit_close_stream_without_use prohibit_config_h_in_headers prohibit_cross_inclusion prohibit_ctype_h prohibit_cvs_keyword prohibit_defined_have_decl_tests prohibit_devname prohibit_diagnostic_without_format prohibit_dirent_d_type prohibit_dirent_without_use prohibit_double_semicolon prohibit_doubled_word prohibit_empty_first_line prohibit_empty_lines_at_EOF prohibit_error_without_use prohibit_exit_in_tests prohibit_fork_wrappers prohibit_gethostname prohibit_getopt_without_use prohibit_gettext_markup prohibit_gettext_noop prohibit_hash_pjw_without_use prohibit_have_config_h prohibit_http_urls prohibit_ignore_value_without_use prohibit_include_public_headers_brackets prohibit_include_public_headers_quote prohibit_int_assign_bool prohibit_int_ijk prohibit_int_index prohibit_internal_functions prohibit_intprops_without_use prohibit_inttostr_without_use prohibit_libgen prohibit_long_lines prohibit_long_options_without_use prohibit_loop_iijjkk prohibit_loop_var_decl prohibit_magic_number_exit prohibit_mixed_case_abbreviations prohibit_mkdtemp prohibit_mkstemp prohibit_newline_at_end_of_diagnostic prohibit_non_glib_macros prohibit_nonreentrant gmake[1]: Entering directory `<https://ci.centos.org/job/libvirt-syntax-check/systems=libvirt-centos-7/ws/…'> gmake[1]: Nothing to be done for `generated-sources'. gmake[1]: Leaving directory `<https://ci.centos.org/job/libvirt-syntax-check/systems=libvirt-centos-7/ws/…'> prohibit_not_streq prohibit_obj_free_apis_in_virsh prohibit_openat_without_use prohibit_paren_brace prohibit_path_max_allocation prohibit_posixver_without_use prohibit_pthread_create prohibit_raw_allocation prohibit_raw_virclassnew prohibit_readdir prohibit_readlink prohibit_return_as_function prohibit_reversed_compare_failure prohibit_risky_id_promotion prohibit_root_dev_ino_without_use prohibit_safe_read_without_use prohibit_same_without_use prohibit_select prohibit_setuid prohibit_signal_without_use prohibit_snprintf prohibit_space_in_label prohibit_sprintf prohibit_static_zero_init prohibit_stddef_without_use prohibit_stdio--_without_use prohibit_stdio-safer_without_use prohibit_strcmp prohibit_strdup prohibit_strings_without_use prohibit_strncmp prohibit_strncpy prohibit_strtol prohibit_sysconf_pagesize prohibit_system_error_with_vir_err prohibit_test_double_equal prohibit_test_minus_ao prohibit_unbounded_arrays_in_rpc prohibit_unsigned_pid prohibit_useless_translation prohibit_verbose_strcat prohibit_verify_without_use prohibit_virBufferAdd_with_string_literal prohibit_virBufferAsprintf_with_string_literal prohibit_virConnectOpen_in_virsh prohibit_virSecurity prohibit_virXXXFree prohibit_windows_special_chars_in_filename prohibit_wrong_filename_in_comment prohibit_xalloc_without_use prohibit_xfreopen_without_use prohibit_xmlGetProp prohibit_xmlURI prohobit_vsnprintf proper_name_utf8_requires_ICONV redundant_const require_attribute_cleanup_initialization require_config_h require_config_h_first require_enum_last_marker require_if_else_matching_braces require_locale_h require_space_before_label require_whitespace_in_translation size_of_brackets spec_indentation trailing_blank unmarked_diagnostics vulnerable_makefile_CVE-2009-4029 vulnerable_makefile_CVE-2012-3386 build-aux/syntax-check.mk: skipping test sc_flake8: flake8 not installed build-aux/syntax-check.mk: skipping test sc_preprocessor_indentation: cppi not installed ../po/Makefile.am:60: -e "s|POT-Creation-Date:[^\]*|POT-Creation-Date: $(POT_CREATION_DATE)|" \ build-aux/syntax-check.mk: Wrap long lines in Makefiles gmake: *** [sc_prohibit_long_lines] Error 1 gmake: *** Waiting for unfinished jobs.... Build step 'Execute shell' marked build as failure
1 1
0 0
[Libvirt-ci] Build failed in Jenkins: libvirt-syntax-check » libvirt-fedora-30 #890
by ci@centos.org 08 Jan '20

08 Jan '20
See <https://ci.centos.org/job/libvirt-syntax-check/systems=libvirt-fedora-30/89…> ------------------------------------------ Started by upstream project "libvirt-syntax-check" build number 890 originally caused by: Started by upstream project "libvirt-build" build number 1088 originally caused by: Started by an SCM change Running as SYSTEM [EnvInject] - Loading node environment variables. Building remotely on libvirt-fedora-30 (libvirt) in workspace <https://ci.centos.org/job/libvirt-syntax-check/systems=libvirt-fedora-30/ws/> [libvirt] $ /bin/sh -xe /tmp/jenkins7689831868235514973.sh + cd build + /usr/bin/gmake syntax-check GEN spacing-check GEN test-wrap-argv GEN prohibit-duplicate-header GEN mock-noinline GEN group-qemu-caps GEN header-ifdef GFDL_version TAB_in_indentation Wundef_boolean avoid_ctype_macros avoid_g_gnuc_unused_in_header avoid_if_before_free avoid_strcase avoid_write bindtextdomain cast_of_argument_to_free cast_of_x_alloc_return_value changelog const_long_option copyright_check copyright_format copyright_usage correct_id_types curly_braces_style error_message_period error_message_warn_fatal flags_debug flags_usage flake8 forbid_const_pointer_typedef forbid_manual_xml_indent gettext_init libvirt_unmarked_diagnostics m4_quote_check makefile_TAB_only_indentation makefile_at_at_check makefile_conditionals /usr/bin/gmake -C src generated-sources gmake[1]: Entering directory '<https://ci.centos.org/job/libvirt-syntax-check/systems=libvirt-fedora-30/ws…'> gmake[1]: Nothing to be done for 'generated-sources'. gmake[1]: Leaving directory '<https://ci.centos.org/job/libvirt-syntax-check/systems=libvirt-fedora-30/ws…'> po_check preprocessor_indentation prohibit_HAVE_MBRTOWC prohibit_PATH_MAX prohibit_VIR_ERR_NO_MEMORY prohibit_access_xok prohibit_always-defined_macros prohibit_always_true_header_tests prohibit_argmatch_without_use prohibit_asprintf prohibit_assert_without_use prohibit_atoi prohibit_attribute_macros prohibit_author prohibit_backslash_alignment prohibit_backup_files prohibit_canonicalize_file_name prohibit_canonicalize_without_use prohibit_class prohibit_cloexec_without_use prohibit_close prohibit_close_stream_without_use prohibit_config_h_in_headers prohibit_cross_inclusion prohibit_ctype_h prohibit_cvs_keyword prohibit_defined_have_decl_tests prohibit_devname prohibit_diagnostic_without_format prohibit_dirent_d_type prohibit_dirent_without_use prohibit_double_semicolon prohibit_doubled_word prohibit_empty_first_line prohibit_empty_lines_at_EOF prohibit_exit_in_tests prohibit_error_without_use prohibit_fork_wrappers prohibit_gethostname prohibit_getopt_without_use prohibit_gettext_markup prohibit_gettext_noop prohibit_hash_pjw_without_use prohibit_have_config_h prohibit_http_urls prohibit_ignore_value_without_use prohibit_include_public_headers_brackets prohibit_include_public_headers_quote prohibit_int_assign_bool prohibit_int_ijk prohibit_int_index prohibit_internal_functions prohibit_intprops_without_use prohibit_inttostr_without_use prohibit_libgen prohibit_long_lines prohibit_long_options_without_use prohibit_loop_iijjkk prohibit_loop_var_decl prohibit_magic_number_exit prohibit_mixed_case_abbreviations prohibit_mkdtemp prohibit_mkstemp prohibit_newline_at_end_of_diagnostic prohibit_non_glib_macros prohibit_nonreentrant prohibit_not_streq prohibit_obj_free_apis_in_virsh prohibit_openat_without_use prohibit_paren_brace prohibit_path_max_allocation prohibit_posixver_without_use prohibit_pthread_create prohibit_raw_allocation prohibit_raw_virclassnew prohibit_readdir prohibit_readlink prohibit_return_as_function prohibit_reversed_compare_failure prohibit_risky_id_promotion prohibit_root_dev_ino_without_use prohibit_safe_read_without_use prohibit_same_without_use prohibit_select prohibit_setuid prohibit_signal_without_use prohibit_snprintf prohibit_space_in_label prohibit_sprintf prohibit_static_zero_init prohibit_stddef_without_use prohibit_stdio--_without_use prohibit_stdio-safer_without_use prohibit_strcmp prohibit_strdup prohibit_strings_without_use prohibit_strncmp prohibit_strncpy prohibit_strtol prohibit_sysconf_pagesize prohibit_system_error_with_vir_err prohibit_test_double_equal prohibit_test_minus_ao prohibit_unbounded_arrays_in_rpc prohibit_unsigned_pid prohibit_useless_translation prohibit_verbose_strcat prohibit_verify_without_use prohibit_virBufferAdd_with_string_literal prohibit_virBufferAsprintf_with_string_literal prohibit_virConnectOpen_in_virsh prohibit_virSecurity prohibit_virXXXFree prohibit_windows_special_chars_in_filename prohibit_wrong_filename_in_comment prohibit_xfreopen_without_use prohibit_xalloc_without_use prohibit_xmlGetProp prohibit_xmlURI prohobit_vsnprintf proper_name_utf8_requires_ICONV redundant_const require_attribute_cleanup_initialization require_config_h require_config_h_first require_enum_last_marker require_if_else_matching_braces require_locale_h require_space_before_label require_whitespace_in_translation size_of_brackets spec_indentation trailing_blank unmarked_diagnostics vulnerable_makefile_CVE-2009-4029 vulnerable_makefile_CVE-2012-3386 ../po/Makefile.am:60: -e "s|POT-Creation-Date:[^\]*|POT-Creation-Date: $(POT_CREATION_DATE)|" \ build-aux/syntax-check.mk: Wrap long lines in Makefiles gmake: *** [../build-aux/syntax-check.mk:827: sc_prohibit_long_lines] Error 1 gmake: *** Waiting for unfinished jobs.... Build step 'Execute shell' marked build as failure
1 1
0 0
[Libvirt-ci] Build failed in Jenkins: libvirt-syntax-check » libvirt-fedora-rawhide #890
by ci@centos.org 08 Jan '20

08 Jan '20
See <https://ci.centos.org/job/libvirt-syntax-check/systems=libvirt-fedora-rawhi…> ------------------------------------------ Started by upstream project "libvirt-syntax-check" build number 890 originally caused by: Started by upstream project "libvirt-build" build number 1088 originally caused by: Started by an SCM change Running as SYSTEM [EnvInject] - Loading node environment variables. Building remotely on libvirt-fedora-rawhide (libvirt) in workspace <https://ci.centos.org/job/libvirt-syntax-check/systems=libvirt-fedora-rawhi…> [libvirt] $ /bin/sh -xe /tmp/jenkins18029320104808866152.sh + cd build + /usr/bin/gmake syntax-check GEN test-wrap-argv GEN prohibit-duplicate-header GEN spacing-check GEN mock-noinline GEN group-qemu-caps GEN header-ifdef GFDL_version TAB_in_indentation Wundef_boolean avoid_ctype_macros avoid_g_gnuc_unused_in_header avoid_if_before_free avoid_strcase avoid_write bindtextdomain cast_of_argument_to_free cast_of_x_alloc_return_value changelog const_long_option copyright_check copyright_format copyright_usage correct_id_types curly_braces_style error_message_period error_message_warn_fatal flags_debug flags_usage flake8 forbid_const_pointer_typedef forbid_manual_xml_indent gettext_init libvirt_unmarked_diagnostics m4_quote_check makefile_TAB_only_indentation makefile_at_at_check makefile_conditionals /usr/bin/gmake -C src generated-sources po_check preprocessor_indentation prohibit_HAVE_MBRTOWC prohibit_PATH_MAX prohibit_VIR_ERR_NO_MEMORY prohibit_access_xok prohibit_always-defined_macros prohibit_always_true_header_tests prohibit_argmatch_without_use prohibit_asprintf prohibit_assert_without_use prohibit_atoi prohibit_attribute_macros gmake[1]: Entering directory '<https://ci.centos.org/job/libvirt-syntax-check/systems=libvirt-fedora-rawhi…'> gmake[1]: Nothing to be done for 'generated-sources'. gmake[1]: Leaving directory '<https://ci.centos.org/job/libvirt-syntax-check/systems=libvirt-fedora-rawhi…'> prohibit_backslash_alignment prohibit_author prohibit_backup_files prohibit_canonicalize_file_name prohibit_canonicalize_without_use prohibit_class prohibit_cloexec_without_use prohibit_close prohibit_close_stream_without_use prohibit_config_h_in_headers prohibit_cross_inclusion prohibit_ctype_h prohibit_cvs_keyword prohibit_defined_have_decl_tests prohibit_devname prohibit_diagnostic_without_format prohibit_dirent_d_type prohibit_dirent_without_use prohibit_double_semicolon prohibit_doubled_word prohibit_empty_first_line prohibit_empty_lines_at_EOF prohibit_error_without_use prohibit_exit_in_tests prohibit_fork_wrappers prohibit_gethostname prohibit_getopt_without_use prohibit_gettext_markup prohibit_gettext_noop prohibit_hash_pjw_without_use prohibit_have_config_h prohibit_http_urls prohibit_ignore_value_without_use prohibit_include_public_headers_brackets prohibit_include_public_headers_quote prohibit_int_assign_bool prohibit_int_ijk prohibit_int_index prohibit_internal_functions prohibit_intprops_without_use prohibit_inttostr_without_use prohibit_libgen prohibit_long_lines prohibit_long_options_without_use prohibit_loop_iijjkk prohibit_loop_var_decl prohibit_magic_number_exit prohibit_mixed_case_abbreviations prohibit_mkdtemp prohibit_mkstemp prohibit_newline_at_end_of_diagnostic prohibit_non_glib_macros prohibit_nonreentrant prohibit_not_streq prohibit_obj_free_apis_in_virsh prohibit_openat_without_use prohibit_paren_brace prohibit_path_max_allocation prohibit_posixver_without_use prohibit_pthread_create prohibit_raw_allocation prohibit_raw_virclassnew prohibit_readdir prohibit_readlink prohibit_return_as_function prohibit_reversed_compare_failure prohibit_risky_id_promotion prohibit_root_dev_ino_without_use prohibit_safe_read_without_use prohibit_same_without_use prohibit_select prohibit_setuid prohibit_signal_without_use prohibit_snprintf prohibit_space_in_label prohibit_sprintf prohibit_static_zero_init prohibit_stddef_without_use prohibit_stdio--_without_use prohibit_stdio-safer_without_use prohibit_strcmp prohibit_strdup prohibit_strings_without_use prohibit_strncmp prohibit_strncpy prohibit_strtol prohibit_sysconf_pagesize prohibit_system_error_with_vir_err prohibit_test_double_equal prohibit_test_minus_ao prohibit_unbounded_arrays_in_rpc prohibit_unsigned_pid prohibit_useless_translation prohibit_verbose_strcat prohibit_verify_without_use prohibit_virBufferAdd_with_string_literal prohibit_virBufferAsprintf_with_string_literal prohibit_virConnectOpen_in_virsh prohibit_virSecurity prohibit_virXXXFree prohibit_windows_special_chars_in_filename prohibit_wrong_filename_in_comment prohibit_xalloc_without_use prohibit_xfreopen_without_use prohibit_xmlGetProp prohibit_xmlURI prohobit_vsnprintf proper_name_utf8_requires_ICONV redundant_const require_attribute_cleanup_initialization require_config_h require_config_h_first require_enum_last_marker require_if_else_matching_braces require_locale_h require_space_before_label require_whitespace_in_translation size_of_brackets spec_indentation trailing_blank unmarked_diagnostics vulnerable_makefile_CVE-2009-4029 vulnerable_makefile_CVE-2012-3386 ../po/Makefile.am:60: -e "s|POT-Creation-Date:[^\]*|POT-Creation-Date: $(POT_CREATION_DATE)|" \ build-aux/syntax-check.mk: Wrap long lines in Makefiles gmake: *** [../build-aux/syntax-check.mk:827: sc_prohibit_long_lines] Error 1 gmake: *** Waiting for unfinished jobs.... Build step 'Execute shell' marked build as failure
1 1
0 0
  • ← Newer
  • 1
  • ...
  • 8
  • 9
  • 10
  • 11
  • 12
  • 13
  • 14
  • Older →

HyperKitty Powered by HyperKitty version 1.3.12.