libvirt List Archives
Sign In Sign Up
Manage this list Sign In Sign Up

Keyboard Shortcuts

Thread View

  • j: Next unread message
  • k: Previous unread message
  • j a: Jump to all threads
  • j l: Jump to MailingList overview

CI

Thread Start a new thread
Download
Threads by month
  • ----- 2025 -----
  • August
  • July
  • June
  • May
  • April
  • March
  • February
  • January
  • ----- 2024 -----
  • December
  • November
  • October
  • September
  • August
  • July
  • June
  • May
  • April
  • March
  • February
  • January
  • ----- 2023 -----
  • December
  • November
  • October
  • September
  • August
  • July
  • June
  • May
  • April
  • March
  • February
  • January
  • ----- 2022 -----
  • December
  • November
  • October
  • September
  • August
  • July
  • June
  • May
  • April
  • March
  • February
  • January
  • ----- 2021 -----
  • December
  • November
  • October
  • September
  • August
  • July
  • June
  • May
  • April
  • March
  • February
  • January
  • ----- 2020 -----
  • December
  • November
  • October
  • September
  • August
  • July
  • June
  • May
  • April
  • March
  • February
  • January
  • ----- 2019 -----
  • December
  • November
  • October
  • September
  • August
  • July
  • June
  • May
  • April
  • March
  • February
  • January
  • ----- 2018 -----
  • December
  • November
  • October
  • September
  • August
  • July
  • June
  • May
  • April
  • March
  • February
  • January
  • ----- 2017 -----
  • December
  • November
  • October
  • September
  • August
  • July
  • June
  • May
  • April
  • March
  • February
  • January
  • ----- 2016 -----
  • December
  • November
  • October
  • September
  • August
  • July
ci@lists.libvirt.org

January 2020

  • 2 participants
  • 139 discussions
[Libvirt-ci] Build failed in Jenkins: libvirt-go-check » libvirt-freebsd-12 #905
by ci@centos.org 10 Jan '20

10 Jan '20
See <https://ci.centos.org/job/libvirt-go-check/systems=libvirt-freebsd-12/905/d…> ------------------------------------------ Started by upstream project "libvirt-go-check" build number 905 originally caused by: Started by upstream project "libvirt-go-build" build number 919 originally caused by: Started by upstream project "libvirt-build" build number 1088 originally caused by: Started by an SCM change Running as SYSTEM [EnvInject] - Loading node environment variables. Building remotely on libvirt-freebsd-12 (libvirt) in workspace <https://ci.centos.org/job/libvirt-go-check/systems=libvirt-freebsd-12/ws/> [libvirt-go] $ /bin/sh -xe /tmp/jenkins12467442443025804963.sh + export 'TEST_ARGS=-tags api' + go test -tags api Missing enum 'VIR_DOMAIN_STATS_MEMORY' --- FAIL: TestAPICoverage (0.74s) panic: Missing symbols found [recovered] panic: Missing symbols found goroutine 21 [running]: testing.tRunner.func1(0xc0000c2100) /usr/local/go/src/testing/testing.go:874 +0x3a3 panic(0x224740, 0x2a0d20) /usr/local/go/src/runtime/panic.go:679 +0x1b2 _/usr<https://ci.centos.org/job/libvirt-go-check/systems=libvirt-freebsd-12/ws/.T…> /usr<https://ci.centos.org/job/libvirt-go-check/systems=libvirt-freebsd-12/ws/ap…>:503 +0x551 testing.tRunner(0xc0000c2100, 0x279f50) /usr/local/go/src/testing/testing.go:909 +0xc9 created by testing.(*T).Run /usr/local/go/src/testing/testing.go:960 +0x350 exit status 2 FAIL _/usr<https://ci.centos.org/job/libvirt-go-check/systems=libvirt-freebsd-12/ws/> 1.165s Build step 'Execute shell' marked build as failure
1 8
0 0
[Libvirt-ci] Build failed in Jenkins: libvirt-go-check » libvirt-freebsd-11 #905
by ci@centos.org 10 Jan '20

10 Jan '20
See <https://ci.centos.org/job/libvirt-go-check/systems=libvirt-freebsd-11/905/d…> ------------------------------------------ Started by upstream project "libvirt-go-check" build number 905 originally caused by: Started by upstream project "libvirt-go-build" build number 919 originally caused by: Started by upstream project "libvirt-build" build number 1088 originally caused by: Started by an SCM change Running as SYSTEM [EnvInject] - Loading node environment variables. Building remotely on libvirt-freebsd-11 (libvirt) in workspace <https://ci.centos.org/job/libvirt-go-check/systems=libvirt-freebsd-11/ws/> [libvirt-go] $ /bin/sh -xe /tmp/jenkins2066712137364960422.sh + export 'TEST_ARGS=-tags api' + go test -tags api Missing enum 'VIR_DOMAIN_STATS_MEMORY' --- FAIL: TestAPICoverage (1.16s) panic: Missing symbols found [recovered] panic: Missing symbols found goroutine 7 [running]: testing.tRunner.func1(0xc0000a8100) /usr/local/go/src/testing/testing.go:874 +0x3a3 panic(0x5df660, 0x65bc40) /usr/local/go/src/runtime/panic.go:679 +0x1b2 _/usr<https://ci.centos.org/job/libvirt-go-check/systems=libvirt-freebsd-11/ws/.T…> /usr<https://ci.centos.org/job/libvirt-go-check/systems=libvirt-freebsd-11/ws/ap…>:503 +0x551 testing.tRunner(0xc0000a8100, 0x634e70) /usr/local/go/src/testing/testing.go:909 +0xc9 created by testing.(*T).Run /usr/local/go/src/testing/testing.go:960 +0x350 exit status 2 FAIL _/usr<https://ci.centos.org/job/libvirt-go-check/systems=libvirt-freebsd-11/ws/> 1.359s Build step 'Execute shell' marked build as failure
1 8
0 0
[Libvirt-ci] Build failed in Jenkins: libvirt-go-check » libvirt-centos-7 #905
by ci@centos.org 10 Jan '20

10 Jan '20
See <https://ci.centos.org/job/libvirt-go-check/systems=libvirt-centos-7/905/dis…> ------------------------------------------ Started by upstream project "libvirt-go-check" build number 905 originally caused by: Started by upstream project "libvirt-go-build" build number 919 originally caused by: Started by upstream project "libvirt-build" build number 1088 originally caused by: Started by an SCM change Running as SYSTEM [EnvInject] - Loading node environment variables. Building remotely on libvirt-centos-7 (libvirt) in workspace <https://ci.centos.org/job/libvirt-go-check/systems=libvirt-centos-7/ws/> [libvirt-go] $ /bin/sh -xe /tmp/jenkins15282259380322993837.sh + export 'TEST_ARGS=-tags api' + TEST_ARGS='-tags api' + go test -tags api Missing enum 'VIR_DOMAIN_STATS_MEMORY' --- FAIL: TestAPICoverage (1.71s) panic: Missing symbols found [recovered] panic: Missing symbols found goroutine 7 [running]: testing.tRunner.func1(0xc0000a4100) /usr/lib/golang/src/testing/testing.go:874 +0x3a3 panic(0x5de640, 0x65b590) /usr/lib/golang/src/runtime/panic.go:679 +0x1b2 _<https://ci.centos.org/job/libvirt-go-check/systems=libvirt-centos-7/ws/.Tes…> <https://ci.centos.org/job/libvirt-go-check/systems=libvirt-centos-7/ws/api_…>:503 +0x551 testing.tRunner(0xc0000a4100, 0x6344f0) /usr/lib/golang/src/testing/testing.go:909 +0xc9 created by testing.(*T).Run /usr/lib/golang/src/testing/testing.go:960 +0x350 exit status 2 FAIL _<https://ci.centos.org/job/libvirt-go-check/systems=libvirt-centos-7/ws/> 2.238s Build step 'Execute shell' marked build as failure
1 8
0 0
[Libvirt-ci] Build failed in Jenkins: libvirt-go-check » libvirt-debian-9 #905
by ci@centos.org 10 Jan '20

10 Jan '20
See <https://ci.centos.org/job/libvirt-go-check/systems=libvirt-debian-9/905/dis…> ------------------------------------------ Started by upstream project "libvirt-go-check" build number 905 originally caused by: Started by upstream project "libvirt-go-build" build number 919 originally caused by: Started by upstream project "libvirt-build" build number 1088 originally caused by: Started by an SCM change Running as SYSTEM [EnvInject] - Loading node environment variables. Building remotely on libvirt-debian-9 (libvirt) in workspace <https://ci.centos.org/job/libvirt-go-check/systems=libvirt-debian-9/ws/> [libvirt-go] $ /bin/sh -xe /tmp/jenkins5700620132850409130.sh + export TEST_ARGS=-tags api + go test -tags api Missing enum 'VIR_DOMAIN_STATS_MEMORY' --- FAIL: TestAPICoverage (0.54s) panic: Missing symbols found [recovered] panic: Missing symbols found goroutine 5 [running]: panic(0x55cb4a5a1680, 0xc42043d9a0) /usr/lib/go-1.7/src/runtime/panic.go:500 +0x1a1 testing.tRunner.func1(0xc42007a180) /usr/lib/go-1.7/src/testing/testing.go:579 +0x25d panic(0x55cb4a5a1680, 0xc42043d9a0) /usr/lib/go-1.7/src/runtime/panic.go:458 +0x243 _<https://ci.centos.org/job/libvirt-go-check/systems=libvirt-debian-9/ws/.Tes…> <https://ci.centos.org/job/libvirt-go-check/systems=libvirt-debian-9/ws/api_…>:503 +0x5ff testing.tRunner(0xc42007a180, 0x55cb4a5f4f68) /usr/lib/go-1.7/src/testing/testing.go:610 +0x81 created by testing.(*T).Run /usr/lib/go-1.7/src/testing/testing.go:646 +0x2ec exit status 2 FAIL _<https://ci.centos.org/job/libvirt-go-check/systems=libvirt-debian-9/ws/> 0.635s Build step 'Execute shell' marked build as failure
1 8
0 0
[Libvirt-ci] Build failed in Jenkins: libvirt-perl-check » libvirt-fedora-30 #925
by ci@centos.org 10 Jan '20

10 Jan '20
See <https://ci.centos.org/job/libvirt-perl-check/systems=libvirt-fedora-30/925/…> ------------------------------------------ Started by upstream project "libvirt-perl-check" build number 925 originally caused by: Started by upstream project "libvirt-perl-build" build number 926 originally caused by: Started by upstream project "libvirt-build" build number 1088 originally caused by: Started by an SCM change Running as SYSTEM [EnvInject] - Loading node environment variables. Building remotely on libvirt-fedora-30 (libvirt) in workspace <https://ci.centos.org/job/libvirt-perl-check/systems=libvirt-fedora-30/ws/> [libvirt-perl] $ /bin/sh -xe /tmp/jenkins10767118444901739179.sh + export TEST_MAINTAINER=1 + TEST_MAINTAINER=1 + perl Build test t/005-pod.t ............ ok t/010-pod-coverage.t ... ok t/015-changes.t ........ ok t/020-constants.t ...... ok # Failed test 'VIR_DOMAIN_STATS_MEMORY' # at t/030-api-coverage.t line 175. # Looks like you failed 1 test of 1750. t/030-api-coverage.t ... Dubious, test returned 1 (wstat 256, 0x100) Failed 1/1750 subtests t/100-connect.t ........ ok t/200-domains.t ........ ok t/300-networks.t ....... ok t/400-storage-pools.t .. ok t/500-storage-vols.t ... ok t/600-interfaces.t ..... ok t/800-events.t ......... ok Test Summary Report ------------------- t/030-api-coverage.t (Wstat: 256 Tests: 1750 Failed: 1) Failed test: 1114 Non-zero exit status: 1 Files=12, Tests=2008, 52 wallclock secs ( 0.48 usr 0.08 sys + 9.11 cusr 0.68 csys = 10.35 CPU) Result: FAIL Failed 1/12 test programs. 1/2008 subtests failed. Build step 'Execute shell' marked build as failure
1 7
0 0
[Libvirt-ci] Build failed in Jenkins: libvirt-perl-check » libvirt-fedora-31 #925
by ci@centos.org 10 Jan '20

10 Jan '20
See <https://ci.centos.org/job/libvirt-perl-check/systems=libvirt-fedora-31/925/…> ------------------------------------------ Started by upstream project "libvirt-perl-check" build number 925 originally caused by: Started by upstream project "libvirt-perl-build" build number 926 originally caused by: Started by upstream project "libvirt-build" build number 1088 originally caused by: Started by an SCM change Running as SYSTEM [EnvInject] - Loading node environment variables. Building remotely on libvirt-fedora-31 (libvirt) in workspace <https://ci.centos.org/job/libvirt-perl-check/systems=libvirt-fedora-31/ws/> [libvirt-perl] $ /bin/sh -xe /tmp/jenkins836085330385300556.sh + export TEST_MAINTAINER=1 + TEST_MAINTAINER=1 + perl Build test t/005-pod.t ............ ok t/010-pod-coverage.t ... ok t/015-changes.t ........ ok t/020-constants.t ...... ok # Failed test 'VIR_DOMAIN_STATS_MEMORY' # at t/030-api-coverage.t line 175. # Looks like you failed 1 test of 1750. t/030-api-coverage.t ... Dubious, test returned 1 (wstat 256, 0x100) Failed 1/1750 subtests t/100-connect.t ........ ok t/200-domains.t ........ ok t/300-networks.t ....... ok t/400-storage-pools.t .. ok t/500-storage-vols.t ... ok t/600-interfaces.t ..... ok t/800-events.t ......... ok Test Summary Report ------------------- t/030-api-coverage.t (Wstat: 256 Tests: 1750 Failed: 1) Failed test: 1114 Non-zero exit status: 1 Files=12, Tests=2008, 23 wallclock secs ( 0.42 usr 0.06 sys + 8.34 cusr 0.60 csys = 9.42 CPU) Result: FAIL Failed 1/12 test programs. 1/2008 subtests failed. Build step 'Execute shell' marked build as failure
1 7
0 0
[Libvirt-ci] Build failed in Jenkins: libvirt-perl-check » libvirt-freebsd-11 #925
by ci@centos.org 10 Jan '20

10 Jan '20
See <https://ci.centos.org/job/libvirt-perl-check/systems=libvirt-freebsd-11/925…> ------------------------------------------ Started by upstream project "libvirt-perl-check" build number 925 originally caused by: Started by upstream project "libvirt-perl-build" build number 926 originally caused by: Started by upstream project "libvirt-build" build number 1088 originally caused by: Started by an SCM change Running as SYSTEM [EnvInject] - Loading node environment variables. Building remotely on libvirt-freebsd-11 (libvirt) in workspace <https://ci.centos.org/job/libvirt-perl-check/systems=libvirt-freebsd-11/ws/> [libvirt-perl] $ /bin/sh -xe /tmp/jenkins8375246221210329039.sh + export 'TEST_MAINTAINER=1' + perl Build test t/005-pod.t ............ ok t/010-pod-coverage.t ... ok t/015-changes.t ........ ok t/020-constants.t ...... ok # Failed test 'VIR_DOMAIN_STATS_MEMORY' # at t/030-api-coverage.t line 175. # Looks like you failed 1 test of 1750. t/030-api-coverage.t ... Dubious, test returned 1 (wstat 256, 0x100) Failed 1/1750 subtests t/100-connect.t ........ ok t/200-domains.t ........ ok t/300-networks.t ....... ok t/400-storage-pools.t .. ok t/500-storage-vols.t ... ok t/600-interfaces.t ..... ok t/800-events.t ......... ok Test Summary Report ------------------- t/030-api-coverage.t (Wstat: 256 Tests: 1750 Failed: 1) Failed test: 1114 Non-zero exit status: 1 Files=12, Tests=2008, 19 wallclock secs ( 0.48 usr 0.32 sys + 15.20 cusr 1.54 csys = 17.55 CPU) Result: FAIL Failed 1/12 test programs. 1/2008 subtests failed. Build step 'Execute shell' marked build as failure
1 7
0 0
[Libvirt-ci] Build failed in Jenkins: libvirt-perl-check » libvirt-freebsd-12 #925
by ci@centos.org 10 Jan '20

10 Jan '20
See <https://ci.centos.org/job/libvirt-perl-check/systems=libvirt-freebsd-12/925…> ------------------------------------------ Started by upstream project "libvirt-perl-check" build number 925 originally caused by: Started by upstream project "libvirt-perl-build" build number 926 originally caused by: Started by upstream project "libvirt-build" build number 1088 originally caused by: Started by an SCM change Running as SYSTEM [EnvInject] - Loading node environment variables. Building remotely on libvirt-freebsd-12 (libvirt) in workspace <https://ci.centos.org/job/libvirt-perl-check/systems=libvirt-freebsd-12/ws/> [libvirt-perl] $ /bin/sh -xe /tmp/jenkins4746903895711140654.sh + export 'TEST_MAINTAINER=1' + perl Build test t/005-pod.t ............ ok t/010-pod-coverage.t ... ok t/015-changes.t ........ ok t/020-constants.t ...... ok # Failed test 'VIR_DOMAIN_STATS_MEMORY' # at t/030-api-coverage.t line 175. # Looks like you failed 1 test of 1750. t/030-api-coverage.t ... Dubious, test returned 1 (wstat 256, 0x100) Failed 1/1750 subtests t/100-connect.t ........ ok t/200-domains.t ........ ok t/300-networks.t ....... ok t/400-storage-pools.t .. ok t/500-storage-vols.t ... ok t/600-interfaces.t ..... ok t/800-events.t ......... ok Test Summary Report ------------------- t/030-api-coverage.t (Wstat: 256 Tests: 1750 Failed: 1) Failed test: 1114 Non-zero exit status: 1 Files=12, Tests=2008, 18 wallclock secs ( 0.45 usr 0.25 sys + 13.98 cusr 1.93 csys = 16.61 CPU) Result: FAIL Failed 1/12 test programs. 1/2008 subtests failed. Build step 'Execute shell' marked build as failure
1 7
0 0
[Libvirt-ci] Build failed in Jenkins: libvirt-perl-check » libvirt-fedora-rawhide #925
by ci@centos.org 10 Jan '20

10 Jan '20
See <https://ci.centos.org/job/libvirt-perl-check/systems=libvirt-fedora-rawhide…> ------------------------------------------ Started by upstream project "libvirt-perl-check" build number 925 originally caused by: Started by upstream project "libvirt-perl-build" build number 926 originally caused by: Started by upstream project "libvirt-build" build number 1088 originally caused by: Started by an SCM change Running as SYSTEM [EnvInject] - Loading node environment variables. Building remotely on libvirt-fedora-rawhide (libvirt) in workspace <https://ci.centos.org/job/libvirt-perl-check/systems=libvirt-fedora-rawhide…> [libvirt-perl] $ /bin/sh -xe /tmp/jenkins2654651669999468672.sh + export TEST_MAINTAINER=1 + TEST_MAINTAINER=1 + perl Build test t/005-pod.t ............ ok t/010-pod-coverage.t ... ok t/015-changes.t ........ ok t/020-constants.t ...... ok # Failed test 'VIR_DOMAIN_STATS_MEMORY' # at t/030-api-coverage.t line 175. # Looks like you failed 1 test of 1750. t/030-api-coverage.t ... Dubious, test returned 1 (wstat 256, 0x100) Failed 1/1750 subtests t/100-connect.t ........ ok t/200-domains.t ........ ok t/300-networks.t ....... ok t/400-storage-pools.t .. ok t/500-storage-vols.t ... ok t/600-interfaces.t ..... ok t/800-events.t ......... ok Test Summary Report ------------------- t/030-api-coverage.t (Wstat: 256 Tests: 1750 Failed: 1) Failed test: 1114 Non-zero exit status: 1 Files=12, Tests=2008, 22 wallclock secs ( 0.39 usr 0.06 sys + 8.42 cusr 0.58 csys = 9.45 CPU) Result: FAIL Failed 1/12 test programs. 1/2008 subtests failed. Build step 'Execute shell' marked build as failure
1 7
0 0
[Libvirt-ci] Build failed in Jenkins: libvirt-perl-check » libvirt-centos-7 #925
by ci@centos.org 10 Jan '20

10 Jan '20
See <https://ci.centos.org/job/libvirt-perl-check/systems=libvirt-centos-7/925/d…> ------------------------------------------ Started by upstream project "libvirt-perl-check" build number 925 originally caused by: Started by upstream project "libvirt-perl-build" build number 926 originally caused by: Started by upstream project "libvirt-build" build number 1088 originally caused by: Started by an SCM change Running as SYSTEM [EnvInject] - Loading node environment variables. Building remotely on libvirt-centos-7 (libvirt) in workspace <https://ci.centos.org/job/libvirt-perl-check/systems=libvirt-centos-7/ws/> [libvirt-perl] $ /bin/sh -xe /tmp/jenkins6749367007585404504.sh + export TEST_MAINTAINER=1 + TEST_MAINTAINER=1 + perl Build test t/005-pod.t ............ ok t/010-pod-coverage.t ... ok t/015-changes.t ........ ok t/020-constants.t ...... ok # Failed test 'VIR_DOMAIN_STATS_MEMORY' # at t/030-api-coverage.t line 175. # Looks like you failed 1 test of 1750. t/030-api-coverage.t ... Dubious, test returned 1 (wstat 256, 0x100) Failed 1/1750 subtests t/100-connect.t ........ ok t/200-domains.t ........ ok t/300-networks.t ....... ok t/400-storage-pools.t .. ok t/500-storage-vols.t ... ok t/600-interfaces.t ..... ok t/800-events.t ......... ok Test Summary Report ------------------- t/030-api-coverage.t (Wstat: 256 Tests: 1750 Failed: 1) Failed test: 1114 Non-zero exit status: 1 Files=12, Tests=2008, 13 wallclock secs ( 0.49 usr 0.33 sys + 8.73 cusr 0.77 csys = 10.32 CPU) Result: FAIL Failed 1/12 test programs. 1/2008 subtests failed. Build step 'Execute shell' marked build as failure
1 7
0 0
  • ← Newer
  • 1
  • ...
  • 7
  • 8
  • 9
  • 10
  • 11
  • 12
  • 13
  • 14
  • Older →

HyperKitty Powered by HyperKitty version 1.3.12.