libvirt List Archives
Sign In Sign Up
Manage this list Sign In Sign Up

Keyboard Shortcuts

Thread View

  • j: Next unread message
  • k: Previous unread message
  • j a: Jump to all threads
  • j l: Jump to MailingList overview

CI

Thread Start a new thread
Download
Threads by month
  • ----- 2025 -----
  • August
  • July
  • June
  • May
  • April
  • March
  • February
  • January
  • ----- 2024 -----
  • December
  • November
  • October
  • September
  • August
  • July
  • June
  • May
  • April
  • March
  • February
  • January
  • ----- 2023 -----
  • December
  • November
  • October
  • September
  • August
  • July
  • June
  • May
  • April
  • March
  • February
  • January
  • ----- 2022 -----
  • December
  • November
  • October
  • September
  • August
  • July
  • June
  • May
  • April
  • March
  • February
  • January
  • ----- 2021 -----
  • December
  • November
  • October
  • September
  • August
  • July
  • June
  • May
  • April
  • March
  • February
  • January
  • ----- 2020 -----
  • December
  • November
  • October
  • September
  • August
  • July
  • June
  • May
  • April
  • March
  • February
  • January
  • ----- 2019 -----
  • December
  • November
  • October
  • September
  • August
  • July
  • June
  • May
  • April
  • March
  • February
  • January
  • ----- 2018 -----
  • December
  • November
  • October
  • September
  • August
  • July
  • June
  • May
  • April
  • March
  • February
  • January
  • ----- 2017 -----
  • December
  • November
  • October
  • September
  • August
  • July
  • June
  • May
  • April
  • March
  • February
  • January
  • ----- 2016 -----
  • December
  • November
  • October
  • September
  • August
  • July
ci@lists.libvirt.org

May 2019

  • 2 participants
  • 38 discussions
[Libvirt-ci] Build failed in Jenkins: libvirt-go-check » libvirt-fedora-29 #439
by ci@centos.org 22 May '19

22 May '19
See <https://ci.centos.org/job/libvirt-go-check/systems=libvirt-fedora-29/439/di…> ------------------------------------------ Started by upstream project "libvirt-go-check" build number 439 originally caused by: Started by upstream project "libvirt-go-build" build number 445 originally caused by: Started by upstream project "libvirt-build" build number 539 originally caused by: Started by an SCM change [EnvInject] - Loading node environment variables. Building remotely on libvirt-fedora-29 (libvirt) in workspace <https://ci.centos.org/job/libvirt-go-check/systems=libvirt-fedora-29/ws/> [libvirt-go] $ /bin/sh -xe /tmp/jenkins9069905019049980328.sh + export 'TEST_ARGS=-tags api' + TEST_ARGS='-tags api' + go test -tags api Missing enum 'VIR_DOMAIN_MEMORY_STAT_HUGETLB_PGALLOC' Missing enum 'VIR_DOMAIN_MEMORY_STAT_HUGETLB_PGFAIL' --- FAIL: TestAPICoverage (1.08s) panic: Missing symbols found [recovered] panic: Missing symbols found goroutine 5 [running]: testing.tRunner.func1(0xc0000a8100) /usr/lib/golang/src/testing/testing.go:792 +0x387 panic(0x5ccaa0, 0x639ca0) /usr/lib/golang/src/runtime/panic.go:513 +0x1b9 _<https://ci.centos.org/job/libvirt-go-check/systems=libvirt-fedora-29/ws/.Te…> <https://ci.centos.org/job/libvirt-go-check/systems=libvirt-fedora-29/ws/api…>:501 +0x554 testing.tRunner(0xc0000a8100, 0x61b108) /usr/lib/golang/src/testing/testing.go:827 +0xbf created by testing.(*T).Run /usr/lib/golang/src/testing/testing.go:878 +0x35c exit status 2 FAIL _<https://ci.centos.org/job/libvirt-go-check/systems=libvirt-fedora-29/ws/> 1.425s Build step 'Execute shell' marked build as failure
1 4
0 0
[Libvirt-ci] Build failed in Jenkins: libvirt-go-check » libvirt-freebsd-11 #439
by ci@centos.org 22 May '19

22 May '19
See <https://ci.centos.org/job/libvirt-go-check/systems=libvirt-freebsd-11/439/d…> ------------------------------------------ Started by upstream project "libvirt-go-check" build number 439 originally caused by: Started by upstream project "libvirt-go-build" build number 445 originally caused by: Started by upstream project "libvirt-build" build number 539 originally caused by: Started by an SCM change [EnvInject] - Loading node environment variables. Building remotely on libvirt-freebsd-11 (libvirt) in workspace <https://ci.centos.org/job/libvirt-go-check/systems=libvirt-freebsd-11/ws/> [libvirt-go] $ /bin/sh -xe /tmp/jenkins368479545000987993.sh + export 'TEST_ARGS=-tags api' + go test -tags api Missing enum 'VIR_DOMAIN_MEMORY_STAT_HUGETLB_PGALLOC' Missing enum 'VIR_DOMAIN_MEMORY_STAT_HUGETLB_PGFAIL' --- FAIL: TestAPICoverage (0.80s) panic: Missing symbols found [recovered] panic: Missing symbols found goroutine 19 [running]: testing.tRunner.func1(0xc0000c8100) /usr/local/go/src/testing/testing.go:830 +0x392 panic(0x5d0a40, 0x645e00) /usr/local/go/src/runtime/panic.go:522 +0x1b5 _/usr<https://ci.centos.org/job/libvirt-go-check/systems=libvirt-freebsd-11/ws/.T…> /usr<https://ci.centos.org/job/libvirt-go-check/systems=libvirt-freebsd-11/ws/ap…>:501 +0x551 testing.tRunner(0xc0000c8100, 0x620498) /usr/local/go/src/testing/testing.go:865 +0xc0 created by testing.(*T).Run /usr/local/go/src/testing/testing.go:916 +0x35a exit status 2 FAIL _/usr<https://ci.centos.org/job/libvirt-go-check/systems=libvirt-freebsd-11/ws/> 1.117s Build step 'Execute shell' marked build as failure
1 4
0 0
[Libvirt-ci] Build failed in Jenkins: libvirt-go-check » libvirt-freebsd-12 #439
by ci@centos.org 22 May '19

22 May '19
See <https://ci.centos.org/job/libvirt-go-check/systems=libvirt-freebsd-12/439/d…> ------------------------------------------ Started by upstream project "libvirt-go-check" build number 439 originally caused by: Started by upstream project "libvirt-go-build" build number 445 originally caused by: Started by upstream project "libvirt-build" build number 539 originally caused by: Started by an SCM change [EnvInject] - Loading node environment variables. Building remotely on libvirt-freebsd-12 (libvirt) in workspace <https://ci.centos.org/job/libvirt-go-check/systems=libvirt-freebsd-12/ws/> [libvirt-go] $ /bin/sh -xe /tmp/jenkins8090437601618086868.sh + export 'TEST_ARGS=-tags api' + go test -tags api Missing enum 'VIR_DOMAIN_MEMORY_STAT_HUGETLB_PGALLOC' Missing enum 'VIR_DOMAIN_MEMORY_STAT_HUGETLB_PGFAIL' --- FAIL: TestAPICoverage (0.39s) panic: Missing symbols found [recovered] panic: Missing symbols found goroutine 4 [running]: testing.tRunner.func1(0xc0000b2100) /usr/local/go/src/testing/testing.go:830 +0x392 panic(0x2234e0, 0x2988a0) /usr/local/go/src/runtime/panic.go:522 +0x1b5 _/usr<https://ci.centos.org/job/libvirt-go-check/systems=libvirt-freebsd-12/ws/.T…> /usr<https://ci.centos.org/job/libvirt-go-check/systems=libvirt-freebsd-12/ws/ap…>:501 +0x551 testing.tRunner(0xc0000b2100, 0x272f38) /usr/local/go/src/testing/testing.go:865 +0xc0 created by testing.(*T).Run /usr/local/go/src/testing/testing.go:916 +0x35a exit status 2 FAIL _/usr<https://ci.centos.org/job/libvirt-go-check/systems=libvirt-freebsd-12/ws/> 0.493s Build step 'Execute shell' marked build as failure
1 4
0 0
[Libvirt-ci] Build failed in Jenkins: libvirt-go-check » libvirt-debian-9 #439
by ci@centos.org 22 May '19

22 May '19
See <https://ci.centos.org/job/libvirt-go-check/systems=libvirt-debian-9/439/dis…> ------------------------------------------ Started by upstream project "libvirt-go-check" build number 439 originally caused by: Started by upstream project "libvirt-go-build" build number 445 originally caused by: Started by upstream project "libvirt-build" build number 539 originally caused by: Started by an SCM change [EnvInject] - Loading node environment variables. Building remotely on libvirt-debian-9 (libvirt) in workspace <https://ci.centos.org/job/libvirt-go-check/systems=libvirt-debian-9/ws/> [libvirt-go] $ /bin/sh -xe /tmp/jenkins447660711395640918.sh + export TEST_ARGS=-tags api + go test -tags api Missing enum 'VIR_DOMAIN_MEMORY_STAT_HUGETLB_PGALLOC' Missing enum 'VIR_DOMAIN_MEMORY_STAT_HUGETLB_PGFAIL' --- FAIL: TestAPICoverage (0.33s) panic: Missing symbols found [recovered] panic: Missing symbols found goroutine 5 [running]: panic(0x55e869e531c0, 0xc4200b08a0) /usr/lib/go-1.7/src/runtime/panic.go:500 +0x1a1 testing.tRunner.func1(0xc420078180) /usr/lib/go-1.7/src/testing/testing.go:579 +0x25d panic(0x55e869e531c0, 0xc4200b08a0) /usr/lib/go-1.7/src/runtime/panic.go:458 +0x243 _<https://ci.centos.org/job/libvirt-go-check/systems=libvirt-debian-9/ws/.Tes…> <https://ci.centos.org/job/libvirt-go-check/systems=libvirt-debian-9/ws/api_…>:501 +0x5ff testing.tRunner(0xc420078180, 0x55e869ea6908) /usr/lib/go-1.7/src/testing/testing.go:610 +0x81 created by testing.(*T).Run /usr/lib/go-1.7/src/testing/testing.go:646 +0x2ec exit status 2 FAIL _<https://ci.centos.org/job/libvirt-go-check/systems=libvirt-debian-9/ws/> 0.400s Build step 'Execute shell' marked build as failure
1 4
0 0
[Libvirt-ci] Build failed in Jenkins: libvirt-perl-check » libvirt-fedora-30 #447
by ci@centos.org 22 May '19

22 May '19
See <https://ci.centos.org/job/libvirt-perl-check/systems=libvirt-fedora-30/447/…> ------------------------------------------ Started by upstream project "libvirt-perl-check" build number 447 originally caused by: Started by upstream project "libvirt-perl-build" build number 448 originally caused by: Started by upstream project "libvirt-build" build number 539 originally caused by: Started by an SCM change [EnvInject] - Loading node environment variables. Building remotely on libvirt-fedora-30 (libvirt) in workspace <https://ci.centos.org/job/libvirt-perl-check/systems=libvirt-fedora-30/ws/> [libvirt-perl] $ /bin/sh -xe /tmp/jenkins5614302569334136496.sh + export TEST_MAINTAINER=1 + TEST_MAINTAINER=1 + perl Build test t/005-pod.t ............ ok t/010-pod-coverage.t ... ok t/015-changes.t ........ ok t/020-constants.t ...... ok # Failed test 'VIR_DOMAIN_MEMORY_STAT_HUGETLB_PGALLOC' # at t/030-api-coverage.t line 175. # Failed test 'VIR_DOMAIN_MEMORY_STAT_HUGETLB_PGFAIL' # at t/030-api-coverage.t line 175. # Looks like you failed 2 tests of 1662. t/030-api-coverage.t ... Dubious, test returned 2 (wstat 512, 0x200) Failed 2/1662 subtests t/100-connect.t ........ ok t/200-domains.t ........ ok t/300-networks.t ....... ok t/400-storage-pools.t .. ok t/500-storage-vols.t ... ok t/600-interfaces.t ..... ok t/800-events.t ......... ok Test Summary Report ------------------- t/030-api-coverage.t (Wstat: 512 Tests: 1662 Failed: 2) Failed tests: 849-850 Non-zero exit status: 2 Files=12, Tests=1916, 21 wallclock secs ( 0.41 usr 0.05 sys + 8.38 cusr 0.71 csys = 9.55 CPU) Result: FAIL Failed 1/12 test programs. 2/1916 subtests failed. Build step 'Execute shell' marked build as failure
1 4
0 0
[Libvirt-ci] Build failed in Jenkins: libvirt-perl-check » libvirt-fedora-29 #447
by ci@centos.org 22 May '19

22 May '19
See <https://ci.centos.org/job/libvirt-perl-check/systems=libvirt-fedora-29/447/…> ------------------------------------------ Started by upstream project "libvirt-perl-check" build number 447 originally caused by: Started by upstream project "libvirt-perl-build" build number 448 originally caused by: Started by upstream project "libvirt-build" build number 539 originally caused by: Started by an SCM change [EnvInject] - Loading node environment variables. Building remotely on libvirt-fedora-29 (libvirt) in workspace <https://ci.centos.org/job/libvirt-perl-check/systems=libvirt-fedora-29/ws/> [libvirt-perl] $ /bin/sh -xe /tmp/jenkins9221178673055030300.sh + export TEST_MAINTAINER=1 + TEST_MAINTAINER=1 + perl Build test t/005-pod.t ............ ok t/010-pod-coverage.t ... ok t/015-changes.t ........ ok t/020-constants.t ...... ok # Failed test 'VIR_DOMAIN_MEMORY_STAT_HUGETLB_PGALLOC' # at t/030-api-coverage.t line 175. # Failed test 'VIR_DOMAIN_MEMORY_STAT_HUGETLB_PGFAIL' # at t/030-api-coverage.t line 175. # Looks like you failed 2 tests of 1662. t/030-api-coverage.t ... Dubious, test returned 2 (wstat 512, 0x200) Failed 2/1662 subtests t/100-connect.t ........ ok t/200-domains.t ........ ok t/300-networks.t ....... ok t/400-storage-pools.t .. ok t/500-storage-vols.t ... ok t/600-interfaces.t ..... ok t/800-events.t ......... ok Test Summary Report ------------------- t/030-api-coverage.t (Wstat: 512 Tests: 1662 Failed: 2) Failed tests: 849-850 Non-zero exit status: 2 Files=12, Tests=1916, 11 wallclock secs ( 0.45 usr 0.07 sys + 8.08 cusr 0.53 csys = 9.13 CPU) Result: FAIL Failed 1/12 test programs. 2/1916 subtests failed. Build step 'Execute shell' marked build as failure
1 4
0 0
[Libvirt-ci] Build failed in Jenkins: libvirt-perl-check » libvirt-centos-7 #447
by ci@centos.org 22 May '19

22 May '19
See <https://ci.centos.org/job/libvirt-perl-check/systems=libvirt-centos-7/447/d…> ------------------------------------------ Started by upstream project "libvirt-perl-check" build number 447 originally caused by: Started by upstream project "libvirt-perl-build" build number 448 originally caused by: Started by upstream project "libvirt-build" build number 539 originally caused by: Started by an SCM change [EnvInject] - Loading node environment variables. Building remotely on libvirt-centos-7 (libvirt) in workspace <https://ci.centos.org/job/libvirt-perl-check/systems=libvirt-centos-7/ws/> [libvirt-perl] $ /bin/sh -xe /tmp/jenkins342296102092352428.sh + export TEST_MAINTAINER=1 + TEST_MAINTAINER=1 + perl Build test t/005-pod.t ............ ok t/010-pod-coverage.t ... ok t/015-changes.t ........ ok t/020-constants.t ...... ok # Failed test 'VIR_DOMAIN_MEMORY_STAT_HUGETLB_PGALLOC' # at t/030-api-coverage.t line 175. # Failed test 'VIR_DOMAIN_MEMORY_STAT_HUGETLB_PGFAIL' # at t/030-api-coverage.t line 175. # Looks like you failed 2 tests of 1662. t/030-api-coverage.t ... Dubious, test returned 2 (wstat 512, 0x200) Failed 2/1662 subtests t/100-connect.t ........ ok t/200-domains.t ........ ok t/300-networks.t ....... ok t/400-storage-pools.t .. ok t/500-storage-vols.t ... ok t/600-interfaces.t ..... ok t/800-events.t ......... ok Test Summary Report ------------------- t/030-api-coverage.t (Wstat: 512 Tests: 1662 Failed: 2) Failed tests: 849-850 Non-zero exit status: 2 Files=12, Tests=1916, 12 wallclock secs ( 0.61 usr 0.19 sys + 8.54 cusr 0.51 csys = 9.85 CPU) Result: FAIL Failed 1/12 test programs. 2/1916 subtests failed. Build step 'Execute shell' marked build as failure
1 4
0 0
[Libvirt-ci] Build failed in Jenkins: libvirt-perl-check » libvirt-freebsd-11 #447
by ci@centos.org 22 May '19

22 May '19
See <https://ci.centos.org/job/libvirt-perl-check/systems=libvirt-freebsd-11/447…> ------------------------------------------ Started by upstream project "libvirt-perl-check" build number 447 originally caused by: Started by upstream project "libvirt-perl-build" build number 448 originally caused by: Started by upstream project "libvirt-build" build number 539 originally caused by: Started by an SCM change [EnvInject] - Loading node environment variables. Building remotely on libvirt-freebsd-11 (libvirt) in workspace <https://ci.centos.org/job/libvirt-perl-check/systems=libvirt-freebsd-11/ws/> [libvirt-perl] $ /bin/sh -xe /tmp/jenkins1947918580845483939.sh + export 'TEST_MAINTAINER=1' + perl Build test t/005-pod.t ............ ok t/010-pod-coverage.t ... ok t/015-changes.t ........ ok t/020-constants.t ...... ok # Failed test 'VIR_DOMAIN_MEMORY_STAT_HUGETLB_PGALLOC' # at t/030-api-coverage.t line 175. # Failed test 'VIR_DOMAIN_MEMORY_STAT_HUGETLB_PGFAIL' # at t/030-api-coverage.t line 175. # Looks like you failed 2 tests of 1662. t/030-api-coverage.t ... Dubious, test returned 2 (wstat 512, 0x200) Failed 2/1662 subtests t/100-connect.t ........ ok t/200-domains.t ........ ok t/300-networks.t ....... ok t/400-storage-pools.t .. ok t/500-storage-vols.t ... ok t/600-interfaces.t ..... ok t/800-events.t ......... ok Test Summary Report ------------------- t/030-api-coverage.t (Wstat: 512 Tests: 1662 Failed: 2) Failed tests: 849-850 Non-zero exit status: 2 Files=12, Tests=1916, 14 wallclock secs ( 0.41 usr 0.22 sys + 11.46 cusr 1.16 csys = 13.24 CPU) Result: FAIL Failed 1/12 test programs. 2/1916 subtests failed. Build step 'Execute shell' marked build as failure
1 4
0 0
[Libvirt-ci] Build failed in Jenkins: libvirt-perl-check » libvirt-freebsd-12 #447
by ci@centos.org 22 May '19

22 May '19
See <https://ci.centos.org/job/libvirt-perl-check/systems=libvirt-freebsd-12/447…> ------------------------------------------ Started by upstream project "libvirt-perl-check" build number 447 originally caused by: Started by upstream project "libvirt-perl-build" build number 448 originally caused by: Started by upstream project "libvirt-build" build number 539 originally caused by: Started by an SCM change [EnvInject] - Loading node environment variables. Building remotely on libvirt-freebsd-12 (libvirt) in workspace <https://ci.centos.org/job/libvirt-perl-check/systems=libvirt-freebsd-12/ws/> [libvirt-perl] $ /bin/sh -xe /tmp/jenkins5775683580139423272.sh + export 'TEST_MAINTAINER=1' + perl Build test t/005-pod.t ............ ok t/010-pod-coverage.t ... ok t/015-changes.t ........ ok t/020-constants.t ...... ok # Failed test 'VIR_DOMAIN_MEMORY_STAT_HUGETLB_PGALLOC' # at t/030-api-coverage.t line 175. # Failed test 'VIR_DOMAIN_MEMORY_STAT_HUGETLB_PGFAIL' # at t/030-api-coverage.t line 175. # Looks like you failed 2 tests of 1662. t/030-api-coverage.t ... Dubious, test returned 2 (wstat 512, 0x200) Failed 2/1662 subtests t/100-connect.t ........ ok t/200-domains.t ........ ok t/300-networks.t ....... ok t/400-storage-pools.t .. ok t/500-storage-vols.t ... ok t/600-interfaces.t ..... ok t/800-events.t ......... ok Test Summary Report ------------------- t/030-api-coverage.t (Wstat: 512 Tests: 1662 Failed: 2) Failed tests: 849-850 Non-zero exit status: 2 Files=12, Tests=1916, 13 wallclock secs ( 0.56 usr 0.13 sys + 10.80 cusr 1.05 csys = 12.55 CPU) Result: FAIL Failed 1/12 test programs. 2/1916 subtests failed. Build step 'Execute shell' marked build as failure
1 4
0 0
[Libvirt-ci] Build failed in Jenkins: libvirt-perl-check » libvirt-debian-9 #447
by ci@centos.org 22 May '19

22 May '19
See <https://ci.centos.org/job/libvirt-perl-check/systems=libvirt-debian-9/447/d…> ------------------------------------------ Started by upstream project "libvirt-perl-check" build number 447 originally caused by: Started by upstream project "libvirt-perl-build" build number 448 originally caused by: Started by upstream project "libvirt-build" build number 539 originally caused by: Started by an SCM change [EnvInject] - Loading node environment variables. Building remotely on libvirt-debian-9 (libvirt) in workspace <https://ci.centos.org/job/libvirt-perl-check/systems=libvirt-debian-9/ws/> [libvirt-perl] $ /bin/sh -xe /tmp/jenkins1107049373933820627.sh + export TEST_MAINTAINER=1 + perl Build test t/005-pod.t ............ ok t/010-pod-coverage.t ... ok t/015-changes.t ........ ok t/020-constants.t ...... ok # Failed test 'VIR_DOMAIN_MEMORY_STAT_HUGETLB_PGALLOC' # at t/030-api-coverage.t line 175. # Failed test 'VIR_DOMAIN_MEMORY_STAT_HUGETLB_PGFAIL' # at t/030-api-coverage.t line 175. # Looks like you failed 2 tests of 1662. t/030-api-coverage.t ... Dubious, test returned 2 (wstat 512, 0x200) Failed 2/1662 subtests t/100-connect.t ........ ok t/200-domains.t ........ ok t/300-networks.t ....... ok t/400-storage-pools.t .. ok t/500-storage-vols.t ... ok t/600-interfaces.t ..... ok t/800-events.t ......... ok Test Summary Report ------------------- t/030-api-coverage.t (Wstat: 512 Tests: 1662 Failed: 2) Failed tests: 849-850 Non-zero exit status: 2 Files=12, Tests=1916, 10 wallclock secs ( 0.49 usr 1.02 sys + 8.84 cusr 1.18 csys = 11.53 CPU) Result: FAIL Failed 1/12 test programs. 2/1916 subtests failed. Build step 'Execute shell' marked build as failure
1 4
0 0
  • ← Newer
  • 1
  • 2
  • 3
  • 4
  • Older →

HyperKitty Powered by HyperKitty version 1.3.12.