libvirt List Archives
Sign In Sign Up
Manage this list Sign In Sign Up

Keyboard Shortcuts

Thread View

  • j: Next unread message
  • k: Previous unread message
  • j a: Jump to all threads
  • j l: Jump to MailingList overview

CI

Thread Start a new thread
Download
Threads by month
  • ----- 2025 -----
  • August
  • July
  • June
  • May
  • April
  • March
  • February
  • January
  • ----- 2024 -----
  • December
  • November
  • October
  • September
  • August
  • July
  • June
  • May
  • April
  • March
  • February
  • January
  • ----- 2023 -----
  • December
  • November
  • October
  • September
  • August
  • July
  • June
  • May
  • April
  • March
  • February
  • January
  • ----- 2022 -----
  • December
  • November
  • October
  • September
  • August
  • July
  • June
  • May
  • April
  • March
  • February
  • January
  • ----- 2021 -----
  • December
  • November
  • October
  • September
  • August
  • July
  • June
  • May
  • April
  • March
  • February
  • January
  • ----- 2020 -----
  • December
  • November
  • October
  • September
  • August
  • July
  • June
  • May
  • April
  • March
  • February
  • January
  • ----- 2019 -----
  • December
  • November
  • October
  • September
  • August
  • July
  • June
  • May
  • April
  • March
  • February
  • January
  • ----- 2018 -----
  • December
  • November
  • October
  • September
  • August
  • July
  • June
  • May
  • April
  • March
  • February
  • January
  • ----- 2017 -----
  • December
  • November
  • October
  • September
  • August
  • July
  • June
  • May
  • April
  • March
  • February
  • January
  • ----- 2016 -----
  • December
  • November
  • October
  • September
  • August
  • July
ci@lists.libvirt.org

March 2019

  • 2 participants
  • 151 discussions
[Libvirt-ci] Build failed in Jenkins: libvirt-perl-check » libvirt-debian-9 #335
by ci@centos.org 29 Mar '19

29 Mar '19
See <https://ci.centos.org/job/libvirt-perl-check/systems=libvirt-debian-9/335/d…> ------------------------------------------ Started by upstream project "libvirt-perl-check" build number 335 originally caused by: Started by upstream project "libvirt-perl-build" build number 336 originally caused by: Started by upstream project "libvirt-build" build number 424 originally caused by: Started by an SCM change Started by an SCM change Started by an SCM change Started by an SCM change Started by an SCM change Started by an SCM change Started by an SCM change Started by an SCM change Started by an SCM change [EnvInject] - Loading node environment variables. Building remotely on libvirt-debian-9 (libvirt) in workspace <https://ci.centos.org/job/libvirt-perl-check/systems=libvirt-debian-9/ws/> [libvirt-perl] $ /bin/sh -xe /tmp/jenkins3048035717823995149.sh + export TEST_MAINTAINER=1 + perl Build test t/005-pod.t ............ ok t/010-pod-coverage.t ... ok t/015-changes.t ........ ok t/020-constants.t ...... ok # Failed test 'VIR_ERR_INVALID_DOMAIN_CHECKPOINT' # at t/030-api-coverage.t line 175. # Failed test 'VIR_ERR_NO_DOMAIN_BACKUP' # at t/030-api-coverage.t line 175. # Failed test 'VIR_ERR_NO_DOMAIN_CHECKPOINT' # at t/030-api-coverage.t line 175. # Failed test 'VIR_FROM_DOMAIN_CHECKPOINT' # at t/030-api-coverage.t line 175. # Looks like you failed 4 tests of 1658. t/030-api-coverage.t ... Dubious, test returned 4 (wstat 1024, 0x400) Failed 4/1658 subtests t/100-connect.t ........ ok t/200-domains.t ........ ok t/300-networks.t ....... ok t/400-storage-pools.t .. ok t/500-storage-vols.t ... ok t/600-interfaces.t ..... ok t/800-events.t ......... ok Test Summary Report ------------------- t/030-api-coverage.t (Wstat: 1024 Tests: 1658 Failed: 4) Failed tests: 1103, 1126-1127, 1198 Non-zero exit status: 4 Files=12, Tests=1912, 17 wallclock secs ( 0.46 usr 0.05 sys + 8.07 cusr 0.41 csys = 8.99 CPU) Result: FAIL Failed 1/12 test programs. 4/1912 subtests failed. Build step 'Execute shell' marked build as failure
1 8
0 0
[Libvirt-ci] Build failed in Jenkins: libvirt-dbus-check » libvirt-fedora-rawhide #285
by ci@centos.org 28 Mar '19

28 Mar '19
See <https://ci.centos.org/job/libvirt-dbus-check/systems=libvirt-fedora-rawhide…> ------------------------------------------ Started by upstream project "libvirt-dbus-check" build number 285 originally caused by: Started by upstream project "libvirt-dbus-syntax-check" build number 328 originally caused by: Started by upstream project "libvirt-dbus-build" build number 335 originally caused by: Started by upstream project "libvirt-glib-build" build number 332 originally caused by: Started by upstream project "libvirt-build" build number 430 originally caused by: Started by an SCM change [EnvInject] - Loading node environment variables. Building remotely on libvirt-fedora-rawhide (libvirt) in workspace <https://ci.centos.org/job/libvirt-dbus-check/systems=libvirt-fedora-rawhide…> [libvirt-dbus] $ /bin/sh -xe /tmp/jenkins1834107949048535677.sh + cd build + /usr/bin/gmake check Making check in data gmake[1]: Entering directory '<https://ci.centos.org/job/libvirt-dbus-check/systems=libvirt-fedora-rawhide…'> gmake[1]: Nothing to be done for 'check'. gmake[1]: Leaving directory '<https://ci.centos.org/job/libvirt-dbus-check/systems=libvirt-fedora-rawhide…'> Making check in docs gmake[1]: Entering directory '<https://ci.centos.org/job/libvirt-dbus-check/systems=libvirt-fedora-rawhide…'> gmake[1]: Nothing to be done for 'check'. gmake[1]: Leaving directory '<https://ci.centos.org/job/libvirt-dbus-check/systems=libvirt-fedora-rawhide…'> Making check in src gmake[1]: Entering directory '<https://ci.centos.org/job/libvirt-dbus-check/systems=libvirt-fedora-rawhide…'> gmake[1]: Nothing to be done for 'check'. gmake[1]: Leaving directory '<https://ci.centos.org/job/libvirt-dbus-check/systems=libvirt-fedora-rawhide…'> Making check in tests gmake[1]: Entering directory '<https://ci.centos.org/job/libvirt-dbus-check/systems=libvirt-fedora-rawhide…'> /usr/bin/gmake test_util gmake[2]: Entering directory '<https://ci.centos.org/job/libvirt-dbus-check/systems=libvirt-fedora-rawhide…'> CC test_util-test_util.o CCLD test_util gmake[2]: Leaving directory '<https://ci.centos.org/job/libvirt-dbus-check/systems=libvirt-fedora-rawhide…'> /usr/bin/gmake check-TESTS gmake[2]: Entering directory '<https://ci.centos.org/job/libvirt-dbus-check/systems=libvirt-fedora-rawhide…'> gmake[3]: Entering directory '<https://ci.centos.org/job/libvirt-dbus-check/systems=libvirt-fedora-rawhide…'> PASS: test_util PASS: test_interface.py FAIL: test_domain.py PASS: test_network.py PASS: test_nodedev.py PASS: test_connect.py PASS: test_storage.py ============================================================================ Testsuite summary for libvirt-dbus 1.4.0 ============================================================================ # TOTAL: 7 # PASS: 6 # SKIP: 0 # XFAIL: 0 # FAIL: 1 # XPASS: 0 # ERROR: 0 ============================================================================ See tests/test-suite.log Please report to libvir-list(a)redhat.com ============================================================================ gmake[3]: *** [Makefile:766: test-suite.log] Error 1 gmake[3]: Leaving directory '<https://ci.centos.org/job/libvirt-dbus-check/systems=libvirt-fedora-rawhide…'> gmake[2]: *** [Makefile:874: check-TESTS] Error 2 gmake[2]: Leaving directory '<https://ci.centos.org/job/libvirt-dbus-check/systems=libvirt-fedora-rawhide…'> gmake[1]: *** [Makefile:990: check-am] Error 2 gmake[1]: Leaving directory '<https://ci.centos.org/job/libvirt-dbus-check/systems=libvirt-fedora-rawhide…'> gmake: *** [Makefile:460: check-recursive] Error 1 + cat tests/test-suite.log ============================================== libvirt-dbus 1.4.0: tests/test-suite.log ============================================== # TOTAL: 7 # PASS: 6 # SKIP: 0 # XFAIL: 0 # FAIL: 1 # XPASS: 0 # ERROR: 0 .. contents:: :depth: 2 FAIL: test_domain.py ==================== ============================= test session starts ============================== platform linux -- Python 3.7.2, pytest-3.9.3, py-1.7.0, pluggy-0.8.1 rootdir: <https://ci.centos.org/job/libvirt-dbus-check/systems=libvirt-fedora-rawhide…,> inifile: collected 10 items ../../tests/test_domain.py ........E. [100%] ==================================== ERRORS ==================================== ________________ ERROR at setup of TestDomain.test_domain_vcpus ________________ self = <test_domain.TestDomain object at 0x7f3dc64e0e10> request = <SubRequest 'libvirt_dbus_setup' for <Function 'test_domain_vcpus'>> @pytest.fixture(autouse=True) def libvirt_dbus_setup(self, request): """Start libvirt-dbus for each test function """ os.environ['LIBVIRT_DEBUG'] = '3' self.libvirt_dbus = subprocess.Popen([exe, '--session']) self.bus = dbus.SessionBus() for i in range(10): if self.bus.name_has_owner('org.libvirt'): break time.sleep(0.1) else: > raise TimeoutError('error starting libvirt-dbus') E TimeoutError: error starting libvirt-dbus ../../tests/libvirttest.py:44: TimeoutError ====================== 9 passed, 1 error in 12.81 seconds ====================== FAIL test_domain.py (exit status: 1) + exit 1 Build step 'Execute shell' marked build as failure
1 1
0 0
[Libvirt-ci] Passed: libvirt/libvirt#2167 (v5.2.0-rc1 - 97b729e)
by Travis CI 28 Mar '19

28 Mar '19
Build Update for libvirt/libvirt ------------------------------------- Build: #2167 Status: Passed Duration: 15 mins and 35 secs Commit: 97b729e (v5.2.0-rc1) Author: Michal Privoznik Message: qemuxml2argvtest: Drop dependency between testInfoArgName and virQEMUCapsFlags enums Introduced in fdf6c89ee7b, this dependency looks weird. It was needed because of the way that while() loop was written - it fetches next argument in every iteration. Therefore, our only option was for ARG_END to have the same value as QEMU_CAPS_LAST. This also meant that QEMU_CAPS_* could have been only at the end of the __VA_ARGS__. This commit reworks the while() loop and removes the dependency. Signed-off-by: Michal Privoznik <mprivozn(a)redhat.com> Reviewed-by: Daniel P. Berrangé <berrange(a)redhat.com> View the changeset: https://github.com/libvirt/libvirt/compare/v5.2.0-rc1 View the full build log and details: https://travis-ci.org/libvirt/libvirt/builds/512455045?utm_medium=notificat… -- You can unsubscribe from build emails from the libvirt/libvirt repository going to https://travis-ci.org/account/preferences/unsubscribe?repository=4872032&ut…. Or unsubscribe from *all* email updating your settings at https://travis-ci.org/account/preferences/unsubscribe?utm_medium=notificati…. Or configure specific recipients for build notifications in your .travis.yml file. See https://docs.travis-ci.com/user/notifications.
1 0
0 0
[Libvirt-ci] Build failed in Jenkins: libvirt-go-check » libvirt-fedora-rawhide #329
by ci@centos.org 28 Mar '19

28 Mar '19
See <https://ci.centos.org/job/libvirt-go-check/systems=libvirt-fedora-rawhide/3…> ------------------------------------------ Started by upstream project "libvirt-go-check" build number 329 originally caused by: Started by upstream project "libvirt-go-build" build number 335 originally caused by: Started by upstream project "libvirt-build" build number 424 originally caused by: Started by an SCM change Started by an SCM change Started by an SCM change Started by an SCM change Started by an SCM change Started by an SCM change Started by an SCM change Started by an SCM change Started by an SCM change [EnvInject] - Loading node environment variables. Building remotely on libvirt-fedora-rawhide (libvirt) in workspace <https://ci.centos.org/job/libvirt-go-check/systems=libvirt-fedora-rawhide/w…> [libvirt-go] $ /bin/sh -xe /tmp/jenkins2577785815466182196.sh + export 'TEST_ARGS=-tags api' + TEST_ARGS='-tags api' + go test -tags api Missing enum 'VIR_ERR_INVALID_DOMAIN_CHECKPOINT' Missing enum 'VIR_ERR_NO_DOMAIN_BACKUP' Missing enum 'VIR_ERR_NO_DOMAIN_CHECKPOINT' Missing enum 'VIR_FROM_DOMAIN_CHECKPOINT' --- FAIL: TestAPICoverage (1.64s) panic: Missing symbols found [recovered] panic: Missing symbols found goroutine 19 [running]: testing.tRunner.func1(0xc0000c2100) /usr/lib/golang/src/testing/testing.go:830 +0x392 panic(0x5cf560, 0x644e90) /usr/lib/golang/src/runtime/panic.go:522 +0x1b5 _<https://ci.centos.org/job/libvirt-go-check/systems=libvirt-fedora-rawhide/w…> <https://ci.centos.org/job/libvirt-go-check/systems=libvirt-fedora-rawhide/w…>:501 +0x551 testing.tRunner(0xc0000c2100, 0x61f340) /usr/lib/golang/src/testing/testing.go:865 +0xc0 created by testing.(*T).Run /usr/lib/golang/src/testing/testing.go:916 +0x35a exit status 2 FAIL _<https://ci.centos.org/job/libvirt-go-check/systems=libvirt-fedora-rawhide/w…> 2.212s Build step 'Execute shell' marked build as failure
1 5
0 0
[Libvirt-ci] Build failed in Jenkins: libvirt-go-check » libvirt-fedora-29 #329
by ci@centos.org 28 Mar '19

28 Mar '19
See <https://ci.centos.org/job/libvirt-go-check/systems=libvirt-fedora-29/329/di…> ------------------------------------------ Started by upstream project "libvirt-go-check" build number 329 originally caused by: Started by upstream project "libvirt-go-build" build number 335 originally caused by: Started by upstream project "libvirt-build" build number 424 originally caused by: Started by an SCM change Started by an SCM change Started by an SCM change Started by an SCM change Started by an SCM change Started by an SCM change Started by an SCM change Started by an SCM change Started by an SCM change [EnvInject] - Loading node environment variables. Building remotely on libvirt-fedora-29 (libvirt) in workspace <https://ci.centos.org/job/libvirt-go-check/systems=libvirt-fedora-29/ws/> [libvirt-go] $ /bin/sh -xe /tmp/jenkins4735950556570182377.sh + export 'TEST_ARGS=-tags api' + TEST_ARGS='-tags api' + go test -tags api Missing enum 'VIR_ERR_INVALID_DOMAIN_CHECKPOINT' Missing enum 'VIR_ERR_NO_DOMAIN_BACKUP' Missing enum 'VIR_ERR_NO_DOMAIN_CHECKPOINT' Missing enum 'VIR_FROM_DOMAIN_CHECKPOINT' --- FAIL: TestAPICoverage (0.96s) panic: Missing symbols found [recovered] panic: Missing symbols found goroutine 5 [running]: testing.tRunner.func1(0xc0000a8100) /usr/lib/golang/src/testing/testing.go:792 +0x387 panic(0x5ccaa0, 0x639ca0) /usr/lib/golang/src/runtime/panic.go:513 +0x1b9 _<https://ci.centos.org/job/libvirt-go-check/systems=libvirt-fedora-29/ws/.Te…> <https://ci.centos.org/job/libvirt-go-check/systems=libvirt-fedora-29/ws/api…>:501 +0x554 testing.tRunner(0xc0000a8100, 0x61b108) /usr/lib/golang/src/testing/testing.go:827 +0xbf created by testing.(*T).Run /usr/lib/golang/src/testing/testing.go:878 +0x35c exit status 2 FAIL _<https://ci.centos.org/job/libvirt-go-check/systems=libvirt-fedora-29/ws/> 1.356s Build step 'Execute shell' marked build as failure
1 5
0 0
[Libvirt-ci] Build failed in Jenkins: libvirt-go-check » libvirt-fedora-28 #329
by ci@centos.org 28 Mar '19

28 Mar '19
See <https://ci.centos.org/job/libvirt-go-check/systems=libvirt-fedora-28/329/di…> ------------------------------------------ Started by upstream project "libvirt-go-check" build number 329 originally caused by: Started by upstream project "libvirt-go-build" build number 335 originally caused by: Started by upstream project "libvirt-build" build number 424 originally caused by: Started by an SCM change Started by an SCM change Started by an SCM change Started by an SCM change Started by an SCM change Started by an SCM change Started by an SCM change Started by an SCM change Started by an SCM change [EnvInject] - Loading node environment variables. Building remotely on libvirt-fedora-28 (libvirt) in workspace <https://ci.centos.org/job/libvirt-go-check/systems=libvirt-fedora-28/ws/> [libvirt-go] $ /bin/sh -xe /tmp/jenkins7212606175475836382.sh + export 'TEST_ARGS=-tags api' + TEST_ARGS='-tags api' + go test -tags api Missing enum 'VIR_ERR_INVALID_DOMAIN_CHECKPOINT' Missing enum 'VIR_ERR_NO_DOMAIN_BACKUP' Missing enum 'VIR_ERR_NO_DOMAIN_CHECKPOINT' Missing enum 'VIR_FROM_DOMAIN_CHECKPOINT' --- FAIL: TestAPICoverage (0.44s) panic: Missing symbols found [recovered] panic: Missing symbols found goroutine 5 [running]: testing.tRunner.func1(0xc4200aa0f0) /usr/lib/golang/src/testing/testing.go:742 +0x29d panic(0x5c3d40, 0x627950) /usr/lib/golang/src/runtime/panic.go:502 +0x229 _<https://ci.centos.org/job/libvirt-go-check/systems=libvirt-fedora-28/ws/.Te…> <https://ci.centos.org/job/libvirt-go-check/systems=libvirt-fedora-28/ws/api…>:501 +0x548 testing.tRunner(0xc4200aa0f0, 0x612a08) /usr/lib/golang/src/testing/testing.go:777 +0xd0 created by testing.(*T).Run /usr/lib/golang/src/testing/testing.go:824 +0x2e0 exit status 2 FAIL _<https://ci.centos.org/job/libvirt-go-check/systems=libvirt-fedora-28/ws/> 0.537s Build step 'Execute shell' marked build as failure
1 5
0 0
[Libvirt-ci] Build failed in Jenkins: libvirt-go-check » libvirt-freebsd-11 #329
by ci@centos.org 28 Mar '19

28 Mar '19
See <https://ci.centos.org/job/libvirt-go-check/systems=libvirt-freebsd-11/329/d…> ------------------------------------------ Started by upstream project "libvirt-go-check" build number 329 originally caused by: Started by upstream project "libvirt-go-build" build number 335 originally caused by: Started by upstream project "libvirt-build" build number 424 originally caused by: Started by an SCM change Started by an SCM change Started by an SCM change Started by an SCM change Started by an SCM change Started by an SCM change Started by an SCM change Started by an SCM change Started by an SCM change [EnvInject] - Loading node environment variables. Building remotely on libvirt-freebsd-11 (libvirt) in workspace <https://ci.centos.org/job/libvirt-go-check/systems=libvirt-freebsd-11/ws/> [libvirt-go] $ /bin/sh -xe /tmp/jenkins8823353294860625040.sh + export 'TEST_ARGS=-tags api' + go test -tags api Missing enum 'VIR_ERR_INVALID_DOMAIN_CHECKPOINT' Missing enum 'VIR_ERR_NO_DOMAIN_BACKUP' Missing enum 'VIR_ERR_NO_DOMAIN_CHECKPOINT' Missing enum 'VIR_FROM_DOMAIN_CHECKPOINT' --- FAIL: TestAPICoverage (0.71s) panic: Missing symbols found [recovered] panic: Missing symbols found goroutine 19 [running]: testing.tRunner.func1(0xc0000c8100) /usr/local/go/src/testing/testing.go:830 +0x392 panic(0x5d0a80, 0x645e40) /usr/local/go/src/runtime/panic.go:522 +0x1b5 _/usr<https://ci.centos.org/job/libvirt-go-check/systems=libvirt-freebsd-11/ws/.T…> /usr<https://ci.centos.org/job/libvirt-go-check/systems=libvirt-freebsd-11/ws/ap…>:501 +0x551 testing.tRunner(0xc0000c8100, 0x6204d8) /usr/local/go/src/testing/testing.go:865 +0xc0 created by testing.(*T).Run /usr/local/go/src/testing/testing.go:916 +0x35a exit status 2 FAIL _/usr<https://ci.centos.org/job/libvirt-go-check/systems=libvirt-freebsd-11/ws/> 1.554s Build step 'Execute shell' marked build as failure
1 5
0 0
[Libvirt-ci] Build failed in Jenkins: libvirt-go-check » libvirt-freebsd-12 #329
by ci@centos.org 28 Mar '19

28 Mar '19
See <https://ci.centos.org/job/libvirt-go-check/systems=libvirt-freebsd-12/329/d…> ------------------------------------------ Started by upstream project "libvirt-go-check" build number 329 originally caused by: Started by upstream project "libvirt-go-build" build number 335 originally caused by: Started by upstream project "libvirt-build" build number 424 originally caused by: Started by an SCM change Started by an SCM change Started by an SCM change Started by an SCM change Started by an SCM change Started by an SCM change Started by an SCM change Started by an SCM change Started by an SCM change [EnvInject] - Loading node environment variables. Building remotely on libvirt-freebsd-12 (libvirt) in workspace <https://ci.centos.org/job/libvirt-go-check/systems=libvirt-freebsd-12/ws/> [libvirt-go] $ /bin/sh -xe /tmp/jenkins6692134749603086948.sh + export 'TEST_ARGS=-tags api' + go test -tags api Missing enum 'VIR_ERR_INVALID_DOMAIN_CHECKPOINT' Missing enum 'VIR_ERR_NO_DOMAIN_BACKUP' Missing enum 'VIR_ERR_NO_DOMAIN_CHECKPOINT' Missing enum 'VIR_FROM_DOMAIN_CHECKPOINT' --- FAIL: TestAPICoverage (0.30s) panic: Missing symbols found [recovered] panic: Missing symbols found goroutine 5 [running]: testing.tRunner.func1(0xc0000b4100) /usr/local/go/src/testing/testing.go:830 +0x392 panic(0x2234e0, 0x2988a0) /usr/local/go/src/runtime/panic.go:522 +0x1b5 _/usr<https://ci.centos.org/job/libvirt-go-check/systems=libvirt-freebsd-12/ws/.T…> /usr<https://ci.centos.org/job/libvirt-go-check/systems=libvirt-freebsd-12/ws/ap…>:501 +0x551 testing.tRunner(0xc0000b4100, 0x272f38) /usr/local/go/src/testing/testing.go:865 +0xc0 created by testing.(*T).Run /usr/local/go/src/testing/testing.go:916 +0x35a exit status 2 FAIL _/usr<https://ci.centos.org/job/libvirt-go-check/systems=libvirt-freebsd-12/ws/> 0.461s Build step 'Execute shell' marked build as failure
1 5
0 0
[Libvirt-ci] Build failed in Jenkins: libvirt-go-check » libvirt-debian-9 #329
by ci@centos.org 28 Mar '19

28 Mar '19
See <https://ci.centos.org/job/libvirt-go-check/systems=libvirt-debian-9/329/dis…> ------------------------------------------ Started by upstream project "libvirt-go-check" build number 329 originally caused by: Started by upstream project "libvirt-go-build" build number 335 originally caused by: Started by upstream project "libvirt-build" build number 424 originally caused by: Started by an SCM change Started by an SCM change Started by an SCM change Started by an SCM change Started by an SCM change Started by an SCM change Started by an SCM change Started by an SCM change Started by an SCM change [EnvInject] - Loading node environment variables. Building remotely on libvirt-debian-9 (libvirt) in workspace <https://ci.centos.org/job/libvirt-go-check/systems=libvirt-debian-9/ws/> [libvirt-go] $ /bin/sh -xe /tmp/jenkins5715722844702116400.sh + export TEST_ARGS=-tags api + go test -tags api Missing enum 'VIR_ERR_INVALID_DOMAIN_CHECKPOINT' Missing enum 'VIR_ERR_NO_DOMAIN_BACKUP' Missing enum 'VIR_ERR_NO_DOMAIN_CHECKPOINT' Missing enum 'VIR_FROM_DOMAIN_CHECKPOINT' --- FAIL: TestAPICoverage (0.51s) panic: Missing symbols found [recovered] panic: Missing symbols found goroutine 19 [running]: panic(0x5650115a51c0, 0xc420432590) /usr/lib/go-1.7/src/runtime/panic.go:500 +0x1a1 testing.tRunner.func1(0xc420086180) /usr/lib/go-1.7/src/testing/testing.go:579 +0x25d panic(0x5650115a51c0, 0xc420432590) /usr/lib/go-1.7/src/runtime/panic.go:458 +0x243 _<https://ci.centos.org/job/libvirt-go-check/systems=libvirt-debian-9/ws/.Tes…> <https://ci.centos.org/job/libvirt-go-check/systems=libvirt-debian-9/ws/api_…>:501 +0x5ff testing.tRunner(0xc420086180, 0x5650115f8908) /usr/lib/go-1.7/src/testing/testing.go:610 +0x81 created by testing.(*T).Run /usr/lib/go-1.7/src/testing/testing.go:646 +0x2ec exit status 2 FAIL _<https://ci.centos.org/job/libvirt-go-check/systems=libvirt-debian-9/ws/> 0.614s Build step 'Execute shell' marked build as failure
1 5
0 0
[Libvirt-ci] Build failed in Jenkins: libvirt-go-check » libvirt-debian-8 #329
by ci@centos.org 28 Mar '19

28 Mar '19
See <https://ci.centos.org/job/libvirt-go-check/systems=libvirt-debian-8/329/dis…> ------------------------------------------ Started by upstream project "libvirt-go-check" build number 329 originally caused by: Started by upstream project "libvirt-go-build" build number 335 originally caused by: Started by upstream project "libvirt-build" build number 424 originally caused by: Started by an SCM change Started by an SCM change Started by an SCM change Started by an SCM change Started by an SCM change Started by an SCM change Started by an SCM change Started by an SCM change Started by an SCM change [EnvInject] - Loading node environment variables. Building remotely on libvirt-debian-8 (libvirt) in workspace <https://ci.centos.org/job/libvirt-go-check/systems=libvirt-debian-8/ws/> [libvirt-go] $ /bin/sh -xe /tmp/jenkins398226395183621374.sh + export TEST_ARGS=-tags api + go test -tags api Missing enum 'VIR_ERR_INVALID_DOMAIN_CHECKPOINT' Missing enum 'VIR_ERR_NO_DOMAIN_BACKUP' Missing enum 'VIR_ERR_NO_DOMAIN_CHECKPOINT' Missing enum 'VIR_FROM_DOMAIN_CHECKPOINT' --- FAIL: TestAPICoverage (0.55s) panic: Missing symbols found [recovered] panic: Missing symbols found goroutine 5 [running]: panic(0x5b5860, 0xc4204306f0) /usr/lib/go-1.7/src/runtime/panic.go:500 +0x1a1 testing.tRunner.func1(0xc420078180) /usr/lib/go-1.7/src/testing/testing.go:579 +0x25d panic(0x5b5860, 0xc4204306f0) /usr/lib/go-1.7/src/runtime/panic.go:458 +0x243 _<https://ci.centos.org/job/libvirt-go-check/systems=libvirt-debian-8/ws/.Tes…> <https://ci.centos.org/job/libvirt-go-check/systems=libvirt-debian-8/ws/api_…>:501 +0x5ff testing.tRunner(0xc420078180, 0x608fa8) /usr/lib/go-1.7/src/testing/testing.go:610 +0x81 created by testing.(*T).Run /usr/lib/go-1.7/src/testing/testing.go:646 +0x2ec exit status 2 FAIL _<https://ci.centos.org/job/libvirt-go-check/systems=libvirt-debian-8/ws/> 0.725s Build step 'Execute shell' marked build as failure
1 5
0 0
  • ← Newer
  • 1
  • 2
  • 3
  • 4
  • 5
  • ...
  • 16
  • Older →

HyperKitty Powered by HyperKitty version 1.3.12.