libvirt List Archives
Sign In Sign Up
Manage this list Sign In Sign Up

Keyboard Shortcuts

Thread View

  • j: Next unread message
  • k: Previous unread message
  • j a: Jump to all threads
  • j l: Jump to MailingList overview

CI

Thread Start a new thread
Download
Threads by month
  • ----- 2025 -----
  • August
  • July
  • June
  • May
  • April
  • March
  • February
  • January
  • ----- 2024 -----
  • December
  • November
  • October
  • September
  • August
  • July
  • June
  • May
  • April
  • March
  • February
  • January
  • ----- 2023 -----
  • December
  • November
  • October
  • September
  • August
  • July
  • June
  • May
  • April
  • March
  • February
  • January
  • ----- 2022 -----
  • December
  • November
  • October
  • September
  • August
  • July
  • June
  • May
  • April
  • March
  • February
  • January
  • ----- 2021 -----
  • December
  • November
  • October
  • September
  • August
  • July
  • June
  • May
  • April
  • March
  • February
  • January
  • ----- 2020 -----
  • December
  • November
  • October
  • September
  • August
  • July
  • June
  • May
  • April
  • March
  • February
  • January
  • ----- 2019 -----
  • December
  • November
  • October
  • September
  • August
  • July
  • June
  • May
  • April
  • March
  • February
  • January
  • ----- 2018 -----
  • December
  • November
  • October
  • September
  • August
  • July
  • June
  • May
  • April
  • March
  • February
  • January
  • ----- 2017 -----
  • December
  • November
  • October
  • September
  • August
  • July
  • June
  • May
  • April
  • March
  • February
  • January
  • ----- 2016 -----
  • December
  • November
  • October
  • September
  • August
  • July
ci@lists.libvirt.org

February 2019

  • 2 participants
  • 132 discussions
[Libvirt-ci] Broken: libvirt/libvirt#2014 (master - 5657e22)
by Travis CI 14 Feb '19

14 Feb '19
Build Update for libvirt/libvirt ------------------------------------- Build: #2014 Status: Broken Duration: 21 mins and 30 secs Commit: 5657e22 (master) Author: Michal Privoznik Message: qemu_hotplug: Assume chardev alias always exists in qemuDomainDetachChrDevice The @tmpChr is looked up in domain definition based on user provided chardev XML. Therefore, the alias must have been allocated already when domain was started up. Signed-off-by: Michal Privoznik <mprivozn(a)redhat.com> Reviewed-by: John Ferlan <jferlan(a)redhat.com> View the changeset: https://github.com/libvirt/libvirt/compare/17ddfd420a0d...5657e22212c5 View the full build log and details: https://travis-ci.org/libvirt/libvirt/builds/493226157?utm_medium=notificat… -- You can unsubscribe from build emails from the libvirt/libvirt repository going to https://travis-ci.org/account/preferences/unsubscribe?repository=4872032&ut…. Or unsubscribe from *all* email updating your settings at https://travis-ci.org/account/preferences/unsubscribe?utm_medium=notificati…. Or configure specific recipients for build notifications in your .travis.yml file. See https://docs.travis-ci.com/user/notifications.
1 0
0 0
[Libvirt-ci] Build failed in Jenkins: libvirt-perl-check » libvirt-freebsd-12 #236
by ci@centos.org 12 Feb '19

12 Feb '19
See <https://ci.centos.org/job/libvirt-perl-check/systems=libvirt-freebsd-12/236…> ------------------------------------------ Started by upstream project "libvirt-perl-check" build number 236 originally caused by: Started by upstream project "libvirt-perl-build" build number 236 originally caused by: Started by upstream project "libvirt-build" build number 295 originally caused by: Started by an SCM change Started by an SCM change Started by an SCM change Started by an SCM change [EnvInject] - Loading node environment variables. Building remotely on libvirt-freebsd-12 (libvirt) in workspace <https://ci.centos.org/job/libvirt-perl-check/systems=libvirt-freebsd-12/ws/> [libvirt-perl] $ /bin/sh -xe /tmp/jenkins5491318554996449556.sh + export 'TEST_MAINTAINER=1' + perl Build test t/005-pod.t ............ ok t/010-pod-coverage.t ... ok t/015-changes.t ........ ok t/020-constants.t ...... ok # Failed test 'VIR_DOMAIN_MIGRATE_MAX_SPEED_POSTCOPY' # at t/030-api-coverage.t line 175. # Failed test 'VIR_MIGRATE_PARAM_BANDWIDTH_POSTCOPY' # at t/030-api-coverage.t line 219. # Looks like you failed 2 tests of 1650. t/030-api-coverage.t ... Dubious, test returned 2 (wstat 512, 0x200) Failed 2/1650 subtests t/100-connect.t ........ ok t/200-domains.t ........ ok t/300-networks.t ....... ok t/400-storage-pools.t .. ok t/500-storage-vols.t ... ok t/600-interfaces.t ..... ok t/800-events.t ......... ok Test Summary Report ------------------- t/030-api-coverage.t (Wstat: 512 Tests: 1650 Failed: 2) Failed tests: 866, 1575 Non-zero exit status: 2 Files=12, Tests=1904, 48 wallclock secs ( 0.97 usr 0.34 sys + 17.75 cusr 1.91 csys = 20.97 CPU) Result: FAIL Failed 1/12 test programs. 2/1904 subtests failed. Build step 'Execute shell' marked build as failure
1 8
0 0
[Libvirt-ci] Build failed in Jenkins: libvirt-perl-check » libvirt-fedora-rawhide #236
by ci@centos.org 12 Feb '19

12 Feb '19
See <https://ci.centos.org/job/libvirt-perl-check/systems=libvirt-fedora-rawhide…> ------------------------------------------ Started by upstream project "libvirt-perl-check" build number 236 originally caused by: Started by upstream project "libvirt-perl-build" build number 236 originally caused by: Started by upstream project "libvirt-build" build number 295 originally caused by: Started by an SCM change Started by an SCM change Started by an SCM change Started by an SCM change [EnvInject] - Loading node environment variables. Building remotely on libvirt-fedora-rawhide (libvirt) in workspace <https://ci.centos.org/job/libvirt-perl-check/systems=libvirt-fedora-rawhide…> [libvirt-perl] $ /bin/sh -xe /tmp/jenkins4050725373873540698.sh + export TEST_MAINTAINER=1 + TEST_MAINTAINER=1 + perl Build test t/005-pod.t ............ ok t/010-pod-coverage.t ... ok t/015-changes.t ........ ok t/020-constants.t ...... ok # Failed test 'VIR_DOMAIN_MIGRATE_MAX_SPEED_POSTCOPY' # at t/030-api-coverage.t line 175. # Failed test 'VIR_MIGRATE_PARAM_BANDWIDTH_POSTCOPY' # at t/030-api-coverage.t line 219. # Looks like you failed 2 tests of 1650. t/030-api-coverage.t ... Dubious, test returned 2 (wstat 512, 0x200) Failed 2/1650 subtests t/100-connect.t ........ ok t/200-domains.t ........ ok t/300-networks.t ....... ok t/400-storage-pools.t .. ok t/500-storage-vols.t ... ok t/600-interfaces.t ..... ok t/800-events.t ......... ok Test Summary Report ------------------- t/030-api-coverage.t (Wstat: 512 Tests: 1650 Failed: 2) Failed tests: 866, 1575 Non-zero exit status: 2 Files=12, Tests=1904, 85 wallclock secs ( 0.60 usr 0.14 sys + 10.41 cusr 2.34 csys = 13.49 CPU) Result: FAIL Failed 1/12 test programs. 2/1904 subtests failed. Build step 'Execute shell' marked build as failure
1 8
0 0
[Libvirt-ci] Build failed in Jenkins: libvirt-perl-check » libvirt-freebsd-11 #236
by ci@centos.org 12 Feb '19

12 Feb '19
See <https://ci.centos.org/job/libvirt-perl-check/systems=libvirt-freebsd-11/236…> ------------------------------------------ Started by upstream project "libvirt-perl-check" build number 236 originally caused by: Started by upstream project "libvirt-perl-build" build number 236 originally caused by: Started by upstream project "libvirt-build" build number 295 originally caused by: Started by an SCM change Started by an SCM change Started by an SCM change Started by an SCM change [EnvInject] - Loading node environment variables. Building remotely on libvirt-freebsd-11 (libvirt) in workspace <https://ci.centos.org/job/libvirt-perl-check/systems=libvirt-freebsd-11/ws/> [libvirt-perl] $ /bin/sh -xe /tmp/jenkins3603046615694462153.sh + export 'TEST_MAINTAINER=1' + perl Build test t/005-pod.t ............ ok t/010-pod-coverage.t ... ok t/015-changes.t ........ ok t/020-constants.t ...... ok # Failed test 'VIR_DOMAIN_MIGRATE_MAX_SPEED_POSTCOPY' # at t/030-api-coverage.t line 175. # Failed test 'VIR_MIGRATE_PARAM_BANDWIDTH_POSTCOPY' # at t/030-api-coverage.t line 219. # Looks like you failed 2 tests of 1650. t/030-api-coverage.t ... Dubious, test returned 2 (wstat 512, 0x200) Failed 2/1650 subtests t/100-connect.t ........ ok t/200-domains.t ........ ok t/300-networks.t ....... ok t/400-storage-pools.t .. ok t/500-storage-vols.t ... ok t/600-interfaces.t ..... ok t/800-events.t ......... ok Test Summary Report ------------------- t/030-api-coverage.t (Wstat: 512 Tests: 1650 Failed: 2) Failed tests: 866, 1575 Non-zero exit status: 2 Files=12, Tests=1904, 58 wallclock secs ( 0.85 usr 0.35 sys + 17.86 cusr 1.71 csys = 20.77 CPU) Result: FAIL Failed 1/12 test programs. 2/1904 subtests failed. Build step 'Execute shell' marked build as failure
1 8
0 0
[Libvirt-ci] Build failed in Jenkins: libvirt-perl-check » libvirt-fedora-28 #236
by ci@centos.org 12 Feb '19

12 Feb '19
See <https://ci.centos.org/job/libvirt-perl-check/systems=libvirt-fedora-28/236/…> ------------------------------------------ Started by upstream project "libvirt-perl-check" build number 236 originally caused by: Started by upstream project "libvirt-perl-build" build number 236 originally caused by: Started by upstream project "libvirt-build" build number 295 originally caused by: Started by an SCM change Started by an SCM change Started by an SCM change Started by an SCM change [EnvInject] - Loading node environment variables. Building remotely on libvirt-fedora-28 (libvirt) in workspace <https://ci.centos.org/job/libvirt-perl-check/systems=libvirt-fedora-28/ws/> [libvirt-perl] $ /bin/sh -xe /tmp/jenkins7467223510292954283.sh + export TEST_MAINTAINER=1 + TEST_MAINTAINER=1 + perl Build test t/005-pod.t ............ ok t/010-pod-coverage.t ... ok t/015-changes.t ........ ok t/020-constants.t ...... ok # Failed test 'VIR_DOMAIN_MIGRATE_MAX_SPEED_POSTCOPY' # at t/030-api-coverage.t line 175. # Failed test 'VIR_MIGRATE_PARAM_BANDWIDTH_POSTCOPY' # at t/030-api-coverage.t line 219. # Looks like you failed 2 tests of 1650. t/030-api-coverage.t ... Dubious, test returned 2 (wstat 512, 0x200) Failed 2/1650 subtests t/100-connect.t ........ ok t/200-domains.t ........ ok t/300-networks.t ....... ok t/400-storage-pools.t .. ok t/500-storage-vols.t ... ok t/600-interfaces.t ..... ok t/800-events.t ......... ok Test Summary Report ------------------- t/030-api-coverage.t (Wstat: 512 Tests: 1650 Failed: 2) Failed tests: 866, 1575 Non-zero exit status: 2 Files=12, Tests=1904, 66 wallclock secs ( 0.45 usr 0.07 sys + 8.81 cusr 0.62 csys = 9.95 CPU) Result: FAIL Failed 1/12 test programs. 2/1904 subtests failed. Build step 'Execute shell' marked build as failure
1 8
0 0
[Libvirt-ci] Build failed in Jenkins: libvirt-perl-check » libvirt-fedora-29 #236
by ci@centos.org 12 Feb '19

12 Feb '19
See <https://ci.centos.org/job/libvirt-perl-check/systems=libvirt-fedora-29/236/…> ------------------------------------------ Started by upstream project "libvirt-perl-check" build number 236 originally caused by: Started by upstream project "libvirt-perl-build" build number 236 originally caused by: Started by upstream project "libvirt-build" build number 295 originally caused by: Started by an SCM change Started by an SCM change Started by an SCM change Started by an SCM change [EnvInject] - Loading node environment variables. Building remotely on libvirt-fedora-29 (libvirt) in workspace <https://ci.centos.org/job/libvirt-perl-check/systems=libvirt-fedora-29/ws/> [libvirt-perl] $ /bin/sh -xe /tmp/jenkins5933787411824540051.sh + export TEST_MAINTAINER=1 + TEST_MAINTAINER=1 + perl Build test t/005-pod.t ............ ok t/010-pod-coverage.t ... ok t/015-changes.t ........ ok t/020-constants.t ...... ok # Failed test 'VIR_DOMAIN_MIGRATE_MAX_SPEED_POSTCOPY' # at t/030-api-coverage.t line 175. # Failed test 'VIR_MIGRATE_PARAM_BANDWIDTH_POSTCOPY' # at t/030-api-coverage.t line 219. # Looks like you failed 2 tests of 1650. t/030-api-coverage.t ... Dubious, test returned 2 (wstat 512, 0x200) Failed 2/1650 subtests t/100-connect.t ........ ok t/200-domains.t ........ ok t/300-networks.t ....... ok t/400-storage-pools.t .. ok t/500-storage-vols.t ... ok t/600-interfaces.t ..... ok t/800-events.t ......... ok Test Summary Report ------------------- t/030-api-coverage.t (Wstat: 512 Tests: 1650 Failed: 2) Failed tests: 866, 1575 Non-zero exit status: 2 Files=12, Tests=1904, 56 wallclock secs ( 0.52 usr 0.07 sys + 8.89 cusr 0.55 csys = 10.03 CPU) Result: FAIL Failed 1/12 test programs. 2/1904 subtests failed. Build step 'Execute shell' marked build as failure
1 8
0 0
[Libvirt-ci] Build failed in Jenkins: libvirt-perl-check » libvirt-debian-8 #236
by ci@centos.org 12 Feb '19

12 Feb '19
See <https://ci.centos.org/job/libvirt-perl-check/systems=libvirt-debian-8/236/d…> ------------------------------------------ Started by upstream project "libvirt-perl-check" build number 236 originally caused by: Started by upstream project "libvirt-perl-build" build number 236 originally caused by: Started by upstream project "libvirt-build" build number 295 originally caused by: Started by an SCM change Started by an SCM change Started by an SCM change Started by an SCM change [EnvInject] - Loading node environment variables. Building remotely on libvirt-debian-8 (libvirt) in workspace <https://ci.centos.org/job/libvirt-perl-check/systems=libvirt-debian-8/ws/> [libvirt-perl] $ /bin/sh -xe /tmp/jenkins4978077537223621369.sh + export TEST_MAINTAINER=1 + perl Build test t/005-pod.t ............ ok t/010-pod-coverage.t ... ok t/015-changes.t ........ ok t/020-constants.t ...... ok # Failed test 'VIR_DOMAIN_MIGRATE_MAX_SPEED_POSTCOPY' # at t/030-api-coverage.t line 175. # Failed test 'VIR_MIGRATE_PARAM_BANDWIDTH_POSTCOPY' # at t/030-api-coverage.t line 219. # Looks like you failed 2 tests of 1650. t/030-api-coverage.t ... Dubious, test returned 2 (wstat 512, 0x200) Failed 2/1650 subtests t/100-connect.t ........ ok t/200-domains.t ........ ok t/300-networks.t ....... ok t/400-storage-pools.t .. ok t/500-storage-vols.t ... ok t/600-interfaces.t ..... ok t/800-events.t ......... ok Test Summary Report ------------------- t/030-api-coverage.t (Wstat: 512 Tests: 1650 Failed: 2) Failed tests: 866, 1575 Non-zero exit status: 2 Files=12, Tests=1904, 26 wallclock secs ( 0.84 usr 0.14 sys + 13.33 cusr 0.60 csys = 14.91 CPU) Result: FAIL Failed 1/12 test programs. 2/1904 subtests failed. Build step 'Execute shell' marked build as failure
1 8
0 0
[Libvirt-ci] Build failed in Jenkins: libvirt-perl-check » libvirt-debian-9 #236
by ci@centos.org 12 Feb '19

12 Feb '19
See <https://ci.centos.org/job/libvirt-perl-check/systems=libvirt-debian-9/236/d…> ------------------------------------------ Started by upstream project "libvirt-perl-check" build number 236 originally caused by: Started by upstream project "libvirt-perl-build" build number 236 originally caused by: Started by upstream project "libvirt-build" build number 295 originally caused by: Started by an SCM change Started by an SCM change Started by an SCM change Started by an SCM change [EnvInject] - Loading node environment variables. Building remotely on libvirt-debian-9 (libvirt) in workspace <https://ci.centos.org/job/libvirt-perl-check/systems=libvirt-debian-9/ws/> [libvirt-perl] $ /bin/sh -xe /tmp/jenkins6890156633816017385.sh + export TEST_MAINTAINER=1 + perl Build test t/005-pod.t ............ ok t/010-pod-coverage.t ... ok t/015-changes.t ........ ok t/020-constants.t ...... ok # Failed test 'VIR_DOMAIN_MIGRATE_MAX_SPEED_POSTCOPY' # at t/030-api-coverage.t line 175. # Failed test 'VIR_MIGRATE_PARAM_BANDWIDTH_POSTCOPY' # at t/030-api-coverage.t line 219. # Looks like you failed 2 tests of 1650. t/030-api-coverage.t ... Dubious, test returned 2 (wstat 512, 0x200) Failed 2/1650 subtests t/100-connect.t ........ ok t/200-domains.t ........ ok t/300-networks.t ....... ok t/400-storage-pools.t .. ok t/500-storage-vols.t ... ok t/600-interfaces.t ..... ok t/800-events.t ......... ok Test Summary Report ------------------- t/030-api-coverage.t (Wstat: 512 Tests: 1650 Failed: 2) Failed tests: 866, 1575 Non-zero exit status: 2 Files=12, Tests=1904, 57 wallclock secs ( 0.83 usr 0.17 sys + 13.14 cusr 0.73 csys = 14.87 CPU) Result: FAIL Failed 1/12 test programs. 2/1904 subtests failed. Build step 'Execute shell' marked build as failure
1 8
0 0
[Libvirt-ci] Build failed in Jenkins: libvirt-perl-check » libvirt-centos-7 #236
by ci@centos.org 12 Feb '19

12 Feb '19
See <https://ci.centos.org/job/libvirt-perl-check/systems=libvirt-centos-7/236/d…> ------------------------------------------ Started by upstream project "libvirt-perl-check" build number 236 originally caused by: Started by upstream project "libvirt-perl-build" build number 236 originally caused by: Started by upstream project "libvirt-build" build number 295 originally caused by: Started by an SCM change Started by an SCM change Started by an SCM change Started by an SCM change [EnvInject] - Loading node environment variables. Building remotely on libvirt-centos-7 (libvirt) in workspace <https://ci.centos.org/job/libvirt-perl-check/systems=libvirt-centos-7/ws/> [libvirt-perl] $ /bin/sh -xe /tmp/jenkins2408954540150227134.sh + export TEST_MAINTAINER=1 + TEST_MAINTAINER=1 + perl Build test t/005-pod.t ............ ok t/010-pod-coverage.t ... ok t/015-changes.t ........ ok t/020-constants.t ...... ok # Failed test 'VIR_DOMAIN_MIGRATE_MAX_SPEED_POSTCOPY' # at t/030-api-coverage.t line 175. # Failed test 'VIR_MIGRATE_PARAM_BANDWIDTH_POSTCOPY' # at t/030-api-coverage.t line 219. # Looks like you failed 2 tests of 1650. t/030-api-coverage.t ... Dubious, test returned 2 (wstat 512, 0x200) Failed 2/1650 subtests t/100-connect.t ........ ok t/200-domains.t ........ ok t/300-networks.t ....... ok t/400-storage-pools.t .. ok t/500-storage-vols.t ... ok t/600-interfaces.t ..... ok t/800-events.t ......... ok Test Summary Report ------------------- t/030-api-coverage.t (Wstat: 512 Tests: 1650 Failed: 2) Failed tests: 866, 1575 Non-zero exit status: 2 Files=12, Tests=1904, 54 wallclock secs ( 0.42 usr 0.05 sys + 8.32 cusr 0.44 csys = 9.23 CPU) Result: FAIL Failed 1/12 test programs. 2/1904 subtests failed. Build step 'Execute shell' marked build as failure
1 8
0 0
[Libvirt-ci] Build failed in Jenkins: libvirt-dbus-check » libvirt-fedora-29 #190
by ci@centos.org 12 Feb '19

12 Feb '19
See <https://ci.centos.org/job/libvirt-dbus-check/systems=libvirt-fedora-29/190/…> ------------------------------------------ [...truncated 5.21 KB...] # FAIL: 2 # XPASS: 0 # ERROR: 0 ============================================================================ See tests/test-suite.log Please report to libvir-list(a)redhat.com ============================================================================ gmake[3]: *** [Makefile:766: test-suite.log] Error 1 gmake[3]: Leaving directory '<https://ci.centos.org/job/libvirt-dbus-check/systems=libvirt-fedora-29/ws/b…'> gmake[2]: *** [Makefile:874: check-TESTS] Error 2 gmake[2]: Leaving directory '<https://ci.centos.org/job/libvirt-dbus-check/systems=libvirt-fedora-29/ws/b…'> gmake[1]: *** [Makefile:990: check-am] Error 2 gmake[1]: Leaving directory '<https://ci.centos.org/job/libvirt-dbus-check/systems=libvirt-fedora-29/ws/b…'> gmake: *** [Makefile:460: check-recursive] Error 1 + cat tests/test-suite.log ============================================== libvirt-dbus 1.4.0: tests/test-suite.log ============================================== # TOTAL: 7 # PASS: 5 # SKIP: 0 # XFAIL: 0 # FAIL: 2 # XPASS: 0 # ERROR: 0 .. contents:: :depth: 2 FAIL: test_connect.py ===================== ============================= test session starts ============================== platform linux -- Python 3.7.2, pytest-3.6.4, py-1.5.4, pluggy-0.6.0 rootdir: <https://ci.centos.org/job/libvirt-dbus-check/systems=libvirt-fedora-29/ws/,> inifile: collected 35 items ../../tests/test_connect.py ..........E....E..................E [100%] ==================================== ERRORS ==================================== ERROR at setup of TestConnect.test_connect_properties_return_type[Secure-Boolean] self = <test_connect.TestConnect object at 0x7f56ffffb470> request = <SubRequest 'libvirt_dbus_setup' for <Function 'test_connect_properties_return_type[Secure-Boolean]'>> @pytest.fixture(autouse=True) def libvirt_dbus_setup(self, request): """Start libvirt-dbus for each test function """ os.environ['LIBVIRT_DEBUG'] = '3' self.libvirt_dbus = subprocess.Popen([exe, '--session']) self.bus = dbus.SessionBus() for i in range(10): if self.bus.name_has_owner('org.libvirt'): break time.sleep(0.1) else: > raise TimeoutError('error starting libvirt-dbus') E TimeoutError: error starting libvirt-dbus ../../tests/libvirttest.py:44: TimeoutError ERROR at setup of TestConnect.test_connect_interface_lookup_by_property[InterfaceLookupByMAC-MAC] self = <test_connect.TestConnect object at 0x7f56fffb4c18> @pytest.fixture def interface_create(self): """ Fixture to define dummy interface on the test driver This fixture should be used in the setup of every test manipulating with interfaces. """ path = self.connect.InterfaceDefineXML(xmldata.minimal_interface_xml, 0) obj = self.bus.get_object('org.libvirt', path) interface_obj = dbus.Interface(obj, 'org.libvirt.Interface') > interface_obj.Create(0) ../../tests/libvirttest.py:84: _ _ _ _ _ _ _ _ _ _ _ _ _ _ _ _ _ _ _ _ _ _ _ _ _ _ _ _ _ _ _ _ _ _ _ _ _ _ _ _ /usr/lib64/python3.7/site-packages/dbus/proxies.py:70: in __call__ return self._proxy_method(*args, **keywords) /usr/lib64/python3.7/site-packages/dbus/proxies.py:145: in __call__ **keywords) _ _ _ _ _ _ _ _ _ _ _ _ _ _ _ _ _ _ _ _ _ _ _ _ _ _ _ _ _ _ _ _ _ _ _ _ _ _ _ _ self = <dbus._dbus.SessionBus (session) at 0x7f56ffff7728> bus_name = dbus.String(':1.11') object_path = dbus.ObjectPath('/org/libvirt/Test/interface/11_3a22_3a33_3a44_3a55_3a66') dbus_interface = 'org.libvirt.Interface', method = 'Create', signature = 'u' args = (0,), timeout = -1.0, byte_arrays = False, kwargs = {} get_args_opts = {'byte_arrays': False} message = <dbus.lowlevel.MethodCallMessage path: /org/libvirt/Test/interface/11_3a22_3a33_3a44_3a55_3a66, iface: org.libvirt.Interface, member: Create dest: :1.11> def call_blocking(self, bus_name, object_path, dbus_interface, method, signature, args, timeout=-1.0, byte_arrays=False, **kwargs): """Call the given method, synchronously. :Since: 0.81.0 """ if object_path == LOCAL_PATH: raise DBusException('Methods may not be called on the reserved ' 'path %s' % LOCAL_PATH) if dbus_interface == LOCAL_IFACE: raise DBusException('Methods may not be called on the reserved ' 'interface %s' % LOCAL_IFACE) # no need to validate other args - MethodCallMessage ctor will do get_args_opts = dict(byte_arrays=byte_arrays) if is_py2: get_args_opts['utf8_strings'] = kwargs.get('utf8_strings', False) elif 'utf8_strings' in kwargs: raise TypeError("unexpected keyword argument 'utf8_strings'") message = MethodCallMessage(destination=bus_name, path=object_path, interface=dbus_interface, method=method) # Add the arguments to the function try: message.append(signature=signature, *args) except Exception as e: logging.basicConfig() _logger.error('Unable to set arguments %r according to ' 'signature %r: %s: %s', args, signature, e.__class__, e) raise # make a blocking call reply_message = self.send_message_with_reply_and_block( > message, timeout) E dbus.exceptions.DBusException: org.libvirt.Error: Requested operation is not valid /usr/lib64/python3.7/site-packages/dbus/connection.py:651: DBusException ERROR at setup of TestConnect.test_connect_storage_vol_lookup_by_property[StorageVolLookupByPath-Path] self = <test_connect.TestConnect object at 0x7f56fff28898> @pytest.fixture def storage_volume_create(self): """ Fixture to create dummy storage volume on the test driver This fixture should be used in the setup of every test manipulating with test volume. """ _, test_storage_pool = self.get_test_storage_pool() interface_obj = dbus.Interface(test_storage_pool, 'org.libvirt.StoragePool') > path = interface_obj.StorageVolCreateXML(xmldata.minimal_storage_vol_xml, 0) ../../tests/libvirttest.py:122: _ _ _ _ _ _ _ _ _ _ _ _ _ _ _ _ _ _ _ _ _ _ _ _ _ _ _ _ _ _ _ _ _ _ _ _ _ _ _ _ /usr/lib64/python3.7/site-packages/dbus/proxies.py:70: in __call__ return self._proxy_method(*args, **keywords) /usr/lib64/python3.7/site-packages/dbus/proxies.py:145: in __call__ **keywords) _ _ _ _ _ _ _ _ _ _ _ _ _ _ _ _ _ _ _ _ _ _ _ _ _ _ _ _ _ _ _ _ _ _ _ _ _ _ _ _ self = <dbus._dbus.SessionBus (session) at 0x7f56ffff7728> bus_name = dbus.String(':1.11') object_path = dbus.ObjectPath('/org/libvirt/Test/storagepool/_dfe224cb_28fb_8dd0_c4b2_64eb3f0f4566') dbus_interface = 'org.libvirt.StoragePool', method = 'StorageVolCreateXML' signature = 'su' args = ('\n<volume>\n <name>sparse.img</name>\n <capacity unit="G">2</capacity>\n <target>\n <path>/var/lib/virt/images/sparse.img</path>\n </target>\n</volume>\n', 0) timeout = -1.0, byte_arrays = False, kwargs = {} get_args_opts = {'byte_arrays': False} message = <dbus.lowlevel.MethodCallMessage path: /org/libvirt/Test/storagepool/_dfe224cb_28fb_8dd0_c4b2_64eb3f0f4566, iface: org.libvirt.StoragePool, member: StorageVolCreateXML dest: :1.11> def call_blocking(self, bus_name, object_path, dbus_interface, method, signature, args, timeout=-1.0, byte_arrays=False, **kwargs): """Call the given method, synchronously. :Since: 0.81.0 """ if object_path == LOCAL_PATH: raise DBusException('Methods may not be called on the reserved ' 'path %s' % LOCAL_PATH) if dbus_interface == LOCAL_IFACE: raise DBusException('Methods may not be called on the reserved ' 'interface %s' % LOCAL_IFACE) # no need to validate other args - MethodCallMessage ctor will do get_args_opts = dict(byte_arrays=byte_arrays) if is_py2: get_args_opts['utf8_strings'] = kwargs.get('utf8_strings', False) elif 'utf8_strings' in kwargs: raise TypeError("unexpected keyword argument 'utf8_strings'") message = MethodCallMessage(destination=bus_name, path=object_path, interface=dbus_interface, method=method) # Add the arguments to the function try: message.append(signature=signature, *args) except Exception as e: logging.basicConfig() _logger.error('Unable to set arguments %r according to ' 'signature %r: %s: %s', args, signature, e.__class__, e) raise # make a blocking call reply_message = self.send_message_with_reply_and_block( > message, timeout) E dbus.exceptions.DBusException: org.libvirt.Error: operation failed: storage vol already exists /usr/lib64/python3.7/site-packages/dbus/connection.py:651: DBusException ===================== 32 passed, 3 error in 15.66 seconds ====================== FAIL test_connect.py (exit status: 1) FAIL: test_domain.py ==================== ============================= test session starts ============================== platform linux -- Python 3.7.2, pytest-3.6.4, py-1.5.4, pluggy-0.6.0 rootdir: <https://ci.centos.org/job/libvirt-dbus-check/systems=libvirt-fedora-29/ws/,> inifile: collected 10 items ../../tests/test_domain.py .........E [100%] ==================================== ERRORS ==================================== ____________ ERROR at setup of TestDomain.test_domain_vcpu_pin_info ____________ self = <test_domain.TestDomain object at 0x7f7cdd5400f0> request = <SubRequest 'libvirt_dbus_setup' for <Function 'test_domain_vcpu_pin_info'>> @pytest.fixture(autouse=True) def libvirt_dbus_setup(self, request): """Start libvirt-dbus for each test function """ os.environ['LIBVIRT_DEBUG'] = '3' self.libvirt_dbus = subprocess.Popen([exe, '--session']) self.bus = dbus.SessionBus() for i in range(10): if self.bus.name_has_owner('org.libvirt'): break time.sleep(0.1) else: > raise TimeoutError('error starting libvirt-dbus') E TimeoutError: error starting libvirt-dbus ../../tests/libvirttest.py:44: TimeoutError ====================== 9 passed, 1 error in 9.76 seconds ======================= FAIL test_domain.py (exit status: 1) + exit 1 Build step 'Execute shell' marked build as failure
1 1
0 0
  • ← Newer
  • 1
  • ...
  • 4
  • 5
  • 6
  • 7
  • 8
  • 9
  • 10
  • ...
  • 14
  • Older →

HyperKitty Powered by HyperKitty version 1.3.12.